{
  "_embedded": {
    "items": [
      {
        "id": 5,
        "description": "string",
        "name": "string",
        "ip_address": "string",
        "radius_secret": "string",
        "tacacs_secret": "string",
        "vendor_name": "string",
        "coa_capable": false,
        "coa_port": 2,
        "radsec_enabled": false,
        "snmp_read": {
          "force_read": false,
          "read_arp_info": true,
          "zone_name": "string",
          "snmp_version": "V2C",
          "community_string": "string",
          "security_level": "NOAUTH_NOPRIV",
          "user": "string",
          "auth_protocol": "SHA",
          "auth_key": "string",
          "privacy_protocol": "DES_CBC",
          "privacy_key": "string"
        },
        "snmp_write": {
          "default_vlan": 5,
          "snmp_version": "V1",
          "community_string": "string",
          "security_level": "AUTH_PRIV",
          "user": "string",
          "auth_protocol": "SHA",
          "auth_key": "string",
          "privacy_protocol": "AES_128",
          "privacy_key": "string"
        },
        "cli_config": {
          "type": "Telnet",
          "port": 9,
          "username": "string",
          "password": "string",
          "username_prompt_regex": "string",
          "password_prompt_regex": "string",
          "command_prompt_regex": "string",
          "enable_prompt_regex": "string",
          "enable_password": "string"
        },
        "onConnect_enforcement": {
          "enabled": false,
          "ports": "string"
        },
        "attributes": {}
      },
      {
        "id": 3,
        "description": "string",
        "name": "string",
        "ip_address": "string",
        "radius_secret": "string",
        "tacacs_secret": "string",
        "vendor_name": "string",
        "coa_capable": false,
        "coa_port": 6,
        "radsec_enabled": false,
        "snmp_read": {
          "force_read": false,
          "read_arp_info": true,
          "zone_name": "string",
          "snmp_version": "V1",
          "community_string": "string",
          "security_level": "NOAUTH_NOPRIV",
          "user": "string",
          "auth_protocol": "SHA",
          "auth_key": "string",
          "privacy_protocol": "AES_128",
          "privacy_key": "string"
        },
        "snmp_write": {
          "default_vlan": 3,
          "snmp_version": "V2C",
          "community_string": "string",
          "security_level": "AUTH_PRIV",
          "user": "string",
          "auth_protocol": "SHA",
          "auth_key": "string",
          "privacy_protocol": "AES_128",
          "privacy_key": "string"
        },
        "cli_config": {
          "type": "Telnet",
          "port": 5,
          "username": "string",
          "password": "string",
          "username_prompt_regex": "string",
          "password_prompt_regex": "string",
          "command_prompt_regex": "string",
          "enable_prompt_regex": "string",
          "enable_password": "string"
        },
        "onConnect_enforcement": {
          "enabled": true,
          "ports": "string"
        },
        "attributes": {}
      },
      {
        "id": 4,
        "description": "string",
        "name": "string",
        "ip_address": "string",
        "radius_secret": "string",
        "tacacs_secret": "string",
        "vendor_name": "string",
        "coa_capable": false,
        "coa_port": 5,
        "radsec_enabled": false,
        "snmp_read": {
          "force_read": true,
          "read_arp_info": false,
          "zone_name": "string",
          "snmp_version": "V1",
          "community_string": "string",
          "security_level": "AUTH_NOPRIV",
          "user": "string",
          "auth_protocol": "MD5",
          "auth_key": "string",
          "privacy_protocol": "AES_128",
          "privacy_key": "string"
        },
        "snmp_write": {
          "default_vlan": 10,
          "snmp_version": "V2C",
          "community_string": "string",
          "security_level": "AUTH_NOPRIV",
          "user": "string",
          "auth_protocol": "SHA",
          "auth_key": "string",
          "privacy_protocol": "AES_128",
          "privacy_key": "string"
        },
        "cli_config": {
          "type": "SSH",
          "port": 3,
          "username": "string",
          "password": "string",
          "username_prompt_regex": "string",
          "password_prompt_regex": "string",
          "command_prompt_regex": "string",
          "enable_prompt_regex": "string",
          "enable_password": "string"
        },
        "onConnect_enforcement": {
          "enabled": false,
          "ports": "string"
        },
        "attributes": {}
      },
      {
        "id": 5,
        "description": "string",
        "name": "string",
        "ip_address": "string",
        "radius_secret": "string",
        "tacacs_secret": "string",
        "vendor_name": "string",
        "coa_capable": false,
        "coa_port": 8,
        "radsec_enabled": true,
        "snmp_read": {
          "force_read": false,
          "read_arp_info": true,
          "zone_name": "string",
          "snmp_version": "V2C",
          "community_string": "string",
          "security_level": "AUTH_NOPRIV",
          "user": "string",
          "auth_protocol": "MD5",
          "auth_key": "string",
          "privacy_protocol": "DES_CBC",
          "privacy_key": "string"
        },
        "snmp_write": {
          "default_vlan": 6,
          "snmp_version": "V2C",
          "community_string": "string",
          "security_level": "AUTH_PRIV",
          "user": "string",
          "auth_protocol": "MD5",
          "auth_key": "string",
          "privacy_protocol": "DES_CBC",
          "privacy_key": "string"
        },
        "cli_config": {
          "type": "Telnet",
          "port": 6,
          "username": "string",
          "password": "string",
          "username_prompt_regex": "string",
          "password_prompt_regex": "string",
          "command_prompt_regex": "string",
          "enable_prompt_regex": "string",
          "enable_password": "string"
        },
        "onConnect_enforcement": {
          "enabled": true,
          "ports": "string"
        },
        "attributes": {}
      },
      {
        "id": 10,
        "description": "string",
        "name": "string",
        "ip_address": "string",
        "radius_secret": "string",
        "tacacs_secret": "string",
        "vendor_name": "string",
        "coa_capable": false,
        "coa_port": 3,
        "radsec_enabled": false,
        "snmp_read": {
          "force_read": true,
          "read_arp_info": false,
          "zone_name": "string",
          "snmp_version": "V1",
          "community_string": "string",
          "security_level": "AUTH_PRIV",
          "user": "string",
          "auth_protocol": "SHA",
          "auth_key": "string",
          "privacy_protocol": "AES_128",
          "privacy_key": "string"
        },
        "snmp_write": {
          "default_vlan": 5,
          "snmp_version": "V2C",
          "community_string": "string",
          "security_level": "AUTH_NOPRIV",
          "user": "string",
          "auth_protocol": "MD5",
          "auth_key": "string",
          "privacy_protocol": "AES_128",
          "privacy_key": "string"
        },
        "cli_config": {
          "type": "Telnet",
          "port": 4,
          "username": "string",
          "password": "string",
          "username_prompt_regex": "string",
          "password_prompt_regex": "string",
          "command_prompt_regex": "string",
          "enable_prompt_regex": "string",
          "enable_password": "string"
        },
        "onConnect_enforcement": {
          "enabled": true,
          "ports": "string"
        },
        "attributes": {}
      },
      {
        "id": 1,
        "description": "string",
        "name": "string",
        "ip_address": "string",
        "radius_secret": "string",
        "tacacs_secret": "string",
        "vendor_name": "string",
        "coa_capable": false,
        "coa_port": 2,
        "radsec_enabled": true,
        "snmp_read": {
          "force_read": false,
          "read_arp_info": true,
          "zone_name": "string",
          "snmp_version": "V3",
          "community_string": "string",
          "security_level": "AUTH_PRIV",
          "user": "string",
          "auth_protocol": "MD5",
          "auth_key": "string",
          "privacy_protocol": "DES_CBC",
          "privacy_key": "string"
        },
        "snmp_write": {
          "default_vlan": 3,
          "snmp_version": "V2C",
          "community_string": "string",
          "security_level": "AUTH_NOPRIV",
          "user": "string",
          "auth_protocol": "SHA",
          "auth_key": "string",
          "privacy_protocol": "AES_128",
          "privacy_key": "string"
        },
        "cli_config": {
          "type": "Telnet",
          "port": 5,
          "username": "string",
          "password": "string",
          "username_prompt_regex": "string",
          "password_prompt_regex": "string",
          "command_prompt_regex": "string",
          "enable_prompt_regex": "string",
          "enable_password": "string"
        },
        "onConnect_enforcement": {
          "enabled": false,
          "ports": "string"
        },
        "attributes": {}
      },
      {
        "id": 3,
        "description": "string",
        "name": "string",
        "ip_address": "string",
        "radius_secret": "string",
        "tacacs_secret": "string",
        "vendor_name": "string",
        "coa_capable": true,
        "coa_port": 4,
        "radsec_enabled": true,
        "snmp_read": {
          "force_read": false,
          "read_arp_info": true,
          "zone_name": "string",
          "snmp_version": "V1",
          "community_string": "string",
          "security_level": "AUTH_PRIV",
          "user": "string",
          "auth_protocol": "SHA",
          "auth_key": "string",
          "privacy_protocol": "AES_128",
          "privacy_key": "string"
        },
        "snmp_write": {
          "default_vlan": 7,
          "snmp_version": "V2C",
          "community_string": "string",
          "security_level": "NOAUTH_NOPRIV",
          "user": "string",
          "auth_protocol": "SHA",
          "auth_key": "string",
          "privacy_protocol": "DES_CBC",
          "privacy_key": "string"
        },
        "cli_config": {
          "type": "Telnet",
          "port": 3,
          "username": "string",
          "password": "string",
          "username_prompt_regex": "string",
          "password_prompt_regex": "string",
          "command_prompt_regex": "string",
          "enable_prompt_regex": "string",
          "enable_password": "string"
        },
        "onConnect_enforcement": {
          "enabled": false,
          "ports": "string"
        },
        "attributes": {}
      },
      {
        "id": 8,
        "description": "string",
        "name": "string",
        "ip_address": "string",
        "radius_secret": "string",
        "tacacs_secret": "string",
        "vendor_name": "string",
        "coa_capable": true,
        "coa_port": 7,
        "radsec_enabled": false,
        "snmp_read": {
          "force_read": false,
          "read_arp_info": false,
          "zone_name": "string",
          "snmp_version": "V3",
          "community_string": "string",
          "security_level": "AUTH_NOPRIV",
          "user": "string",
          "auth_protocol": "MD5",
          "auth_key": "string",
          "privacy_protocol": "DES_CBC",
          "privacy_key": "string"
        },
        "snmp_write": {
          "default_vlan": 8,
          "snmp_version": "V2C",
          "community_string": "string",
          "security_level": "NOAUTH_NOPRIV",
          "user": "string",
          "auth_protocol": "MD5",
          "auth_key": "string",
          "privacy_protocol": "DES_CBC",
          "privacy_key": "string"
        },
        "cli_config": {
          "type": "SSH",
          "port": 3,
          "username": "string",
          "password": "string",
          "username_prompt_regex": "string",
          "password_prompt_regex": "string",
          "command_prompt_regex": "string",
          "enable_prompt_regex": "string",
          "enable_password": "string"
        },
        "onConnect_enforcement": {
          "enabled": true,
          "ports": "string"
        },
        "attributes": {}
      },
      {
        "id": 5,
        "description": "string",
        "name": "string",
        "ip_address": "string",
        "radius_secret": "string",
        "tacacs_secret": "string",
        "vendor_name": "string",
        "coa_capable": false,
        "coa_port": 5,
        "radsec_enabled": false,
        "snmp_read": {
          "force_read": true,
          "read_arp_info": false,
          "zone_name": "string",
          "snmp_version": "V2C",
          "community_string": "string",
          "security_level": "AUTH_NOPRIV",
          "user": "string",
          "auth_protocol": "SHA",
          "auth_key": "string",
          "privacy_protocol": "DES_CBC",
          "privacy_key": "string"
        },
        "snmp_write": {
          "default_vlan": 6,
          "snmp_version": "V2C",
          "community_string": "string",
          "security_level": "NOAUTH_NOPRIV",
          "user": "string",
          "auth_protocol": "SHA",
          "auth_key": "string",
          "privacy_protocol": "AES_128",
          "privacy_key": "string"
        },
        "cli_config": {
          "type": "Telnet",
          "port": 7,
          "username": "string",
          "password": "string",
          "username_prompt_regex": "string",
          "password_prompt_regex": "string",
          "command_prompt_regex": "string",
          "enable_prompt_regex": "string",
          "enable_password": "string"
        },
        "onConnect_enforcement": {
          "enabled": true,
          "ports": "string"
        },
        "attributes": {}
      },
      {
        "id": 5,
        "description": "string",
        "name": "string",
        "ip_address": "string",
        "radius_secret": "string",
        "tacacs_secret": "string",
        "vendor_name": "string",
        "coa_capable": true,
        "coa_port": 5,
        "radsec_enabled": false,
        "snmp_read": {
          "force_read": true,
          "read_arp_info": true,
          "zone_name": "string",
          "snmp_version": "V3",
          "community_string": "string",
          "security_level": "AUTH_NOPRIV",
          "user": "string",
          "auth_protocol": "SHA",
          "auth_key": "string",
          "privacy_protocol": "AES_128",
          "privacy_key": "string"
        },
        "snmp_write": {
          "default_vlan": 7,
          "snmp_version": "V2C",
          "community_string": "string",
          "security_level": "AUTH_PRIV",
          "user": "string",
          "auth_protocol": "SHA",
          "auth_key": "string",
          "privacy_protocol": "AES_128",
          "privacy_key": "string"
        },
        "cli_config": {
          "type": "Telnet",
          "port": 1,
          "username": "string",
          "password": "string",
          "username_prompt_regex": "string",
          "password_prompt_regex": "string",
          "command_prompt_regex": "string",
          "enable_prompt_regex": "string",
          "enable_password": "string"
        },
        "onConnect_enforcement": {
          "enabled": true,
          "ports": "string"
        },
        "attributes": {}
      }
    ]
  },
  "_links": {
    "self": "string",
    "first": "string",
    "last": "string",
    "prev": "string",
    "next": "string"
  },
  "count": 6
}