{
  "errors": [],
  "statistics": [
    {
      "owner": "errorJson",
      "description": "New adapter errors available for use",
      "value": 0
    },
    {
      "owner": "errorJson",
      "description": "Adapter errors no longer available for use",
      "value": 0
    },
    {
      "owner": "errorJson",
      "description": "Adapter errors that have been updated (e.g. recommendation changes)",
      "value": 30
    },
    {
      "owner": "packageJson",
      "description": "Number of production dependencies",
      "value": 13
    },
    {
      "owner": "packageJson",
      "description": "Number of development dependencies",
      "value": 7
    },
    {
      "owner": "packageJson",
      "description": "Number of npm scripts",
      "value": 23
    },
    {
      "owner": "packageJson",
      "description": "Runtime Library dependency",
      "value": "^4.44.11"
    },
    {
      "owner": "propertiesSchemaJson",
      "description": "Adapter properties defined in the propertiesSchema file",
      "value": 64
    },
    {
      "owner": "readmeMd",
      "description": "Number of lines in the README.md",
      "value": 688
    },
    {
      "owner": "unitTestJS",
      "description": "Number of lines of code in unit tests",
      "value": 3827
    },
    {
      "owner": "unitTestJS",
      "description": "Number of unit tests",
      "value": 221
    },
    {
      "owner": "integrationTestJS",
      "description": "Number of lines of code in integration tests",
      "value": 2961
    },
    {
      "owner": "integrationTestJS",
      "description": "Number of integration tests",
      "value": 78
    },
    {
      "owner": "staticFile",
      "description": "Number of lines of code in adapterBase.js",
      "value": 1029
    },
    {
      "owner": "staticFile",
      "description": "Number of static files added",
      "value": 34
    },
    {
      "owner": "Overall",
      "description": "Total lines of Code",
      "value": 7817
    },
    {
      "owner": "Overall",
      "description": "Total Tests",
      "value": 299
    },
    {
      "owner": "Overall",
      "description": "Total Files",
      "value": 6
    }
  ]
}