{
  "$id": "schema.json",
  "type": "object",
  "schema": "http://json-schema.org/draft-07/schema#",
  "translate": true,
  "dynamicfields": true,
  "properties": {
    "ph_request_type": {
      "type": "string",
      "description": "type of request (internal to adapter)",
      "default": "apiCxConfigGetInterfaces",
      "enum": [
        "apiCxConfigGetInterfaces",
        "apiCxConfigUpdateInterfaces",
        "apiCxConfigGetLag",
        "apiCxConfigCrudLag",
        "apiCxConfigGetLoopPrevention",
        "apiCxConfigUpdateLoopPrevention",
        "apiCxConfigGetProperties",
        "apiCxConfigUpdateProperties",
        "apiCxConfigGetSyslog",
        "apiCxConfigCrudSyslog",
        "apiCxConfigGetVlans",
        "apiCxConfigCrudVlans",
        "apiCxConfigGetAuthentication",
        "apiCxConfigUpdateAuthentication"
      ],
      "external_name": "ph_request_type"
    },
    "deviceSerial": {
      "type": "string",
      "description": "Device serial number.\nMandatory for device level configuration.",
      "parse": false,
      "encode": false,
      "encrypt": {
        "type": "AES",
        "key": ""
      },
      "external_name": "device_serial"
    },
    "groupName": {
      "type": "string",
      "description": "Group name.\nMandatory for group level configuration.",
      "parse": false,
      "encode": false,
      "encrypt": {
        "type": "AES",
        "key": ""
      },
      "external_name": "group_name"
    }
  },
  "definitions": {}
}