{
  "total": 5,
  "subscriptions": [
    {
      "subscription_key": "string",
      "sku": "string",
      "start_date": 5,
      "end_date": 9,
      "quantity": 7,
      "status": "ACTIVE"
    },
    {
      "subscription_key": "string",
      "sku": "string",
      "start_date": 10,
      "end_date": 4,
      "quantity": 3,
      "status": "UNDER_GRACE_PERIOD"
    },
    {
      "subscription_key": "string",
      "sku": "string",
      "start_date": 6,
      "end_date": 1,
      "quantity": 1,
      "status": "EXPIRING_SOON"
    }
  ]
}