[
  {
    "name": "string",
    "pid": "string",
    "config_method": "auto_generate",
    "radio_instance": "external",
    "adv_format": "ibeacon",
    "interval": 4,
    "major_start": 4,
    "major_end": 9,
    "minor_start": 1,
    "minor_end": 1,
    "uuid": "string",
    "payload": "string"
  }
]