{
  "count": 1,
  "neighbor_aps": [
    {
      "containment_status": "Known Interfering",
      "classification": "Neighbor",
      "cust_id": "373ac1f88ba541bda84d23184335fdf0",
      "encryption": "WPA",
      "first_det_device": "CNDRJSSCGK",
      "first_det_device_name": "20:a6:cd:c2:ff:d8",
      "first_seen": "2019-04-09T14:09:34.382Z",
      "group_name": "default",
      "id": "00:24:a8:a5:e3:a0",
      "lan_mac": "00:24:a8:a5:e3:a0",
      "last_det_device": "CNDRJSSCGK",
      "last_det_device_name": "20:a6:cd:c2:ff:d8",
      "last_seen": "2019-04-09T14:14:34.382Z",
      "mac_vendor": "ProCurve Networking by HP",
      "name": "Procurve Net-A5:E3:A1",
      "signal": -75,
      "ssid": "NR_01_HP-425"
    },
    {
      "containment_status": "Known Interfering",
      "classification": "Neighbor",
      "cust_id": "373ac1f88ba541bda84d23184335fdf0",
      "encryption": "WPA",
      "first_det_device": "CNDRJSSCGK",
      "first_det_device_name": "20:a6:cd:c2:ff:d8",
      "first_seen": "2019-04-09T14:09:34.382Z",
      "group_name": "default",
      "id": "00:24:a8:a5:e3:a0",
      "lan_mac": "00:24:a8:a5:e3:a0",
      "last_det_device": "CNDRJSSCGK",
      "last_det_device_name": "20:a6:cd:c2:ff:d8",
      "last_seen": "2019-04-09T14:14:34.382Z",
      "mac_vendor": "ProCurve Networking by HP",
      "name": "Procurve Net-A5:E3:A1",
      "signal": -75,
      "ssid": "NR_01_HP-425"
    },
    {
      "containment_status": "Known Interfering",
      "classification": "Neighbor",
      "cust_id": "373ac1f88ba541bda84d23184335fdf0",
      "encryption": "WPA",
      "first_det_device": "CNDRJSSCGK",
      "first_det_device_name": "20:a6:cd:c2:ff:d8",
      "first_seen": "2019-04-09T14:09:34.382Z",
      "group_name": "default",
      "id": "00:24:a8:a5:e3:a0",
      "lan_mac": "00:24:a8:a5:e3:a0",
      "last_det_device": "CNDRJSSCGK",
      "last_det_device_name": "20:a6:cd:c2:ff:d8",
      "last_seen": "2019-04-09T14:14:34.382Z",
      "mac_vendor": "ProCurve Networking by HP",
      "name": "Procurve Net-A5:E3:A1",
      "signal": -75,
      "ssid": "NR_01_HP-425"
    },
    {
      "containment_status": "Known Interfering",
      "classification": "Neighbor",
      "cust_id": "373ac1f88ba541bda84d23184335fdf0",
      "encryption": "WPA",
      "first_det_device": "CNDRJSSCGK",
      "first_det_device_name": "20:a6:cd:c2:ff:d8",
      "first_seen": "2019-04-09T14:09:34.382Z",
      "group_name": "default",
      "id": "00:24:a8:a5:e3:a0",
      "lan_mac": "00:24:a8:a5:e3:a0",
      "last_det_device": "CNDRJSSCGK",
      "last_det_device_name": "20:a6:cd:c2:ff:d8",
      "last_seen": "2019-04-09T14:14:34.382Z",
      "mac_vendor": "ProCurve Networking by HP",
      "name": "Procurve Net-A5:E3:A1",
      "signal": -75,
      "ssid": "NR_01_HP-425"
    },
    {
      "containment_status": "Known Interfering",
      "classification": "Neighbor",
      "cust_id": "373ac1f88ba541bda84d23184335fdf0",
      "encryption": "WPA",
      "first_det_device": "CNDRJSSCGK",
      "first_det_device_name": "20:a6:cd:c2:ff:d8",
      "first_seen": "2019-04-09T14:09:34.382Z",
      "group_name": "default",
      "id": "00:24:a8:a5:e3:a0",
      "lan_mac": "00:24:a8:a5:e3:a0",
      "last_det_device": "CNDRJSSCGK",
      "last_det_device_name": "20:a6:cd:c2:ff:d8",
      "last_seen": "2019-04-09T14:14:34.382Z",
      "mac_vendor": "ProCurve Networking by HP",
      "name": "Procurve Net-A5:E3:A1",
      "signal": -75,
      "ssid": "NR_01_HP-425"
    },
    {
      "containment_status": "Known Interfering",
      "classification": "Neighbor",
      "cust_id": "373ac1f88ba541bda84d23184335fdf0",
      "encryption": "WPA",
      "first_det_device": "CNDRJSSCGK",
      "first_det_device_name": "20:a6:cd:c2:ff:d8",
      "first_seen": "2019-04-09T14:09:34.382Z",
      "group_name": "default",
      "id": "00:24:a8:a5:e3:a0",
      "lan_mac": "00:24:a8:a5:e3:a0",
      "last_det_device": "CNDRJSSCGK",
      "last_det_device_name": "20:a6:cd:c2:ff:d8",
      "last_seen": "2019-04-09T14:14:34.382Z",
      "mac_vendor": "ProCurve Networking by HP",
      "name": "Procurve Net-A5:E3:A1",
      "signal": -75,
      "ssid": "NR_01_HP-425"
    },
    {
      "containment_status": "Known Interfering",
      "classification": "Neighbor",
      "cust_id": "373ac1f88ba541bda84d23184335fdf0",
      "encryption": "WPA",
      "first_det_device": "CNDRJSSCGK",
      "first_det_device_name": "20:a6:cd:c2:ff:d8",
      "first_seen": "2019-04-09T14:09:34.382Z",
      "group_name": "default",
      "id": "00:24:a8:a5:e3:a0",
      "lan_mac": "00:24:a8:a5:e3:a0",
      "last_det_device": "CNDRJSSCGK",
      "last_det_device_name": "20:a6:cd:c2:ff:d8",
      "last_seen": "2019-04-09T14:14:34.382Z",
      "mac_vendor": "ProCurve Networking by HP",
      "name": "Procurve Net-A5:E3:A1",
      "signal": -75,
      "ssid": "NR_01_HP-425"
    },
    {
      "containment_status": "Known Interfering",
      "classification": "Neighbor",
      "cust_id": "373ac1f88ba541bda84d23184335fdf0",
      "encryption": "WPA",
      "first_det_device": "CNDRJSSCGK",
      "first_det_device_name": "20:a6:cd:c2:ff:d8",
      "first_seen": "2019-04-09T14:09:34.382Z",
      "group_name": "default",
      "id": "00:24:a8:a5:e3:a0",
      "lan_mac": "00:24:a8:a5:e3:a0",
      "last_det_device": "CNDRJSSCGK",
      "last_det_device_name": "20:a6:cd:c2:ff:d8",
      "last_seen": "2019-04-09T14:14:34.382Z",
      "mac_vendor": "ProCurve Networking by HP",
      "name": "Procurve Net-A5:E3:A1",
      "signal": -75,
      "ssid": "NR_01_HP-425"
    }
  ],
  "total": 1
}