{
  "actions": [
    {
      "name": "acpServiceLicenseWebViewsAdminLicenseGetUserSubscriptions",
      "protocol": "REST",
      "method": "GET",
      "entitypath": "{base_path}/{version}/platform/licensing/v1/subscriptions?{query}",
      "requestSchema": "schema.json",
      "responseSchema": "schema.json",
      "timeout": 0,
      "sendEmpty": false,
      "sendGetBody": false,
      "requestDatatype": "JSON",
      "responseDatatype": "JSON",
      "headers": {},
      "responseObjects": [
        {
          "type": "default",
          "key": "",
          "mockFile": "mockdatafiles/acpServiceLicenseWebViewsAdminLicenseGetUserSubscriptions-default.json"
        }
      ]
    },
    {
      "name": "acpServiceLicenseWebViewsAdminLicenseGetSubscriptionStats",
      "protocol": "REST",
      "method": "GET",
      "entitypath": "{base_path}/{version}/platform/licensing/v1/subscriptions/stats?{query}",
      "requestSchema": "schema.json",
      "responseSchema": "schema.json",
      "timeout": 0,
      "sendEmpty": false,
      "sendGetBody": false,
      "requestDatatype": "JSON",
      "responseDatatype": "JSON",
      "headers": {},
      "responseObjects": [
        {
          "type": "default",
          "key": "",
          "mockFile": "mockdatafiles/acpServiceLicenseWebViewsAdminLicenseGetSubscriptionStats-default.json"
        }
      ]
    },
    {
      "name": "acpServiceLicenseWebViewsAdminLicenseApigwAssignLicenses",
      "protocol": "REST",
      "method": "POST",
      "entitypath": "{base_path}/{version}/platform/licensing/v1/subscriptions/assign?{query}",
      "requestSchema": "schema.json",
      "responseSchema": "schema.json",
      "timeout": 0,
      "sendEmpty": false,
      "requestDatatype": "JSON",
      "responseDatatype": "JSON",
      "headers": {},
      "responseObjects": [
        {
          "type": "default",
          "key": "",
          "mockFile": ""
        }
      ]
    },
    {
      "name": "acpServiceLicenseWebViewsAdminLicenseApigwUnassignLicenses",
      "protocol": "REST",
      "method": "POST",
      "entitypath": "{base_path}/{version}/platform/licensing/v1/subscriptions/unassign?{query}",
      "requestSchema": "schema.json",
      "responseSchema": "schema.json",
      "timeout": 0,
      "sendEmpty": false,
      "requestDatatype": "JSON",
      "responseDatatype": "JSON",
      "headers": {},
      "responseObjects": [
        {
          "type": "default",
          "key": "",
          "mockFile": ""
        }
      ]
    },
    {
      "name": "acpServiceLicenseWebViewsAdminLicenseApigwGetCustomerEnabledServices",
      "protocol": "REST",
      "method": "GET",
      "entitypath": "{base_path}/{version}/platform/licensing/v1/services/enabled?{query}",
      "requestSchema": "schema.json",
      "responseSchema": "schema.json",
      "timeout": 0,
      "sendEmpty": false,
      "sendGetBody": false,
      "requestDatatype": "JSON",
      "responseDatatype": "JSON",
      "headers": {},
      "responseObjects": [
        {
          "type": "default",
          "key": "",
          "mockFile": "mockdatafiles/acpServiceLicenseWebViewsAdminLicenseApigwGetCustomerEnabledServices-default.json"
        }
      ]
    },
    {
      "name": "acpServiceLicenseWebViewsAdminLicenseGetServicesConfig",
      "protocol": "REST",
      "method": "GET",
      "entitypath": "{base_path}/{version}/platform/licensing/v1/services/config?{query}",
      "requestSchema": "schema.json",
      "responseSchema": "schema.json",
      "timeout": 0,
      "sendEmpty": false,
      "sendGetBody": false,
      "requestDatatype": "JSON",
      "responseDatatype": "JSON",
      "headers": {},
      "responseObjects": [
        {
          "type": "default",
          "key": "",
          "mockFile": "mockdatafiles/acpServiceLicenseWebViewsAdminLicenseGetServicesConfig-default.json"
        }
      ]
    },
    {
      "name": "acpServiceLicenseWebViewsAdminLicenseAssignSubscriptionAllDevices",
      "protocol": "REST",
      "method": "POST",
      "entitypath": "{base_path}/{version}/platform/licensing/v1/subscriptions/devices/all?{query}",
      "requestSchema": "schema.json",
      "responseSchema": "schema.json",
      "timeout": 0,
      "sendEmpty": false,
      "requestDatatype": "JSON",
      "responseDatatype": "JSON",
      "headers": {},
      "responseObjects": [
        {
          "type": "default",
          "key": "",
          "mockFile": ""
        }
      ]
    },
    {
      "name": "acpServiceLicenseWebViewsAdminLicenseUnassignSubscriptionAllDevices",
      "protocol": "REST",
      "method": "DELETE",
      "entitypath": "{base_path}/{version}/platform/licensing/v1/subscriptions/devices/all?{query}",
      "requestSchema": "schema.json",
      "responseSchema": "schema.json",
      "timeout": 0,
      "sendEmpty": false,
      "requestDatatype": "JSON",
      "responseDatatype": "JSON",
      "headers": {},
      "responseObjects": [
        {
          "type": "default",
          "key": "",
          "mockFile": ""
        }
      ]
    },
    {
      "name": "acpServiceLicenseWebViewsAdminLicenseMspAssignSubscriptionAllDevices",
      "protocol": "REST",
      "method": "POST",
      "entitypath": "{base_path}/{version}/platform/licensing/v1/msp/subscriptions/devices/all?{query}",
      "requestSchema": "schema.json",
      "responseSchema": "schema.json",
      "timeout": 0,
      "sendEmpty": false,
      "requestDatatype": "JSON",
      "responseDatatype": "JSON",
      "headers": {},
      "responseObjects": [
        {
          "type": "default",
          "key": "",
          "mockFile": ""
        }
      ]
    },
    {
      "name": "acpServiceLicenseWebViewsAdminLicenseMspUnassignSubscriptionAllDevices",
      "protocol": "REST",
      "method": "DELETE",
      "entitypath": "{base_path}/{version}/platform/licensing/v1/msp/subscriptions/devices/all?{query}",
      "requestSchema": "schema.json",
      "responseSchema": "schema.json",
      "timeout": 0,
      "sendEmpty": false,
      "requestDatatype": "JSON",
      "responseDatatype": "JSON",
      "headers": {},
      "responseObjects": [
        {
          "type": "default",
          "key": "",
          "mockFile": ""
        }
      ]
    }
  ]
}