{
  "marker": "string",
  "summary": {
    "admin_status": true,
    "router_id": "1.1.1.1",
    "area_count": 1,
    "interface_count": 1,
    "neighbor_count": 1,
    "active_lsa_count": 1,
    "rexmt_lsa_count": 1,
    "num_routes": 10
  },
  "areas": [
    {
      "area_id": "192.168.1.1",
      "area_type": "Normal",
      "interface_count": 1,
      "spf_run_count": 9,
      "default_cost": 1,
      "summary_enable": true
    },
    {
      "area_id": "192.168.1.1",
      "area_type": "NSSA",
      "interface_count": 1,
      "spf_run_count": 9,
      "default_cost": 1,
      "summary_enable": true
    },
    {
      "area_id": "192.168.1.1",
      "area_type": "NSSA",
      "interface_count": 1,
      "spf_run_count": 9,
      "default_cost": 1,
      "summary_enable": true
    },
    {
      "area_id": "192.168.1.1",
      "area_type": "NSSA",
      "interface_count": 1,
      "spf_run_count": 9,
      "default_cost": 1,
      "summary_enable": true
    },
    {
      "area_id": "192.168.1.1",
      "area_type": "Stub",
      "interface_count": 1,
      "spf_run_count": 9,
      "default_cost": 1,
      "summary_enable": true
    },
    {
      "area_id": "192.168.1.1",
      "area_type": "NSSA",
      "interface_count": 1,
      "spf_run_count": 9,
      "default_cost": 1,
      "summary_enable": true
    },
    {
      "area_id": "192.168.1.1",
      "area_type": "Stub",
      "interface_count": 1,
      "spf_run_count": 9,
      "default_cost": 1,
      "summary_enable": true
    }
  ]
}