{
  "node-type": "GLOBAL",
  "node-id": "string",
  "config": {
    "address_pool": [
      {
        "pool_name": "Eng-Pool",
        "pool_type": "DHCP_POOL_TYPE",
        "ip_range": [
          {
            "range_id": "1",
            "start_ip": "4.45.0.1",
            "end_ip": "4.45.0.10",
            "is_conflicting": false
          }
        ],
        "max_clients": 10
      }
    ]
  }
}