{
  "total": 5,
  "devices": [
    {
      "device_type": "MAS",
      "services": [
        "string",
        "string",
        "string",
        "string",
        "string",
        "string",
        "string"
      ],
      "mac": "string",
      "serial": "string",
      "model": "string"
    },
    {
      "device_type": "IAP",
      "services": [
        "string",
        "string",
        "string",
        "string",
        "string",
        "string",
        "string"
      ],
      "mac": "string",
      "serial": "string",
      "model": "string"
    },
    {
      "device_type": "MAS",
      "services": [
        "string",
        "string",
        "string",
        "string",
        "string"
      ],
      "mac": "string",
      "serial": "string",
      "model": "string"
    },
    {
      "device_type": "IAP",
      "services": [
        "string",
        "string",
        "string",
        "string"
      ],
      "mac": "string",
      "serial": "string",
      "model": "string"
    },
    {
      "device_type": "IAP",
      "services": [
        "string",
        "string",
        "string",
        "string",
        "string",
        "string",
        "string",
        "string",
        "string"
      ],
      "mac": "string",
      "serial": "string",
      "model": "string"
    },
    {
      "device_type": "IAP",
      "services": [
        "string",
        "string",
        "string",
        "string",
        "string"
      ],
      "mac": "string",
      "serial": "string",
      "model": "string"
    }
  ]
}