[
  {
    "timestamp": 4,
    "ap_eth_mac": "string",
    "ap_serial": "string",
    "ap_name": "string",
    "ip_addr": "string",
    "ip_addr6": "string",
    "ap_model": "string",
    "ap_uptime": 2,
    "cur_opmode": "string",
    "ap_down": true,
    "ap_remove": false
  },
  {
    "timestamp": 3,
    "ap_eth_mac": "string",
    "ap_serial": "string",
    "ap_name": "string",
    "ip_addr": "string",
    "ip_addr6": "string",
    "ap_model": "string",
    "ap_uptime": 2,
    "cur_opmode": "string",
    "ap_down": true,
    "ap_remove": true
  },
  {
    "timestamp": 3,
    "ap_eth_mac": "string",
    "ap_serial": "string",
    "ap_name": "string",
    "ip_addr": "string",
    "ip_addr6": "string",
    "ap_model": "string",
    "ap_uptime": 3,
    "cur_opmode": "string",
    "ap_down": true,
    "ap_remove": false
  }
]