{
  "auth": {
    "airpassType": "string",
    "apGroup": "string",
    "arubaLocationID": "string",
    "arubaRole": "string",
    "authCategory": "string",
    "authStatus": false,
    "authzStatus": false,
    "carrier": "string",
    "certExpiry": "string",
    "certSerialNum": "string",
    "certSubject": "string",
    "chargeableUserID": "string",
    "clientType": "string",
    "connType": "string",
    "eapType": "string",
    "endpointTags": [
      "string"
    ],
    "errorCategory": "string",
    "errorMessage": "string",
    "errorType": "string",
    "identityStore": "string",
    "isMacRandomized": false,
    "mac": "string",
    "nadIP": "string",
    "nadIdentifier": "string",
    "nadMAC": "string",
    "nadName": "string",
    "nadPort": "string",
    "nadPortType": "string",
    "nadSite": "string",
    "operatorName": "string",
    "policyType": "string",
    "requestID": "string",
    "ssid": "string",
    "status": "string",
    "tenantID": "string",
    "timestamp": "string",
    "userDepartment": "string",
    "userDisplayName": "string",
    "userEmail": "string",
    "userGroups": [
      "string",
      "string",
      "string",
      "string",
      "string",
      "string"
    ],
    "userID": "string"
  },
  "sessions": [
    {
      "duration": 1,
      "inputBytes": 5,
      "ips": [
        "string",
        "string",
        "string",
        "string",
        "string"
      ],
      "isClosed": false,
      "outputBytes": 5,
      "startAt": "string"
    },
    {
      "duration": 1,
      "inputBytes": 9,
      "ips": [
        "string",
        "string",
        "string",
        "string",
        "string",
        "string",
        "string",
        "string",
        "string",
        "string"
      ],
      "isClosed": true,
      "outputBytes": 1,
      "startAt": "string"
    },
    {
      "duration": 9,
      "inputBytes": 6,
      "ips": [
        "string",
        "string",
        "string",
        "string",
        "string",
        "string",
        "string",
        "string"
      ],
      "isClosed": true,
      "outputBytes": 1,
      "startAt": "string"
    },
    {
      "duration": 4,
      "inputBytes": 3,
      "ips": [
        "string",
        "string",
        "string",
        "string",
        "string",
        "string",
        "string",
        "string",
        "string"
      ],
      "isClosed": true,
      "outputBytes": 7,
      "startAt": "string"
    },
    {
      "duration": 1,
      "inputBytes": 8,
      "ips": [
        "string"
      ],
      "isClosed": true,
      "outputBytes": 3,
      "startAt": "string"
    },
    {
      "duration": 3,
      "inputBytes": 3,
      "ips": [
        "string",
        "string",
        "string",
        "string",
        "string",
        "string",
        "string",
        "string",
        "string",
        "string"
      ],
      "isClosed": true,
      "outputBytes": 9,
      "startAt": "string"
    },
    {
      "duration": 4,
      "inputBytes": 9,
      "ips": [
        "string",
        "string",
        "string",
        "string"
      ],
      "isClosed": false,
      "outputBytes": 3,
      "startAt": "string"
    },
    {
      "duration": 2,
      "inputBytes": 4,
      "ips": [
        "string",
        "string",
        "string",
        "string",
        "string",
        "string",
        "string"
      ],
      "isClosed": true,
      "outputBytes": 1,
      "startAt": "string"
    }
  ]
}