[
  {
    "allowed_frequency": [
      [
        "hourly",
        "daily",
        "weekly"
      ],
      [
        "hourly",
        "daily",
        "weekly"
      ],
      [
        "hourly",
        "daily",
        "weekly"
      ],
      [
        "hourly",
        "daily",
        "weekly"
      ]
    ],
    "fields": [
      [
        "time",
        "loyal_visitors",
        "unique_visitors"
      ],
      [
        "time",
        "loyal_visitors",
        "unique_visitors"
      ],
      [
        "time",
        "loyal_visitors",
        "unique_visitors"
      ],
      [
        "time",
        "loyal_visitors",
        "unique_visitors"
      ],
      [
        "time",
        "loyal_visitors",
        "unique_visitors"
      ],
      [
        "time",
        "loyal_visitors",
        "unique_visitors"
      ],
      [
        "time",
        "loyal_visitors",
        "unique_visitors"
      ],
      [
        "time",
        "loyal_visitors",
        "unique_visitors"
      ]
    ],
    "samples": [
      [
        [
          {
            "0": 1590949800000,
            "1": 0,
            "2": 0
          },
          {
            "0": 1590953400000,
            "1": 0,
            "2": 0
          },
          {
            "0": 1590957000000,
            "1": 0,
            "2": 0
          },
          {
            "0": 1590962400000,
            "1": 1,
            "2": 1
          }
        ],
        [
          {
            "0": 1590949800000,
            "1": 0,
            "2": 0
          },
          {
            "0": 1590953400000,
            "1": 0,
            "2": 0
          },
          {
            "0": 1590957000000,
            "1": 0,
            "2": 0
          },
          {
            "0": 1590962400000,
            "1": 1,
            "2": 1
          }
        ]
      ]
    ]
  },
  {
    "allowed_frequency": [
      [
        "hourly",
        "daily",
        "weekly"
      ],
      [
        "hourly",
        "daily",
        "weekly"
      ],
      [
        "hourly",
        "daily",
        "weekly"
      ]
    ],
    "fields": [
      [
        "time",
        "loyal_visitors",
        "unique_visitors"
      ],
      [
        "time",
        "loyal_visitors",
        "unique_visitors"
      ],
      [
        "time",
        "loyal_visitors",
        "unique_visitors"
      ],
      [
        "time",
        "loyal_visitors",
        "unique_visitors"
      ],
      [
        "time",
        "loyal_visitors",
        "unique_visitors"
      ],
      [
        "time",
        "loyal_visitors",
        "unique_visitors"
      ],
      [
        "time",
        "loyal_visitors",
        "unique_visitors"
      ],
      [
        "time",
        "loyal_visitors",
        "unique_visitors"
      ]
    ],
    "samples": [
      [
        [
          {
            "0": 1590949800000,
            "1": 0,
            "2": 0
          },
          {
            "0": 1590953400000,
            "1": 0,
            "2": 0
          },
          {
            "0": 1590957000000,
            "1": 0,
            "2": 0
          },
          {
            "0": 1590962400000,
            "1": 1,
            "2": 1
          }
        ],
        [
          {
            "0": 1590949800000,
            "1": 0,
            "2": 0
          },
          {
            "0": 1590953400000,
            "1": 0,
            "2": 0
          },
          {
            "0": 1590957000000,
            "1": 0,
            "2": 0
          },
          {
            "0": 1590962400000,
            "1": 1,
            "2": 1
          }
        ],
        [
          {
            "0": 1590949800000,
            "1": 0,
            "2": 0
          },
          {
            "0": 1590953400000,
            "1": 0,
            "2": 0
          },
          {
            "0": 1590957000000,
            "1": 0,
            "2": 0
          },
          {
            "0": 1590962400000,
            "1": 1,
            "2": 1
          }
        ]
      ],
      [
        [
          {
            "0": 1590949800000,
            "1": 0,
            "2": 0
          },
          {
            "0": 1590953400000,
            "1": 0,
            "2": 0
          },
          {
            "0": 1590957000000,
            "1": 0,
            "2": 0
          },
          {
            "0": 1590962400000,
            "1": 1,
            "2": 1
          }
        ],
        [
          {
            "0": 1590949800000,
            "1": 0,
            "2": 0
          },
          {
            "0": 1590953400000,
            "1": 0,
            "2": 0
          },
          {
            "0": 1590957000000,
            "1": 0,
            "2": 0
          },
          {
            "0": 1590962400000,
            "1": 1,
            "2": 1
          }
        ],
        [
          {
            "0": 1590949800000,
            "1": 0,
            "2": 0
          },
          {
            "0": 1590953400000,
            "1": 0,
            "2": 0
          },
          {
            "0": 1590957000000,
            "1": 0,
            "2": 0
          },
          {
            "0": 1590962400000,
            "1": 1,
            "2": 1
          }
        ],
        [
          {
            "0": 1590949800000,
            "1": 0,
            "2": 0
          },
          {
            "0": 1590953400000,
            "1": 0,
            "2": 0
          },
          {
            "0": 1590957000000,
            "1": 0,
            "2": 0
          },
          {
            "0": 1590962400000,
            "1": 1,
            "2": 1
          }
        ],
        [
          {
            "0": 1590949800000,
            "1": 0,
            "2": 0
          },
          {
            "0": 1590953400000,
            "1": 0,
            "2": 0
          },
          {
            "0": 1590957000000,
            "1": 0,
            "2": 0
          },
          {
            "0": 1590962400000,
            "1": 1,
            "2": 1
          }
        ],
        [
          {
            "0": 1590949800000,
            "1": 0,
            "2": 0
          },
          {
            "0": 1590953400000,
            "1": 0,
            "2": 0
          },
          {
            "0": 1590957000000,
            "1": 0,
            "2": 0
          },
          {
            "0": 1590962400000,
            "1": 1,
            "2": 1
          }
        ],
        [
          {
            "0": 1590949800000,
            "1": 0,
            "2": 0
          },
          {
            "0": 1590953400000,
            "1": 0,
            "2": 0
          },
          {
            "0": 1590957000000,
            "1": 0,
            "2": 0
          },
          {
            "0": 1590962400000,
            "1": 1,
            "2": 1
          }
        ],
        [
          {
            "0": 1590949800000,
            "1": 0,
            "2": 0
          },
          {
            "0": 1590953400000,
            "1": 0,
            "2": 0
          },
          {
            "0": 1590957000000,
            "1": 0,
            "2": 0
          },
          {
            "0": 1590962400000,
            "1": 1,
            "2": 1
          }
        ],
        [
          {
            "0": 1590949800000,
            "1": 0,
            "2": 0
          },
          {
            "0": 1590953400000,
            "1": 0,
            "2": 0
          },
          {
            "0": 1590957000000,
            "1": 0,
            "2": 0
          },
          {
            "0": 1590962400000,
            "1": 1,
            "2": 1
          }
        ]
      ],
      [
        [
          {
            "0": 1590949800000,
            "1": 0,
            "2": 0
          },
          {
            "0": 1590953400000,
            "1": 0,
            "2": 0
          },
          {
            "0": 1590957000000,
            "1": 0,
            "2": 0
          },
          {
            "0": 1590962400000,
            "1": 1,
            "2": 1
          }
        ],
        [
          {
            "0": 1590949800000,
            "1": 0,
            "2": 0
          },
          {
            "0": 1590953400000,
            "1": 0,
            "2": 0
          },
          {
            "0": 1590957000000,
            "1": 0,
            "2": 0
          },
          {
            "0": 1590962400000,
            "1": 1,
            "2": 1
          }
        ],
        [
          {
            "0": 1590949800000,
            "1": 0,
            "2": 0
          },
          {
            "0": 1590953400000,
            "1": 0,
            "2": 0
          },
          {
            "0": 1590957000000,
            "1": 0,
            "2": 0
          },
          {
            "0": 1590962400000,
            "1": 1,
            "2": 1
          }
        ],
        [
          {
            "0": 1590949800000,
            "1": 0,
            "2": 0
          },
          {
            "0": 1590953400000,
            "1": 0,
            "2": 0
          },
          {
            "0": 1590957000000,
            "1": 0,
            "2": 0
          },
          {
            "0": 1590962400000,
            "1": 1,
            "2": 1
          }
        ],
        [
          {
            "0": 1590949800000,
            "1": 0,
            "2": 0
          },
          {
            "0": 1590953400000,
            "1": 0,
            "2": 0
          },
          {
            "0": 1590957000000,
            "1": 0,
            "2": 0
          },
          {
            "0": 1590962400000,
            "1": 1,
            "2": 1
          }
        ],
        [
          {
            "0": 1590949800000,
            "1": 0,
            "2": 0
          },
          {
            "0": 1590953400000,
            "1": 0,
            "2": 0
          },
          {
            "0": 1590957000000,
            "1": 0,
            "2": 0
          },
          {
            "0": 1590962400000,
            "1": 1,
            "2": 1
          }
        ],
        [
          {
            "0": 1590949800000,
            "1": 0,
            "2": 0
          },
          {
            "0": 1590953400000,
            "1": 0,
            "2": 0
          },
          {
            "0": 1590957000000,
            "1": 0,
            "2": 0
          },
          {
            "0": 1590962400000,
            "1": 1,
            "2": 1
          }
        ],
        [
          {
            "0": 1590949800000,
            "1": 0,
            "2": 0
          },
          {
            "0": 1590953400000,
            "1": 0,
            "2": 0
          },
          {
            "0": 1590957000000,
            "1": 0,
            "2": 0
          },
          {
            "0": 1590962400000,
            "1": 1,
            "2": 1
          }
        ],
        [
          {
            "0": 1590949800000,
            "1": 0,
            "2": 0
          },
          {
            "0": 1590953400000,
            "1": 0,
            "2": 0
          },
          {
            "0": 1590957000000,
            "1": 0,
            "2": 0
          },
          {
            "0": 1590962400000,
            "1": 1,
            "2": 1
          }
        ],
        [
          {
            "0": 1590949800000,
            "1": 0,
            "2": 0
          },
          {
            "0": 1590953400000,
            "1": 0,
            "2": 0
          },
          {
            "0": 1590957000000,
            "1": 0,
            "2": 0
          },
          {
            "0": 1590962400000,
            "1": 1,
            "2": 1
          }
        ]
      ],
      [
        [
          {
            "0": 1590949800000,
            "1": 0,
            "2": 0
          },
          {
            "0": 1590953400000,
            "1": 0,
            "2": 0
          },
          {
            "0": 1590957000000,
            "1": 0,
            "2": 0
          },
          {
            "0": 1590962400000,
            "1": 1,
            "2": 1
          }
        ],
        [
          {
            "0": 1590949800000,
            "1": 0,
            "2": 0
          },
          {
            "0": 1590953400000,
            "1": 0,
            "2": 0
          },
          {
            "0": 1590957000000,
            "1": 0,
            "2": 0
          },
          {
            "0": 1590962400000,
            "1": 1,
            "2": 1
          }
        ],
        [
          {
            "0": 1590949800000,
            "1": 0,
            "2": 0
          },
          {
            "0": 1590953400000,
            "1": 0,
            "2": 0
          },
          {
            "0": 1590957000000,
            "1": 0,
            "2": 0
          },
          {
            "0": 1590962400000,
            "1": 1,
            "2": 1
          }
        ],
        [
          {
            "0": 1590949800000,
            "1": 0,
            "2": 0
          },
          {
            "0": 1590953400000,
            "1": 0,
            "2": 0
          },
          {
            "0": 1590957000000,
            "1": 0,
            "2": 0
          },
          {
            "0": 1590962400000,
            "1": 1,
            "2": 1
          }
        ],
        [
          {
            "0": 1590949800000,
            "1": 0,
            "2": 0
          },
          {
            "0": 1590953400000,
            "1": 0,
            "2": 0
          },
          {
            "0": 1590957000000,
            "1": 0,
            "2": 0
          },
          {
            "0": 1590962400000,
            "1": 1,
            "2": 1
          }
        ],
        [
          {
            "0": 1590949800000,
            "1": 0,
            "2": 0
          },
          {
            "0": 1590953400000,
            "1": 0,
            "2": 0
          },
          {
            "0": 1590957000000,
            "1": 0,
            "2": 0
          },
          {
            "0": 1590962400000,
            "1": 1,
            "2": 1
          }
        ],
        [
          {
            "0": 1590949800000,
            "1": 0,
            "2": 0
          },
          {
            "0": 1590953400000,
            "1": 0,
            "2": 0
          },
          {
            "0": 1590957000000,
            "1": 0,
            "2": 0
          },
          {
            "0": 1590962400000,
            "1": 1,
            "2": 1
          }
        ]
      ],
      [
        [
          {
            "0": 1590949800000,
            "1": 0,
            "2": 0
          },
          {
            "0": 1590953400000,
            "1": 0,
            "2": 0
          },
          {
            "0": 1590957000000,
            "1": 0,
            "2": 0
          },
          {
            "0": 1590962400000,
            "1": 1,
            "2": 1
          }
        ],
        [
          {
            "0": 1590949800000,
            "1": 0,
            "2": 0
          },
          {
            "0": 1590953400000,
            "1": 0,
            "2": 0
          },
          {
            "0": 1590957000000,
            "1": 0,
            "2": 0
          },
          {
            "0": 1590962400000,
            "1": 1,
            "2": 1
          }
        ],
        [
          {
            "0": 1590949800000,
            "1": 0,
            "2": 0
          },
          {
            "0": 1590953400000,
            "1": 0,
            "2": 0
          },
          {
            "0": 1590957000000,
            "1": 0,
            "2": 0
          },
          {
            "0": 1590962400000,
            "1": 1,
            "2": 1
          }
        ],
        [
          {
            "0": 1590949800000,
            "1": 0,
            "2": 0
          },
          {
            "0": 1590953400000,
            "1": 0,
            "2": 0
          },
          {
            "0": 1590957000000,
            "1": 0,
            "2": 0
          },
          {
            "0": 1590962400000,
            "1": 1,
            "2": 1
          }
        ],
        [
          {
            "0": 1590949800000,
            "1": 0,
            "2": 0
          },
          {
            "0": 1590953400000,
            "1": 0,
            "2": 0
          },
          {
            "0": 1590957000000,
            "1": 0,
            "2": 0
          },
          {
            "0": 1590962400000,
            "1": 1,
            "2": 1
          }
        ],
        [
          {
            "0": 1590949800000,
            "1": 0,
            "2": 0
          },
          {
            "0": 1590953400000,
            "1": 0,
            "2": 0
          },
          {
            "0": 1590957000000,
            "1": 0,
            "2": 0
          },
          {
            "0": 1590962400000,
            "1": 1,
            "2": 1
          }
        ]
      ],
      [
        [
          {
            "0": 1590949800000,
            "1": 0,
            "2": 0
          },
          {
            "0": 1590953400000,
            "1": 0,
            "2": 0
          },
          {
            "0": 1590957000000,
            "1": 0,
            "2": 0
          },
          {
            "0": 1590962400000,
            "1": 1,
            "2": 1
          }
        ]
      ],
      [
        [
          {
            "0": 1590949800000,
            "1": 0,
            "2": 0
          },
          {
            "0": 1590953400000,
            "1": 0,
            "2": 0
          },
          {
            "0": 1590957000000,
            "1": 0,
            "2": 0
          },
          {
            "0": 1590962400000,
            "1": 1,
            "2": 1
          }
        ],
        [
          {
            "0": 1590949800000,
            "1": 0,
            "2": 0
          },
          {
            "0": 1590953400000,
            "1": 0,
            "2": 0
          },
          {
            "0": 1590957000000,
            "1": 0,
            "2": 0
          },
          {
            "0": 1590962400000,
            "1": 1,
            "2": 1
          }
        ],
        [
          {
            "0": 1590949800000,
            "1": 0,
            "2": 0
          },
          {
            "0": 1590953400000,
            "1": 0,
            "2": 0
          },
          {
            "0": 1590957000000,
            "1": 0,
            "2": 0
          },
          {
            "0": 1590962400000,
            "1": 1,
            "2": 1
          }
        ],
        [
          {
            "0": 1590949800000,
            "1": 0,
            "2": 0
          },
          {
            "0": 1590953400000,
            "1": 0,
            "2": 0
          },
          {
            "0": 1590957000000,
            "1": 0,
            "2": 0
          },
          {
            "0": 1590962400000,
            "1": 1,
            "2": 1
          }
        ],
        [
          {
            "0": 1590949800000,
            "1": 0,
            "2": 0
          },
          {
            "0": 1590953400000,
            "1": 0,
            "2": 0
          },
          {
            "0": 1590957000000,
            "1": 0,
            "2": 0
          },
          {
            "0": 1590962400000,
            "1": 1,
            "2": 1
          }
        ],
        [
          {
            "0": 1590949800000,
            "1": 0,
            "2": 0
          },
          {
            "0": 1590953400000,
            "1": 0,
            "2": 0
          },
          {
            "0": 1590957000000,
            "1": 0,
            "2": 0
          },
          {
            "0": 1590962400000,
            "1": 1,
            "2": 1
          }
        ],
        [
          {
            "0": 1590949800000,
            "1": 0,
            "2": 0
          },
          {
            "0": 1590953400000,
            "1": 0,
            "2": 0
          },
          {
            "0": 1590957000000,
            "1": 0,
            "2": 0
          },
          {
            "0": 1590962400000,
            "1": 1,
            "2": 1
          }
        ],
        [
          {
            "0": 1590949800000,
            "1": 0,
            "2": 0
          },
          {
            "0": 1590953400000,
            "1": 0,
            "2": 0
          },
          {
            "0": 1590957000000,
            "1": 0,
            "2": 0
          },
          {
            "0": 1590962400000,
            "1": 1,
            "2": 1
          }
        ],
        [
          {
            "0": 1590949800000,
            "1": 0,
            "2": 0
          },
          {
            "0": 1590953400000,
            "1": 0,
            "2": 0
          },
          {
            "0": 1590957000000,
            "1": 0,
            "2": 0
          },
          {
            "0": 1590962400000,
            "1": 1,
            "2": 1
          }
        ]
      ]
    ]
  }
]