{
  "$id": "schema.json",
  "type": "object",
  "schema": "http://json-schema.org/draft-07/schema#",
  "translate": true,
  "dynamicfields": true,
  "properties": {
    "ph_request_type": {
      "type": "string",
      "description": "type of request (internal to adapter)",
      "default": "apiGetAudits",
      "enum": [
        "apiGetAudits",
        "apiGetAuditDetails",
        "apiGetAuditLogs",
        "apiGetAuditLogDetails"
      ],
      "external_name": "ph_request_type"
    },
    "groupName": {
      "type": "string",
      "description": "Filter audit events by Group Name",
      "parse": false,
      "encode": false,
      "encrypt": {
        "type": "AES",
        "key": ""
      },
      "external_name": "group_name"
    },
    "deviceId": {
      "type": "string",
      "description": "Filter audit events by Target / Device ID. Device ID for AP is VC Name and Serial Number for Switches",
      "parse": false,
      "encode": false,
      "encrypt": {
        "type": "AES",
        "key": ""
      },
      "external_name": "device_id"
    },
    "startTime": {
      "type": "number",
      "description": "Filter audit logs by Time Range. Start time of the audit logs should be provided in epoch seconds",
      "parse": false,
      "encode": false,
      "encrypt": {
        "type": "AES",
        "key": ""
      },
      "external_name": "start_time"
    },
    "endTime": {
      "type": "number",
      "description": "Filter audit logs by Time Range. End time of the audit logs should be provided in epoch seconds",
      "parse": false,
      "encode": false,
      "encrypt": {
        "type": "AES",
        "key": ""
      },
      "external_name": "end_time"
    },
    "customerName": {
      "type": "string",
      "description": "Filter audit logs by Customer Name",
      "parse": false,
      "encode": false,
      "encrypt": {
        "type": "AES",
        "key": ""
      },
      "external_name": "customer_name"
    },
    "ipAddress": {
      "type": "string",
      "description": "Filter audit logs by IP Address",
      "parse": false,
      "encode": false,
      "encrypt": {
        "type": "AES",
        "key": ""
      },
      "external_name": "ip_address"
    },
    "appId": {
      "type": "string",
      "description": "Filter audit logs by app_id",
      "parse": false,
      "encode": false,
      "encrypt": {
        "type": "AES",
        "key": ""
      },
      "external_name": "app_id"
    }
  },
  "definitions": {}
}