{
  "count": 5,
  "total": 5,
  "vlans": [
    {
      "name": "DEFAULT_VLAN",
      "id": 1,
      "tagged_ports": [
        "1A",
        "1A",
        "1A",
        "1A",
        "1A",
        "1A",
        "1A",
        "1A",
        "1A",
        "1A"
      ],
      "untagged_ports": [
        "1B",
        "1B",
        "1B",
        "1B",
        "1B",
        "1B",
        "1B",
        "1B",
        "1B",
        "1B"
      ],
      "status": "Up",
      "is_igmp_enabled": true,
      "is_jumbo_enabled": true,
      "is_voice_enabled": true,
      "promiscuous_ports": [
        "1B",
        "1B",
        "1B",
        "1B",
        "1B",
        "1B",
        "1B",
        "1B",
        "1B"
      ],
      "isl_ports": [
        "1B",
        "1B",
        "1B",
        "1B",
        "1B",
        "1B",
        "1B",
        "1B",
        "1B",
        "1B"
      ],
      "type": "Regular",
      "primary_vlan_id": 1
    },
    {
      "name": "DEFAULT_VLAN",
      "id": 1,
      "tagged_ports": [
        "1A",
        "1A",
        "1A",
        "1A",
        "1A",
        "1A",
        "1A",
        "1A",
        "1A"
      ],
      "untagged_ports": [
        "1B",
        "1B",
        "1B",
        "1B",
        "1B"
      ],
      "status": "Up",
      "is_igmp_enabled": true,
      "is_jumbo_enabled": true,
      "is_voice_enabled": true,
      "promiscuous_ports": [
        "1B",
        "1B",
        "1B",
        "1B",
        "1B",
        "1B",
        "1B",
        "1B"
      ],
      "isl_ports": [
        "1B",
        "1B",
        "1B"
      ],
      "type": "Regular",
      "primary_vlan_id": 1
    },
    {
      "name": "DEFAULT_VLAN",
      "id": 1,
      "tagged_ports": [
        "1A",
        "1A",
        "1A",
        "1A",
        "1A",
        "1A"
      ],
      "untagged_ports": [
        "1B",
        "1B",
        "1B",
        "1B",
        "1B",
        "1B",
        "1B",
        "1B",
        "1B"
      ],
      "status": "Up",
      "is_igmp_enabled": true,
      "is_jumbo_enabled": true,
      "is_voice_enabled": true,
      "promiscuous_ports": [
        "1B",
        "1B",
        "1B",
        "1B",
        "1B"
      ],
      "isl_ports": [
        "1B",
        "1B",
        "1B",
        "1B"
      ],
      "type": "Regular",
      "primary_vlan_id": 1
    },
    {
      "name": "DEFAULT_VLAN",
      "id": 1,
      "tagged_ports": [
        "1A",
        "1A",
        "1A",
        "1A",
        "1A"
      ],
      "untagged_ports": [
        "1B",
        "1B",
        "1B",
        "1B",
        "1B"
      ],
      "status": "Up",
      "is_igmp_enabled": true,
      "is_jumbo_enabled": true,
      "is_voice_enabled": true,
      "promiscuous_ports": [
        "1B"
      ],
      "isl_ports": [
        "1B",
        "1B",
        "1B",
        "1B"
      ],
      "type": "Regular",
      "primary_vlan_id": 1
    },
    {
      "name": "DEFAULT_VLAN",
      "id": 1,
      "tagged_ports": [
        "1A",
        "1A",
        "1A",
        "1A",
        "1A",
        "1A"
      ],
      "untagged_ports": [
        "1B",
        "1B",
        "1B",
        "1B"
      ],
      "status": "Up",
      "is_igmp_enabled": true,
      "is_jumbo_enabled": true,
      "is_voice_enabled": true,
      "promiscuous_ports": [
        "1B",
        "1B",
        "1B",
        "1B"
      ],
      "isl_ports": [
        "1B",
        "1B",
        "1B",
        "1B",
        "1B",
        "1B"
      ],
      "type": "Regular",
      "primary_vlan_id": 1
    }
  ]
}