{
  "count": 6,
  "interval": "5minutes",
  "samples": [
    {
      "timestamp": 1524202896,
      "rx_data_bytes": 6000,
      "tx_data_bytes": 6000
    },
    {
      "timestamp": 1524202896,
      "rx_data_bytes": 6000,
      "tx_data_bytes": 6000
    },
    {
      "timestamp": 1524202896,
      "rx_data_bytes": 6000,
      "tx_data_bytes": 6000
    }
  ]
}