{
  "$id": "schema.json",
  "type": "object",
  "schema": "http://json-schema.org/draft-07/schema#",
  "translate": true,
  "dynamicfields": true,
  "properties": {
    "ph_request_type": {
      "type": "string",
      "description": "type of request (internal to adapter)",
      "default": "getArubaSdwanBranchMeshId4",
      "enum": [
        "getArubaSdwanBranchMeshId4",
        "getArubaSdwanBranchMeshId5",
        "putArubaSdwanBranchDevicesId1",
        "postArubaSdwanBranchDevicesId1",
        "deleteArubaSdwanBranchDevicesId1",
        "getArubaSdwanBranchDevicesId1",
        "putArubaSdwanConfigId2",
        "postArubaSdwanConfigId2",
        "deleteArubaSdwanConfigId2",
        "getArubaSdwanConfigId3",
        "getArubaSdwanBranchMeshUiId6",
        "getArubaSdwanBranchDevicesId2"
      ],
      "external_name": "ph_request_type"
    },
    "lastIndex": {
      "type": "string",
      "description": "Last seen index returned part of the previous query . It can be used instead of offset for seeking the table faster",
      "parse": false,
      "encode": false,
      "encrypt": {
        "type": "AES",
        "key": ""
      },
      "external_name": "last_index"
    },
    "searchName": {
      "type": "string",
      "description": "Specify partial/complete string that will be used to search the primary-key (labels).",
      "parse": false,
      "encode": false,
      "encrypt": {
        "type": "AES",
        "key": ""
      },
      "external_name": "search_name"
    },
    "branchDevices": {
      "type": "object",
      "description": "JSON representation of branch-devices config",
      "parse": false,
      "encode": false,
      "encrypt": {
        "type": "AES",
        "key": ""
      },
      "external_name": "branch_devices"
    }
  },
  "definitions": {}
}