{
  "$id": "schema.json",
  "type": "object",
  "schema": "http://json-schema.org/draft-07/schema#",
  "translate": true,
  "dynamicfields": true,
  "properties": {
    "ph_request_type": {
      "type": "string",
      "description": "type of request (internal to adapter)",
      "default": "viewsApprfApiViewWebcategoriesGet",
      "enum": [
        "viewsApprfApiViewWebcategoriesGet"
      ],
      "external_name": "ph_request_type"
    },
    "swarmId": {
      "type": "string",
      "description": "Filter by Swarm ID",
      "parse": false,
      "encode": false,
      "encrypt": {
        "type": "AES",
        "key": ""
      },
      "external_name": "swarm_id"
    },
    "fromTimestamp": {
      "type": "number",
      "description": "Need information from this timestamp. Timestamp is epoch in seconds. Default is current timestamp minus 3 hours",
      "parse": false,
      "encode": false,
      "encrypt": {
        "type": "AES",
        "key": ""
      },
      "external_name": "from_timestamp"
    },
    "toTimestamp": {
      "type": "number",
      "description": "Need information to this timestamp. Timestamp is epoch in seconds. Default is current timestamp",
      "parse": false,
      "encode": false,
      "encrypt": {
        "type": "AES",
        "key": ""
      },
      "external_name": "to_timestamp"
    },
    "userRole": {
      "type": "array",
      "description": "user to be filtered, comma seperated values (can be applied at customer/group/swarm levels)",
      "parse": false,
      "encode": false,
      "encrypt": {
        "type": "AES",
        "key": ""
      },
      "external_name": "user_role"
    }
  },
  "definitions": {}
}