{
  "total": 4,
  "items": [
    {
      "id": "string",
      "name": "string",
      "score": 5,
      "device_down": 6,
      "device_up": 9,
      "device_high_mem": 8,
      "device_high_cpu": 7,
      "device_high_ch_2_4ghz": 10,
      "device_high_ch_5ghz": 9,
      "device_high_noise_2_4ghz": 5,
      "device_high_noise_5ghz": 7,
      "wan_uplinks_down": 10,
      "wan_tunnels_down": 2,
      "user_conn_health_score": 5
    }
  ]
}