{
  "content": [
    {
      "allowedDeviceClasses": [
        "string",
        "string"
      ],
      "appId": "string",
      "appStoreStatus": {
        "reason": "string",
        "value": "pending"
      },
      "categories": [
        "string",
        "string",
        "string",
        "string"
      ],
      "description": "string",
      "icon": "string",
      "installedStatus": {
        "anyVersionInstalled": true,
        "collectorId": "string",
        "detailedStatus": {},
        "envVars": {},
        "installed": true,
        "installedVersion": 10,
        "otherVersionInstalled": true,
        "upgradable": true
      },
      "latestVersion": 6,
      "name": "string",
      "platformUrl": "string",
      "requiredConfig": {
        "containerSubscriptions": {
          "subscriptions": [
            {
              "subscriptionType": "string",
              "subscriptionValue": "string"
            },
            {
              "subscriptionType": "string",
              "subscriptionValue": "string"
            }
          ]
        },
        "environmentVariables": {
          "requiredVariables": [
            {
              "defaultValue": "string",
              "description": "string",
              "key": "string",
              "placeholder": "string",
              "supportValues": [
                "string",
                "string"
              ],
              "validationRegex": "string",
              "value": "string"
            }
          ],
          "userVariable": [
            {
              "defaultValue": "string",
              "description": "string",
              "key": "string",
              "placeholder": "string",
              "supportValues": [
                "string",
                "string",
                "string",
                "string",
                "string",
                "string"
              ],
              "validationRegex": "string",
              "value": "string"
            },
            {
              "defaultValue": "string",
              "description": "string",
              "key": "string",
              "placeholder": "string",
              "supportValues": [
                "string",
                "string",
                "string"
              ],
              "validationRegex": "string",
              "value": "string"
            },
            {
              "defaultValue": "string",
              "description": "string",
              "key": "string",
              "placeholder": "string",
              "supportValues": [
                "string",
                "string",
                "string",
                "string",
                "string",
                "string",
                "string",
                "string",
                "string",
                "string"
              ],
              "validationRegex": "string",
              "value": "string"
            },
            {
              "defaultValue": "string",
              "description": "string",
              "key": "string",
              "placeholder": "string",
              "supportValues": [
                "string",
                "string",
                "string",
                "string",
                "string",
                "string",
                "string",
                "string"
              ],
              "validationRegex": "string",
              "value": "string"
            },
            {
              "defaultValue": "string",
              "description": "string",
              "key": "string",
              "placeholder": "string",
              "supportValues": [
                "string",
                "string",
                "string",
                "string",
                "string",
                "string",
                "string",
                "string",
                "string"
              ],
              "validationRegex": "string",
              "value": "string"
            },
            {
              "defaultValue": "string",
              "description": "string",
              "key": "string",
              "placeholder": "string",
              "supportValues": [
                "string",
                "string",
                "string",
                "string",
                "string",
                "string"
              ],
              "validationRegex": "string",
              "value": "string"
            },
            {
              "defaultValue": "string",
              "description": "string",
              "key": "string",
              "placeholder": "string",
              "supportValues": [
                "string",
                "string",
                "string"
              ],
              "validationRegex": "string",
              "value": "string"
            },
            {
              "defaultValue": "string",
              "description": "string",
              "key": "string",
              "placeholder": "string",
              "supportValues": [
                "string"
              ],
              "validationRegex": "string",
              "value": "string"
            }
          ]
        },
        "externalURL": {
          "url": [
            {
              "host": "string"
            },
            {
              "host": "string"
            },
            {
              "host": "string"
            },
            {
              "host": "string"
            },
            {
              "host": "string"
            },
            {
              "host": "string"
            }
          ]
        },
        "permissions": {
          "rules": [
            {
              "deviceClass": "string",
              "deviceContext": "string",
              "gatt": "string",
              "nonEditable": false
            },
            {
              "deviceClass": "string",
              "deviceContext": "string",
              "gatt": "string",
              "nonEditable": false
            },
            {
              "deviceClass": "string",
              "deviceContext": "string",
              "gatt": "string",
              "nonEditable": false
            }
          ]
        }
      },
      "requiredEnvironmentVariables": {},
      "shortDescription": "string",
      "vendor": "string",
      "website": "string"
    },
    {
      "allowedDeviceClasses": [
        "string",
        "string",
        "string",
        "string"
      ],
      "appId": "string",
      "appStoreStatus": {
        "reason": "string",
        "value": "pending"
      },
      "categories": [
        "string",
        "string",
        "string",
        "string",
        "string"
      ],
      "description": "string",
      "icon": "string",
      "installedStatus": {
        "anyVersionInstalled": true,
        "collectorId": "string",
        "detailedStatus": {},
        "envVars": {},
        "installed": false,
        "installedVersion": 3,
        "otherVersionInstalled": false,
        "upgradable": true
      },
      "latestVersion": 8,
      "name": "string",
      "platformUrl": "string",
      "requiredConfig": {
        "containerSubscriptions": {
          "subscriptions": [
            {
              "subscriptionType": "string",
              "subscriptionValue": "string"
            },
            {
              "subscriptionType": "string",
              "subscriptionValue": "string"
            },
            {
              "subscriptionType": "string",
              "subscriptionValue": "string"
            },
            {
              "subscriptionType": "string",
              "subscriptionValue": "string"
            },
            {
              "subscriptionType": "string",
              "subscriptionValue": "string"
            },
            {
              "subscriptionType": "string",
              "subscriptionValue": "string"
            }
          ]
        },
        "environmentVariables": {
          "requiredVariables": [
            {
              "defaultValue": "string",
              "description": "string",
              "key": "string",
              "placeholder": "string",
              "supportValues": [
                "string",
                "string",
                "string",
                "string",
                "string",
                "string",
                "string",
                "string",
                "string",
                "string"
              ],
              "validationRegex": "string",
              "value": "string"
            },
            {
              "defaultValue": "string",
              "description": "string",
              "key": "string",
              "placeholder": "string",
              "supportValues": [
                "string",
                "string"
              ],
              "validationRegex": "string",
              "value": "string"
            },
            {
              "defaultValue": "string",
              "description": "string",
              "key": "string",
              "placeholder": "string",
              "supportValues": [
                "string"
              ],
              "validationRegex": "string",
              "value": "string"
            },
            {
              "defaultValue": "string",
              "description": "string",
              "key": "string",
              "placeholder": "string",
              "supportValues": [
                "string",
                "string"
              ],
              "validationRegex": "string",
              "value": "string"
            }
          ],
          "userVariable": [
            {
              "defaultValue": "string",
              "description": "string",
              "key": "string",
              "placeholder": "string",
              "supportValues": [
                "string",
                "string",
                "string",
                "string",
                "string",
                "string"
              ],
              "validationRegex": "string",
              "value": "string"
            }
          ]
        },
        "externalURL": {
          "url": [
            {
              "host": "string"
            },
            {
              "host": "string"
            }
          ]
        },
        "permissions": {
          "rules": [
            {
              "deviceClass": "string",
              "deviceContext": "string",
              "gatt": "string",
              "nonEditable": false
            },
            {
              "deviceClass": "string",
              "deviceContext": "string",
              "gatt": "string",
              "nonEditable": false
            },
            {
              "deviceClass": "string",
              "deviceContext": "string",
              "gatt": "string",
              "nonEditable": true
            },
            {
              "deviceClass": "string",
              "deviceContext": "string",
              "gatt": "string",
              "nonEditable": true
            },
            {
              "deviceClass": "string",
              "deviceContext": "string",
              "gatt": "string",
              "nonEditable": false
            },
            {
              "deviceClass": "string",
              "deviceContext": "string",
              "gatt": "string",
              "nonEditable": false
            }
          ]
        }
      },
      "requiredEnvironmentVariables": {},
      "shortDescription": "string",
      "vendor": "string",
      "website": "string"
    },
    {
      "allowedDeviceClasses": [
        "string",
        "string",
        "string",
        "string",
        "string",
        "string",
        "string"
      ],
      "appId": "string",
      "appStoreStatus": {
        "reason": "string",
        "value": "inDevelopment"
      },
      "categories": [
        "string",
        "string",
        "string",
        "string"
      ],
      "description": "string",
      "icon": "string",
      "installedStatus": {
        "anyVersionInstalled": false,
        "collectorId": "string",
        "detailedStatus": {},
        "envVars": {},
        "installed": true,
        "installedVersion": 7,
        "otherVersionInstalled": true,
        "upgradable": true
      },
      "latestVersion": 1,
      "name": "string",
      "platformUrl": "string",
      "requiredConfig": {
        "containerSubscriptions": {
          "subscriptions": [
            {
              "subscriptionType": "string",
              "subscriptionValue": "string"
            }
          ]
        },
        "environmentVariables": {
          "requiredVariables": [
            {
              "defaultValue": "string",
              "description": "string",
              "key": "string",
              "placeholder": "string",
              "supportValues": [
                "string",
                "string",
                "string",
                "string",
                "string",
                "string",
                "string",
                "string"
              ],
              "validationRegex": "string",
              "value": "string"
            },
            {
              "defaultValue": "string",
              "description": "string",
              "key": "string",
              "placeholder": "string",
              "supportValues": [
                "string",
                "string",
                "string",
                "string",
                "string"
              ],
              "validationRegex": "string",
              "value": "string"
            },
            {
              "defaultValue": "string",
              "description": "string",
              "key": "string",
              "placeholder": "string",
              "supportValues": [
                "string",
                "string",
                "string",
                "string",
                "string",
                "string",
                "string",
                "string",
                "string"
              ],
              "validationRegex": "string",
              "value": "string"
            },
            {
              "defaultValue": "string",
              "description": "string",
              "key": "string",
              "placeholder": "string",
              "supportValues": [
                "string",
                "string",
                "string",
                "string",
                "string",
                "string",
                "string",
                "string",
                "string",
                "string"
              ],
              "validationRegex": "string",
              "value": "string"
            },
            {
              "defaultValue": "string",
              "description": "string",
              "key": "string",
              "placeholder": "string",
              "supportValues": [
                "string",
                "string",
                "string",
                "string"
              ],
              "validationRegex": "string",
              "value": "string"
            },
            {
              "defaultValue": "string",
              "description": "string",
              "key": "string",
              "placeholder": "string",
              "supportValues": [
                "string",
                "string",
                "string"
              ],
              "validationRegex": "string",
              "value": "string"
            }
          ],
          "userVariable": [
            {
              "defaultValue": "string",
              "description": "string",
              "key": "string",
              "placeholder": "string",
              "supportValues": [
                "string",
                "string",
                "string",
                "string",
                "string",
                "string",
                "string",
                "string"
              ],
              "validationRegex": "string",
              "value": "string"
            },
            {
              "defaultValue": "string",
              "description": "string",
              "key": "string",
              "placeholder": "string",
              "supportValues": [
                "string",
                "string",
                "string"
              ],
              "validationRegex": "string",
              "value": "string"
            },
            {
              "defaultValue": "string",
              "description": "string",
              "key": "string",
              "placeholder": "string",
              "supportValues": [
                "string",
                "string",
                "string",
                "string",
                "string",
                "string",
                "string",
                "string",
                "string",
                "string"
              ],
              "validationRegex": "string",
              "value": "string"
            },
            {
              "defaultValue": "string",
              "description": "string",
              "key": "string",
              "placeholder": "string",
              "supportValues": [
                "string",
                "string",
                "string",
                "string",
                "string",
                "string",
                "string",
                "string",
                "string"
              ],
              "validationRegex": "string",
              "value": "string"
            },
            {
              "defaultValue": "string",
              "description": "string",
              "key": "string",
              "placeholder": "string",
              "supportValues": [
                "string",
                "string",
                "string"
              ],
              "validationRegex": "string",
              "value": "string"
            },
            {
              "defaultValue": "string",
              "description": "string",
              "key": "string",
              "placeholder": "string",
              "supportValues": [
                "string",
                "string",
                "string",
                "string",
                "string"
              ],
              "validationRegex": "string",
              "value": "string"
            },
            {
              "defaultValue": "string",
              "description": "string",
              "key": "string",
              "placeholder": "string",
              "supportValues": [
                "string",
                "string",
                "string"
              ],
              "validationRegex": "string",
              "value": "string"
            },
            {
              "defaultValue": "string",
              "description": "string",
              "key": "string",
              "placeholder": "string",
              "supportValues": [
                "string",
                "string",
                "string",
                "string"
              ],
              "validationRegex": "string",
              "value": "string"
            },
            {
              "defaultValue": "string",
              "description": "string",
              "key": "string",
              "placeholder": "string",
              "supportValues": [
                "string",
                "string",
                "string",
                "string",
                "string"
              ],
              "validationRegex": "string",
              "value": "string"
            },
            {
              "defaultValue": "string",
              "description": "string",
              "key": "string",
              "placeholder": "string",
              "supportValues": [
                "string",
                "string",
                "string",
                "string",
                "string"
              ],
              "validationRegex": "string",
              "value": "string"
            }
          ]
        },
        "externalURL": {
          "url": [
            {
              "host": "string"
            },
            {
              "host": "string"
            },
            {
              "host": "string"
            },
            {
              "host": "string"
            },
            {
              "host": "string"
            },
            {
              "host": "string"
            },
            {
              "host": "string"
            },
            {
              "host": "string"
            }
          ]
        },
        "permissions": {
          "rules": [
            {
              "deviceClass": "string",
              "deviceContext": "string",
              "gatt": "string",
              "nonEditable": true
            },
            {
              "deviceClass": "string",
              "deviceContext": "string",
              "gatt": "string",
              "nonEditable": false
            },
            {
              "deviceClass": "string",
              "deviceContext": "string",
              "gatt": "string",
              "nonEditable": true
            },
            {
              "deviceClass": "string",
              "deviceContext": "string",
              "gatt": "string",
              "nonEditable": true
            },
            {
              "deviceClass": "string",
              "deviceContext": "string",
              "gatt": "string",
              "nonEditable": false
            },
            {
              "deviceClass": "string",
              "deviceContext": "string",
              "gatt": "string",
              "nonEditable": true
            }
          ]
        }
      },
      "requiredEnvironmentVariables": {},
      "shortDescription": "string",
      "vendor": "string",
      "website": "string"
    },
    {
      "allowedDeviceClasses": [
        "string",
        "string",
        "string",
        "string",
        "string",
        "string",
        "string",
        "string"
      ],
      "appId": "string",
      "appStoreStatus": {
        "reason": "string",
        "value": "pending"
      },
      "categories": [
        "string",
        "string",
        "string",
        "string",
        "string",
        "string"
      ],
      "description": "string",
      "icon": "string",
      "installedStatus": {
        "anyVersionInstalled": true,
        "collectorId": "string",
        "detailedStatus": {},
        "envVars": {},
        "installed": false,
        "installedVersion": 1,
        "otherVersionInstalled": true,
        "upgradable": false
      },
      "latestVersion": 5,
      "name": "string",
      "platformUrl": "string",
      "requiredConfig": {
        "containerSubscriptions": {
          "subscriptions": [
            {
              "subscriptionType": "string",
              "subscriptionValue": "string"
            },
            {
              "subscriptionType": "string",
              "subscriptionValue": "string"
            },
            {
              "subscriptionType": "string",
              "subscriptionValue": "string"
            },
            {
              "subscriptionType": "string",
              "subscriptionValue": "string"
            },
            {
              "subscriptionType": "string",
              "subscriptionValue": "string"
            },
            {
              "subscriptionType": "string",
              "subscriptionValue": "string"
            },
            {
              "subscriptionType": "string",
              "subscriptionValue": "string"
            },
            {
              "subscriptionType": "string",
              "subscriptionValue": "string"
            },
            {
              "subscriptionType": "string",
              "subscriptionValue": "string"
            }
          ]
        },
        "environmentVariables": {
          "requiredVariables": [
            {
              "defaultValue": "string",
              "description": "string",
              "key": "string",
              "placeholder": "string",
              "supportValues": [
                "string",
                "string",
                "string"
              ],
              "validationRegex": "string",
              "value": "string"
            },
            {
              "defaultValue": "string",
              "description": "string",
              "key": "string",
              "placeholder": "string",
              "supportValues": [
                "string"
              ],
              "validationRegex": "string",
              "value": "string"
            }
          ],
          "userVariable": [
            {
              "defaultValue": "string",
              "description": "string",
              "key": "string",
              "placeholder": "string",
              "supportValues": [
                "string",
                "string",
                "string",
                "string",
                "string",
                "string",
                "string",
                "string"
              ],
              "validationRegex": "string",
              "value": "string"
            },
            {
              "defaultValue": "string",
              "description": "string",
              "key": "string",
              "placeholder": "string",
              "supportValues": [
                "string",
                "string",
                "string",
                "string",
                "string",
                "string",
                "string",
                "string",
                "string"
              ],
              "validationRegex": "string",
              "value": "string"
            },
            {
              "defaultValue": "string",
              "description": "string",
              "key": "string",
              "placeholder": "string",
              "supportValues": [
                "string",
                "string",
                "string",
                "string"
              ],
              "validationRegex": "string",
              "value": "string"
            },
            {
              "defaultValue": "string",
              "description": "string",
              "key": "string",
              "placeholder": "string",
              "supportValues": [
                "string",
                "string",
                "string",
                "string",
                "string",
                "string"
              ],
              "validationRegex": "string",
              "value": "string"
            },
            {
              "defaultValue": "string",
              "description": "string",
              "key": "string",
              "placeholder": "string",
              "supportValues": [
                "string",
                "string",
                "string",
                "string",
                "string",
                "string"
              ],
              "validationRegex": "string",
              "value": "string"
            },
            {
              "defaultValue": "string",
              "description": "string",
              "key": "string",
              "placeholder": "string",
              "supportValues": [
                "string"
              ],
              "validationRegex": "string",
              "value": "string"
            },
            {
              "defaultValue": "string",
              "description": "string",
              "key": "string",
              "placeholder": "string",
              "supportValues": [
                "string",
                "string",
                "string",
                "string",
                "string",
                "string"
              ],
              "validationRegex": "string",
              "value": "string"
            },
            {
              "defaultValue": "string",
              "description": "string",
              "key": "string",
              "placeholder": "string",
              "supportValues": [
                "string",
                "string",
                "string",
                "string",
                "string",
                "string",
                "string",
                "string",
                "string"
              ],
              "validationRegex": "string",
              "value": "string"
            }
          ]
        },
        "externalURL": {
          "url": [
            {
              "host": "string"
            },
            {
              "host": "string"
            },
            {
              "host": "string"
            },
            {
              "host": "string"
            },
            {
              "host": "string"
            },
            {
              "host": "string"
            },
            {
              "host": "string"
            },
            {
              "host": "string"
            },
            {
              "host": "string"
            },
            {
              "host": "string"
            }
          ]
        },
        "permissions": {
          "rules": [
            {
              "deviceClass": "string",
              "deviceContext": "string",
              "gatt": "string",
              "nonEditable": false
            },
            {
              "deviceClass": "string",
              "deviceContext": "string",
              "gatt": "string",
              "nonEditable": true
            },
            {
              "deviceClass": "string",
              "deviceContext": "string",
              "gatt": "string",
              "nonEditable": false
            },
            {
              "deviceClass": "string",
              "deviceContext": "string",
              "gatt": "string",
              "nonEditable": true
            },
            {
              "deviceClass": "string",
              "deviceContext": "string",
              "gatt": "string",
              "nonEditable": false
            },
            {
              "deviceClass": "string",
              "deviceContext": "string",
              "gatt": "string",
              "nonEditable": true
            },
            {
              "deviceClass": "string",
              "deviceContext": "string",
              "gatt": "string",
              "nonEditable": false
            },
            {
              "deviceClass": "string",
              "deviceContext": "string",
              "gatt": "string",
              "nonEditable": true
            },
            {
              "deviceClass": "string",
              "deviceContext": "string",
              "gatt": "string",
              "nonEditable": true
            }
          ]
        }
      },
      "requiredEnvironmentVariables": {},
      "shortDescription": "string",
      "vendor": "string",
      "website": "string"
    },
    {
      "allowedDeviceClasses": [
        "string",
        "string",
        "string",
        "string",
        "string",
        "string",
        "string",
        "string",
        "string",
        "string"
      ],
      "appId": "string",
      "appStoreStatus": {
        "reason": "string",
        "value": "inReview"
      },
      "categories": [
        "string",
        "string",
        "string",
        "string",
        "string",
        "string",
        "string",
        "string",
        "string"
      ],
      "description": "string",
      "icon": "string",
      "installedStatus": {
        "anyVersionInstalled": false,
        "collectorId": "string",
        "detailedStatus": {},
        "envVars": {},
        "installed": false,
        "installedVersion": 8,
        "otherVersionInstalled": false,
        "upgradable": true
      },
      "latestVersion": 7,
      "name": "string",
      "platformUrl": "string",
      "requiredConfig": {
        "containerSubscriptions": {
          "subscriptions": [
            {
              "subscriptionType": "string",
              "subscriptionValue": "string"
            },
            {
              "subscriptionType": "string",
              "subscriptionValue": "string"
            },
            {
              "subscriptionType": "string",
              "subscriptionValue": "string"
            },
            {
              "subscriptionType": "string",
              "subscriptionValue": "string"
            },
            {
              "subscriptionType": "string",
              "subscriptionValue": "string"
            },
            {
              "subscriptionType": "string",
              "subscriptionValue": "string"
            },
            {
              "subscriptionType": "string",
              "subscriptionValue": "string"
            },
            {
              "subscriptionType": "string",
              "subscriptionValue": "string"
            }
          ]
        },
        "environmentVariables": {
          "requiredVariables": [
            {
              "defaultValue": "string",
              "description": "string",
              "key": "string",
              "placeholder": "string",
              "supportValues": [
                "string",
                "string"
              ],
              "validationRegex": "string",
              "value": "string"
            },
            {
              "defaultValue": "string",
              "description": "string",
              "key": "string",
              "placeholder": "string",
              "supportValues": [
                "string",
                "string",
                "string",
                "string"
              ],
              "validationRegex": "string",
              "value": "string"
            }
          ],
          "userVariable": [
            {
              "defaultValue": "string",
              "description": "string",
              "key": "string",
              "placeholder": "string",
              "supportValues": [
                "string",
                "string",
                "string",
                "string",
                "string",
                "string",
                "string",
                "string",
                "string"
              ],
              "validationRegex": "string",
              "value": "string"
            },
            {
              "defaultValue": "string",
              "description": "string",
              "key": "string",
              "placeholder": "string",
              "supportValues": [
                "string",
                "string",
                "string",
                "string",
                "string",
                "string"
              ],
              "validationRegex": "string",
              "value": "string"
            },
            {
              "defaultValue": "string",
              "description": "string",
              "key": "string",
              "placeholder": "string",
              "supportValues": [
                "string",
                "string",
                "string",
                "string",
                "string",
                "string",
                "string"
              ],
              "validationRegex": "string",
              "value": "string"
            },
            {
              "defaultValue": "string",
              "description": "string",
              "key": "string",
              "placeholder": "string",
              "supportValues": [
                "string",
                "string",
                "string",
                "string",
                "string",
                "string"
              ],
              "validationRegex": "string",
              "value": "string"
            },
            {
              "defaultValue": "string",
              "description": "string",
              "key": "string",
              "placeholder": "string",
              "supportValues": [
                "string",
                "string",
                "string"
              ],
              "validationRegex": "string",
              "value": "string"
            },
            {
              "defaultValue": "string",
              "description": "string",
              "key": "string",
              "placeholder": "string",
              "supportValues": [
                "string",
                "string",
                "string"
              ],
              "validationRegex": "string",
              "value": "string"
            },
            {
              "defaultValue": "string",
              "description": "string",
              "key": "string",
              "placeholder": "string",
              "supportValues": [
                "string",
                "string",
                "string",
                "string",
                "string",
                "string",
                "string",
                "string",
                "string"
              ],
              "validationRegex": "string",
              "value": "string"
            },
            {
              "defaultValue": "string",
              "description": "string",
              "key": "string",
              "placeholder": "string",
              "supportValues": [
                "string",
                "string",
                "string",
                "string",
                "string",
                "string",
                "string"
              ],
              "validationRegex": "string",
              "value": "string"
            },
            {
              "defaultValue": "string",
              "description": "string",
              "key": "string",
              "placeholder": "string",
              "supportValues": [
                "string",
                "string"
              ],
              "validationRegex": "string",
              "value": "string"
            }
          ]
        },
        "externalURL": {
          "url": [
            {
              "host": "string"
            },
            {
              "host": "string"
            },
            {
              "host": "string"
            },
            {
              "host": "string"
            },
            {
              "host": "string"
            }
          ]
        },
        "permissions": {
          "rules": [
            {
              "deviceClass": "string",
              "deviceContext": "string",
              "gatt": "string",
              "nonEditable": true
            },
            {
              "deviceClass": "string",
              "deviceContext": "string",
              "gatt": "string",
              "nonEditable": false
            },
            {
              "deviceClass": "string",
              "deviceContext": "string",
              "gatt": "string",
              "nonEditable": false
            }
          ]
        }
      },
      "requiredEnvironmentVariables": {},
      "shortDescription": "string",
      "vendor": "string",
      "website": "string"
    }
  ],
  "empty": false,
  "first": true,
  "last": true,
  "number": 3,
  "numberOfElements": 4,
  "pageable": {
    "offset": 7,
    "pageNumber": 7,
    "pageSize": 8,
    "paged": true,
    "sort": {
      "empty": false,
      "sorted": false,
      "unsorted": false
    },
    "unpaged": false
  },
  "size": 6,
  "sort": {
    "empty": true,
    "sorted": true,
    "unsorted": true
  },
  "totalElements": 6,
  "totalPages": 2
}