{
  "total_devices": 6,
  "devices": [
    {
      "device_type": "string",
      "macaddr": "string",
      "model": "string",
      "serial": "string",
      "aruba_part_no": "string"
    },
    {
      "device_type": "string",
      "macaddr": "string",
      "model": "string",
      "serial": "string",
      "aruba_part_no": "string"
    },
    {
      "device_type": "string",
      "macaddr": "string",
      "model": "string",
      "serial": "string",
      "aruba_part_no": "string"
    },
    {
      "device_type": "string",
      "macaddr": "string",
      "model": "string",
      "serial": "string",
      "aruba_part_no": "string"
    },
    {
      "device_type": "string",
      "macaddr": "string",
      "model": "string",
      "serial": "string",
      "aruba_part_no": "string"
    },
    {
      "device_type": "string",
      "macaddr": "string",
      "model": "string",
      "serial": "string",
      "aruba_part_no": "string"
    },
    {
      "device_type": "string",
      "macaddr": "string",
      "model": "string",
      "serial": "string",
      "aruba_part_no": "string"
    },
    {
      "device_type": "string",
      "macaddr": "string",
      "model": "string",
      "serial": "string",
      "aruba_part_no": "string"
    }
  ]
}