{
  "$id": "schema.json",
  "type": "object",
  "schema": "http://json-schema.org/draft-07/schema#",
  "translate": true,
  "dynamicfields": true,
  "properties": {
    "ph_request_type": {
      "type": "string",
      "description": "type of request (internal to adapter)",
      "default": "apiCloudauthReadAuthAirPassList",
      "enum": [
        "apiCloudauthReadAuthAirPassList",
        "apiCloudauthReadAuthCloudIdentityList",
        "apiCloudauthReadAuthDetailsRecord",
        "apiCloudauthReadSessionAirPassList",
        "apiCloudauthReadCloudIdentitySessionList"
      ],
      "external_name": "ph_request_type"
    },
    "fromTime": {
      "type": "string",
      "description": "Integer value (1-90) followed by unit - one of d , h , m for day , hour , minute respectively; like 3h. This is ignored if Time Window is specified.",
      "parse": false,
      "encode": false,
      "encrypt": {
        "type": "AES",
        "key": ""
      },
      "external_name": "from_time"
    },
    "timeWindow": {
      "type": "string",
      "description": "Set Time Window to include requests started in a specific time window.",
      "parse": false,
      "encode": false,
      "encrypt": {
        "type": "AES",
        "key": ""
      },
      "external_name": "time_window"
    },
    "requestId": {
      "type": "string",
      "description": "The authentication request ID",
      "parse": false,
      "encode": false,
      "encrypt": {
        "type": "AES",
        "key": ""
      },
      "external_name": "request_id"
    }
  },
  "definitions": {}
}