{
  "content": [
    {
      "appId": "string",
      "icon": "string",
      "latestVersion": 10,
      "name": "string",
      "recommendationType": "string",
      "shortDescription": "string",
      "vendor": "string"
    }
  ],
  "empty": false,
  "first": true,
  "last": true,
  "number": 10,
  "numberOfElements": 8,
  "pageable": {
    "offset": 3,
    "pageNumber": 5,
    "pageSize": 8,
    "paged": false,
    "sort": {
      "empty": false,
      "sorted": false,
      "unsorted": false
    },
    "unpaged": true
  },
  "size": 4,
  "sort": {
    "empty": false,
    "sorted": false,
    "unsorted": false
  },
  "totalElements": 10,
  "totalPages": 5
}