{
  "actions": [
    {
      "name": "getRapidsV1RogueAps",
      "protocol": "REST",
      "method": "GET",
      "entitypath": "{base_path}/{version}/rapids/v1/rogue_aps?{query}",
      "requestSchema": "schema.json",
      "responseSchema": "schema.json",
      "timeout": 0,
      "sendEmpty": false,
      "sendGetBody": false,
      "requestDatatype": "JSON",
      "responseDatatype": "JSON",
      "headers": {},
      "responseObjects": [
        {
          "type": "default",
          "key": "",
          "mockFile": "mockdatafiles/getRapidsV1RogueAps-default.json"
        }
      ]
    },
    {
      "name": "getRapidsV1InterferingAps",
      "protocol": "REST",
      "method": "GET",
      "entitypath": "{base_path}/{version}/rapids/v1/interfering_aps?{query}",
      "requestSchema": "schema.json",
      "responseSchema": "schema.json",
      "timeout": 0,
      "sendEmpty": false,
      "sendGetBody": false,
      "requestDatatype": "JSON",
      "responseDatatype": "JSON",
      "headers": {},
      "responseObjects": [
        {
          "type": "default",
          "key": "",
          "mockFile": "mockdatafiles/getRapidsV1InterferingAps-default.json"
        }
      ]
    },
    {
      "name": "getRapidsV1SuspectAps",
      "protocol": "REST",
      "method": "GET",
      "entitypath": "{base_path}/{version}/rapids/v1/suspect_aps?{query}",
      "requestSchema": "schema.json",
      "responseSchema": "schema.json",
      "timeout": 0,
      "sendEmpty": false,
      "sendGetBody": false,
      "requestDatatype": "JSON",
      "responseDatatype": "JSON",
      "headers": {},
      "responseObjects": [
        {
          "type": "default",
          "key": "",
          "mockFile": "mockdatafiles/getRapidsV1SuspectAps-default.json"
        }
      ]
    },
    {
      "name": "getRapidsV1NeighborAps",
      "protocol": "REST",
      "method": "GET",
      "entitypath": "{base_path}/{version}/rapids/v1/neighbor_aps?{query}",
      "requestSchema": "schema.json",
      "responseSchema": "schema.json",
      "timeout": 0,
      "sendEmpty": false,
      "sendGetBody": false,
      "requestDatatype": "JSON",
      "responseDatatype": "JSON",
      "headers": {},
      "responseObjects": [
        {
          "type": "default",
          "key": "",
          "mockFile": "mockdatafiles/getRapidsV1NeighborAps-default.json"
        }
      ]
    },
    {
      "name": "getRapidsV1ManuallyContainedAps",
      "protocol": "REST",
      "method": "GET",
      "entitypath": "{base_path}/{version}/rapids/v1/manually_contained_aps?{query}",
      "requestSchema": "schema.json",
      "responseSchema": "schema.json",
      "timeout": 0,
      "sendEmpty": false,
      "sendGetBody": false,
      "requestDatatype": "JSON",
      "responseDatatype": "JSON",
      "headers": {},
      "responseObjects": [
        {
          "type": "default",
          "key": "",
          "mockFile": "mockdatafiles/getRapidsV1ManuallyContainedAps-default.json"
        }
      ]
    }
  ]
}