{
  "lag1": {
    "name": "string",
    "description": "string",
    "admin_status": true,
    "port_members": [
      "string",
      "string",
      "string",
      "string"
    ],
    "speed_duplex": "Auto 2.5G",
    "aggregation_mode": "None",
    "routing": false,
    "ip_address": [
      "string",
      "string",
      "string",
      "string",
      "string",
      "string"
    ],
    "loop_protect_enabled": false,
    "vlan_mode": "access",
    "native_vlan_id": 1,
    "access_vlan_id": 3,
    "allowed_vlan_list": [
      "string",
      "string",
      "string",
      "string"
    ],
    "dhcpv4_snooping": "string"
  }
}