{
  "$id": "schema.json",
  "type": "object",
  "schema": "http://json-schema.org/draft-07/schema#",
  "translate": true,
  "dynamicfields": true,
  "properties": {
    "ph_request_type": {
      "type": "string",
      "description": "type of request (internal to adapter)",
      "default": "apiHandlersTelemetryPurge",
      "enum": [
        "apiHandlersTelemetryPurge"
      ],
      "external_name": "ph_request_type"
    },
    "tenantId": {
      "type": "string",
      "description": "Customer(Tenant) ID",
      "parse": false,
      "encode": false,
      "encrypt": {
        "type": "AES",
        "key": ""
      },
      "external_name": "tenant_id"
    },
    "purgeType": {
      "type": "string",
      "description": "Purge type",
      "parse": false,
      "encode": false,
      "encrypt": {
        "type": "AES",
        "key": ""
      },
      "external_name": "purge_type"
    }
  },
  "definitions": {}
}