{
  "$id": ".system-schemaTokenReq_MFA_Step_3.json",
  "type": "object",
  "schema": "http://json-schema.org/draft-07/schema#",
  "translate": true,
  "dynamicfields": true,
  "properties": {
    "ph_request_type": {
      "type": "string",
      "description": "type of request (internal to adapter)",
      "default": "MFA_Step_3",
      "enum": [
        "MFA_Step_3"
      ],
      "external_name": "ph_request_type"
    }
  },
  "definitions": {}
}
