{
  "actions": [
    {
      "name": "apiVariablesFirewallGetVfwGroups",
      "protocol": "REST",
      "method": "GET",
      "entitypath": "{base_path}/{version}/configuration/v1/variables_firewall/groups?{query}",
      "requestSchema": "schema.json",
      "responseSchema": "schema.json",
      "timeout": 0,
      "sendEmpty": false,
      "sendGetBody": false,
      "requestDatatype": "JSON",
      "responseDatatype": "JSON",
      "headers": {},
      "responseObjects": [
        {
          "type": "default",
          "key": "",
          "mockFile": "mockdatafiles/apiVariablesFirewallGetVfwGroups-default.json"
        }
      ]
    },
    {
      "name": "apiVariablesFirewallUpdateVfwGroups",
      "protocol": "REST",
      "method": "POST",
      "entitypath": "{base_path}/{version}/configuration/v1/variables_firewall/groups?{query}",
      "requestSchema": "schema.json",
      "responseSchema": "schema.json",
      "timeout": 0,
      "sendEmpty": false,
      "requestDatatype": "JSON",
      "responseDatatype": "JSON",
      "headers": {},
      "responseObjects": [
        {
          "type": "default",
          "key": "",
          "mockFile": ""
        }
      ]
    },
    {
      "name": "apiVariablesFirewallDeleteVfwGroup",
      "protocol": "REST",
      "method": "DELETE",
      "entitypath": "{base_path}/{version}/configuration/v1/variables_firewall/groups/{pathv1}?{query}",
      "requestSchema": "schema.json",
      "responseSchema": "schema.json",
      "timeout": 0,
      "sendEmpty": false,
      "requestDatatype": "JSON",
      "responseDatatype": "JSON",
      "headers": {},
      "responseObjects": [
        {
          "type": "default",
          "key": "",
          "mockFile": ""
        }
      ]
    },
    {
      "name": "apiVariablesFirewallGetVfwVariables",
      "protocol": "REST",
      "method": "GET",
      "entitypath": "{base_path}/{version}/configuration/v1/variables_firewall/variables?{query}",
      "requestSchema": "schema.json",
      "responseSchema": "schema.json",
      "timeout": 0,
      "sendEmpty": false,
      "sendGetBody": false,
      "requestDatatype": "JSON",
      "responseDatatype": "JSON",
      "headers": {},
      "responseObjects": [
        {
          "type": "default",
          "key": "",
          "mockFile": "mockdatafiles/apiVariablesFirewallGetVfwVariables-default.json"
        }
      ]
    },
    {
      "name": "apiVariablesFirewallUpdateVfwVariables",
      "protocol": "REST",
      "method": "POST",
      "entitypath": "{base_path}/{version}/configuration/v1/variables_firewall/variables?{query}",
      "requestSchema": "schema.json",
      "responseSchema": "schema.json",
      "timeout": 0,
      "sendEmpty": false,
      "requestDatatype": "JSON",
      "responseDatatype": "JSON",
      "headers": {},
      "responseObjects": [
        {
          "type": "default",
          "key": "",
          "mockFile": ""
        }
      ]
    },
    {
      "name": "apiVariablesFirewallDeleteVfwVariable",
      "protocol": "REST",
      "method": "DELETE",
      "entitypath": "{base_path}/{version}/configuration/v1/variables_firewall/variables/{pathv1}?{query}",
      "requestSchema": "schema.json",
      "responseSchema": "schema.json",
      "timeout": 0,
      "sendEmpty": false,
      "requestDatatype": "JSON",
      "responseDatatype": "JSON",
      "headers": {},
      "responseObjects": [
        {
          "type": "default",
          "key": "",
          "mockFile": ""
        }
      ]
    }
  ]
}