{
  "count": 6,
  "total": 4,
  "stacks": [
    {
      "id": "ST903545",
      "status": "Up",
      "topology": "Chain",
      "split_policy": "Standby",
      "group": "dual_5GHz",
      "mac": "c8:b5:ad:c3:b2:04",
      "public_ip_address": "10.29.31.251",
      "location": "Chennai",
      "name": "1.12.3.4",
      "domain_id": 1,
      "switch_type": "ArubaCX"
    },
    {
      "id": "ST903545",
      "status": "Up",
      "topology": "Chain",
      "split_policy": "Standby",
      "group": "dual_5GHz",
      "mac": "c8:b5:ad:c3:b2:04",
      "public_ip_address": "10.29.31.251",
      "location": "Chennai",
      "name": "1.12.3.4",
      "domain_id": 1,
      "switch_type": "MAAS"
    },
    {
      "id": "ST903545",
      "status": "Up",
      "topology": "Chain",
      "split_policy": "Standby",
      "group": "dual_5GHz",
      "mac": "c8:b5:ad:c3:b2:04",
      "public_ip_address": "10.29.31.251",
      "location": "Chennai",
      "name": "1.12.3.4",
      "domain_id": 1,
      "switch_type": "MAAS"
    },
    {
      "id": "ST903545",
      "status": "Up",
      "topology": "Chain",
      "split_policy": "Standby",
      "group": "dual_5GHz",
      "mac": "c8:b5:ad:c3:b2:04",
      "public_ip_address": "10.29.31.251",
      "location": "Chennai",
      "name": "1.12.3.4",
      "domain_id": 1,
      "switch_type": "MAAS"
    },
    {
      "id": "ST903545",
      "status": "Up",
      "topology": "Chain",
      "split_policy": "Standby",
      "group": "dual_5GHz",
      "mac": "c8:b5:ad:c3:b2:04",
      "public_ip_address": "10.29.31.251",
      "location": "Chennai",
      "name": "1.12.3.4",
      "domain_id": 1,
      "switch_type": "ArubaSwitch"
    },
    {
      "id": "ST903545",
      "status": "Up",
      "topology": "Chain",
      "split_policy": "Standby",
      "group": "dual_5GHz",
      "mac": "c8:b5:ad:c3:b2:04",
      "public_ip_address": "10.29.31.251",
      "location": "Chennai",
      "name": "1.12.3.4",
      "domain_id": 1,
      "switch_type": "ArubaSwitch"
    },
    {
      "id": "ST903545",
      "status": "Up",
      "topology": "Chain",
      "split_policy": "Standby",
      "group": "dual_5GHz",
      "mac": "c8:b5:ad:c3:b2:04",
      "public_ip_address": "10.29.31.251",
      "location": "Chennai",
      "name": "1.12.3.4",
      "domain_id": 1,
      "switch_type": "MAAS"
    },
    {
      "id": "ST903545",
      "status": "Up",
      "topology": "Chain",
      "split_policy": "Standby",
      "group": "dual_5GHz",
      "mac": "c8:b5:ad:c3:b2:04",
      "public_ip_address": "10.29.31.251",
      "location": "Chennai",
      "name": "1.12.3.4",
      "domain_id": 1,
      "switch_type": "ArubaCX"
    },
    {
      "id": "ST903545",
      "status": "Up",
      "topology": "Chain",
      "split_policy": "Standby",
      "group": "dual_5GHz",
      "mac": "c8:b5:ad:c3:b2:04",
      "public_ip_address": "10.29.31.251",
      "location": "Chennai",
      "name": "1.12.3.4",
      "domain_id": 1,
      "switch_type": "ArubaSwitch"
    },
    {
      "id": "ST903545",
      "status": "Up",
      "topology": "Chain",
      "split_policy": "Standby",
      "group": "dual_5GHz",
      "mac": "c8:b5:ad:c3:b2:04",
      "public_ip_address": "10.29.31.251",
      "location": "Chennai",
      "name": "1.12.3.4",
      "domain_id": 1,
      "switch_type": "MAAS"
    }
  ]
}