{
  "$id": "schema.json",
  "type": "object",
  "schema": "http://json-schema.org/draft-07/schema#",
  "translate": true,
  "dynamicfields": true,
  "properties": {
    "ph_request_type": {
      "type": "string",
      "description": "type of request (internal to adapter)",
      "default": "apiExternalControllerGetMcPortsBandwidthUsage",
      "enum": [
        "apiExternalControllerGetMcPortsBandwidthUsage",
        "apiExternalControllerGetMcPorts",
        "apiExternalControllerGetVlanInfo",
        "apiExternalControllerGetMcsV2",
        "apiExternalControllerGetMcV2",
        "apiExternalControllerDeleteMcV2"
      ],
      "external_name": "ph_request_type"
    },
    "fromTimestamp": {
      "type": "number",
      "description": "Need information from this timestamp. Timestamp is epoch in seconds. Default is current timestamp minus 3 hours",
      "parse": false,
      "encode": false,
      "encrypt": {
        "type": "AES",
        "key": ""
      },
      "external_name": "from_timestamp"
    },
    "toTimestamp": {
      "type": "number",
      "description": "Need information to this timestamp. Timestamp is epoch in seconds. Default is current timestamp",
      "parse": false,
      "encode": false,
      "encrypt": {
        "type": "AES",
        "key": ""
      },
      "external_name": "to_timestamp"
    },
    "calculateTotal": {
      "type": "boolean",
      "description": "Whether to calculate total Mobility Controllers",
      "parse": false,
      "encode": false,
      "encrypt": {
        "type": "AES",
        "key": ""
      },
      "external_name": "calculate_total"
    },
    "statsMetric": {
      "type": "boolean",
      "description": "If set, gets the uplinks and tunnels count",
      "parse": false,
      "encode": false,
      "encrypt": {
        "type": "AES",
        "key": ""
      },
      "external_name": "stats_metric"
    }
  },
  "definitions": {}
}