{
  "$id": "schema.json",
  "type": "object",
  "schema": "http://json-schema.org/draft-07/schema#",
  "translate": true,
  "dynamicfields": true,
  "properties": {
    "ph_request_type": {
      "type": "string",
      "description": "type of request (internal to adapter)",
      "default": "apiBlacklistClientGetBlacklistClients",
      "enum": [
        "apiBlacklistClientGetBlacklistClients",
        "apiBlacklistClientAddBlacklistClients",
        "apiBlacklistClientDeleteBlacklistClients"
      ],
      "external_name": "ph_request_type"
    },
    "deviceId": {
      "type": "string",
      "description": "Device id of virtual controller or C2C ap.\nExample:14b3743c01f8080bfa07ca053ef1e895df9c0680fe5a17bfd5.",
      "parse": false,
      "encode": false,
      "encrypt": {
        "type": "AES",
        "key": ""
      },
      "external_name": "device_id"
    }
  },
  "definitions": {}
}