[
  {
    "band": "string",
    "deploy_hour": 7,
    "partition_id": 2,
    "rfd_id": 10,
    "score": 7,
    "tenant_id": "string"
  },
  {
    "band": "string",
    "deploy_hour": 1,
    "partition_id": 2,
    "rfd_id": 6,
    "score": 9,
    "tenant_id": "string"
  },
  {
    "band": "string",
    "deploy_hour": 6,
    "partition_id": 6,
    "rfd_id": 8,
    "score": 5,
    "tenant_id": "string"
  }
]