{
  "result": {
    "web_rep": [
      {
        "data": 20000,
        "name": "name",
        "percent_usage": "5%",
        "timestamp": 1525235053774,
        "uid": 1
      },
      {
        "data": 20000,
        "name": "name",
        "percent_usage": "5%",
        "timestamp": 1525235053774,
        "uid": 1
      },
      {
        "data": 20000,
        "name": "name",
        "percent_usage": "5%",
        "timestamp": 1525235053774,
        "uid": 1
      },
      {
        "data": 20000,
        "name": "name",
        "percent_usage": "5%",
        "timestamp": 1525235053774,
        "uid": 1
      }
    ]
  }
}