{
  "total": 5,
  "data": {
    "body": [
      "string",
      "string",
      "string",
      "string",
      "string",
      "string",
      "string",
      "string",
      "string",
      "string"
    ],
    "header": "string"
  }
}