{
  "actions": [
    {
      "name": "apiHandlersRecieverUpdateFeasibility",
      "protocol": "REST",
      "method": "PUT",
      "entitypath": "{base_path}/{version}/receiver/v1/radio_feasibility_update/{pathv1}?{query}",
      "requestSchema": "schema.json",
      "responseSchema": "schema.json",
      "timeout": 0,
      "sendEmpty": false,
      "requestDatatype": "JSON",
      "responseDatatype": "JSON",
      "headers": {},
      "responseObjects": [
        {
          "type": "default",
          "key": "",
          "mockFile": ""
        }
      ]
    },
    {
      "name": "apiHandlersRecieverGetRadioFeasByRadioMac",
      "protocol": "REST",
      "method": "GET",
      "entitypath": "{base_path}/{version}/receiver/v1/radio_feasibility/{pathv1}?{query}",
      "requestSchema": "schema.json",
      "responseSchema": "schema.json",
      "timeout": 0,
      "sendEmpty": false,
      "sendGetBody": false,
      "requestDatatype": "JSON",
      "responseDatatype": "JSON",
      "headers": {},
      "responseObjects": [
        {
          "type": "default",
          "key": "",
          "mockFile": "mockdatafiles/apiHandlersRecieverGetRadioFeasByRadioMac-default.json"
        }
      ]
    },
    {
      "name": "apiHandlersRecieverGetAllRadioFeas",
      "protocol": "REST",
      "method": "GET",
      "entitypath": "{base_path}/{version}/receiver/v1/radio_feasibility_all?{query}",
      "requestSchema": "schema.json",
      "responseSchema": "schema.json",
      "timeout": 0,
      "sendEmpty": false,
      "sendGetBody": false,
      "requestDatatype": "JSON",
      "responseDatatype": "JSON",
      "headers": {},
      "responseObjects": [
        {
          "type": "default",
          "key": "",
          "mockFile": "mockdatafiles/apiHandlersRecieverGetAllRadioFeas-default.json"
        }
      ]
    },
    {
      "name": "apiHandlersFeasibilityGetRadioFeasByRadioMac",
      "protocol": "REST",
      "method": "GET",
      "entitypath": "{base_path}/{version}/feasibility/v1/radio_feasibility/{pathv1}?{query}",
      "requestSchema": "schema.json",
      "responseSchema": "schema.json",
      "timeout": 0,
      "sendEmpty": false,
      "sendGetBody": false,
      "requestDatatype": "JSON",
      "responseDatatype": "JSON",
      "headers": {},
      "responseObjects": [
        {
          "type": "default",
          "key": "",
          "mockFile": "mockdatafiles/apiHandlersFeasibilityGetRadioFeasByRadioMac-default.json"
        }
      ]
    },
    {
      "name": "apiHandlersFeasibilityGetAllRadioFeas",
      "protocol": "REST",
      "method": "GET",
      "entitypath": "{base_path}/{version}/feasibility/v1/radio_feasibility?{query}",
      "requestSchema": "schema.json",
      "responseSchema": "schema.json",
      "timeout": 0,
      "sendEmpty": false,
      "sendGetBody": false,
      "requestDatatype": "JSON",
      "responseDatatype": "JSON",
      "headers": {},
      "responseObjects": [
        {
          "type": "default",
          "key": "",
          "mockFile": "mockdatafiles/apiHandlersFeasibilityGetAllRadioFeas-default.json"
        }
      ]
    }
  ]
}