[
  {
    "report_id": "9_0",
    "report_name": "Infra Inventory Report",
    "report_type": "Infra_inventory",
    "scheduled_at": 1593148800735,
    "time_zone": "+0530",
    "status": "Completed"
  },
  {
    "report_id": "9_0",
    "report_name": "Infra Inventory Report",
    "report_type": "Infra_inventory",
    "scheduled_at": 1593148800735,
    "time_zone": "+0530",
    "status": "Completed"
  },
  {
    "report_id": "9_0",
    "report_name": "Infra Inventory Report",
    "report_type": "Infra_inventory",
    "scheduled_at": 1593148800735,
    "time_zone": "+0530",
    "status": "Completed"
  },
  {
    "report_id": "9_0",
    "report_name": "Infra Inventory Report",
    "report_type": "Infra_inventory",
    "scheduled_at": 1593148800735,
    "time_zone": "+0530",
    "status": "Completed"
  }
]