{
  "actions": [
    {
      "name": "apiCertificatesGetCertificates",
      "protocol": "REST",
      "method": "GET",
      "entitypath": "{base_path}/{version}/configuration/v1/certificates?{query}",
      "requestSchema": "schema.json",
      "responseSchema": "schema.json",
      "timeout": 0,
      "sendEmpty": false,
      "sendGetBody": false,
      "requestDatatype": "JSON",
      "responseDatatype": "JSON",
      "headers": {},
      "responseObjects": [
        {
          "type": "default",
          "key": "",
          "mockFile": "mockdatafiles/apiCertificatesGetCertificates-default.json"
        }
      ]
    },
    {
      "name": "apiCertificatesUploadCertificate",
      "protocol": "REST",
      "method": "POST",
      "entitypath": "{base_path}/{version}/configuration/v1/certificates?{query}",
      "requestSchema": "schema.json",
      "responseSchema": "schema.json",
      "timeout": 0,
      "sendEmpty": false,
      "requestDatatype": "JSON",
      "responseDatatype": "JSON",
      "headers": {},
      "responseObjects": [
        {
          "type": "default",
          "key": "",
          "mockFile": "mockdatafiles/apiCertificatesUploadCertificate-default.json"
        }
      ]
    },
    {
      "name": "apiCertificatesDeleteCertificate",
      "protocol": "REST",
      "method": "DELETE",
      "entitypath": "{base_path}/{version}/configuration/v1/certificates/{pathv1}?{query}",
      "requestSchema": "schema.json",
      "responseSchema": "schema.json",
      "timeout": 0,
      "sendEmpty": false,
      "requestDatatype": "JSON",
      "responseDatatype": "JSON",
      "headers": {},
      "responseObjects": [
        {
          "type": "default",
          "key": "",
          "mockFile": ""
        }
      ]
    },
    {
      "name": "apiCertificatesMspUpdateCertificate",
      "protocol": "REST",
      "method": "PUT",
      "entitypath": "{base_path}/{version}/configuration/v1/msp/certificate?{query}",
      "requestSchema": "schema.json",
      "responseSchema": "schema.json",
      "timeout": 0,
      "sendEmpty": false,
      "requestDatatype": "JSON",
      "responseDatatype": "JSON",
      "headers": {},
      "responseObjects": [
        {
          "type": "default",
          "key": "",
          "mockFile": "mockdatafiles/apiCertificatesMspUpdateCertificate-default.json"
        }
      ]
    }
  ]
}