{
  "actions": [
    {
      "name": "apiExternalControllerGetMcPortsBandwidthUsage",
      "protocol": "REST",
      "method": "GET",
      "entitypath": "{base_path}/{version}/monitoring/v1/mobility_controllers/{pathv1}/ports/bandwidth_usage?{query}",
      "requestSchema": "schema.json",
      "responseSchema": "schema.json",
      "timeout": 0,
      "sendEmpty": false,
      "sendGetBody": false,
      "requestDatatype": "JSON",
      "responseDatatype": "JSON",
      "headers": {},
      "responseObjects": [
        {
          "type": "default",
          "key": "",
          "mockFile": "mockdatafiles/apiExternalControllerGetMcPortsBandwidthUsage-default.json"
        }
      ]
    },
    {
      "name": "apiExternalControllerGetMcPorts",
      "protocol": "REST",
      "method": "GET",
      "entitypath": "{base_path}/{version}/monitoring/v1/mobility_controllers/{pathv1}/ports?{query}",
      "requestSchema": "schema.json",
      "responseSchema": "schema.json",
      "timeout": 0,
      "sendEmpty": false,
      "sendGetBody": false,
      "requestDatatype": "JSON",
      "responseDatatype": "JSON",
      "headers": {},
      "responseObjects": [
        {
          "type": "default",
          "key": "",
          "mockFile": "mockdatafiles/apiExternalControllerGetMcPorts-default.json"
        }
      ]
    },
    {
      "name": "apiExternalControllerGetVlanInfo",
      "protocol": "REST",
      "method": "GET",
      "entitypath": "{base_path}/{version}/monitoring/v1/mobility_controllers/{pathv1}/vlan?{query}",
      "requestSchema": "schema.json",
      "responseSchema": "schema.json",
      "timeout": 0,
      "sendEmpty": false,
      "sendGetBody": false,
      "requestDatatype": "JSON",
      "responseDatatype": "JSON",
      "headers": {},
      "responseObjects": [
        {
          "type": "default",
          "key": "",
          "mockFile": "mockdatafiles/apiExternalControllerGetVlanInfo-default.json"
        }
      ]
    },
    {
      "name": "apiExternalControllerGetMcsV2",
      "protocol": "REST",
      "method": "GET",
      "entitypath": "{base_path}/{version}/monitoring/v2/mobility_controllers?{query}",
      "requestSchema": "schema.json",
      "responseSchema": "schema.json",
      "timeout": 0,
      "sendEmpty": false,
      "sendGetBody": false,
      "requestDatatype": "JSON",
      "responseDatatype": "JSON",
      "headers": {},
      "responseObjects": [
        {
          "type": "default",
          "key": "",
          "mockFile": "mockdatafiles/apiExternalControllerGetMcsV2-default.json"
        }
      ]
    },
    {
      "name": "apiExternalControllerGetMcV2",
      "protocol": "REST",
      "method": "GET",
      "entitypath": "{base_path}/{version}/monitoring/v2/mobility_controllers/{pathv1}?{query}",
      "requestSchema": "schema.json",
      "responseSchema": "schema.json",
      "timeout": 0,
      "sendEmpty": false,
      "sendGetBody": false,
      "requestDatatype": "JSON",
      "responseDatatype": "JSON",
      "headers": {},
      "responseObjects": [
        {
          "type": "default",
          "key": "",
          "mockFile": "mockdatafiles/apiExternalControllerGetMcV2-default.json"
        }
      ]
    },
    {
      "name": "apiExternalControllerDeleteMcV2",
      "protocol": "REST",
      "method": "DELETE",
      "entitypath": "{base_path}/{version}/monitoring/v2/mobility_controllers/{pathv1}?{query}",
      "requestSchema": "schema.json",
      "responseSchema": "schema.json",
      "timeout": 0,
      "sendEmpty": false,
      "requestDatatype": "JSON",
      "responseDatatype": "JSON",
      "headers": {},
      "responseObjects": [
        {
          "type": "default",
          "key": "",
          "mockFile": ""
        }
      ]
    }
  ]
}