{
  "$id": "schema.json",
  "type": "object",
  "schema": "http://json-schema.org/draft-07/schema#",
  "translate": true,
  "dynamicfields": true,
  "properties": {
    "ph_request_type": {
      "type": "string",
      "description": "type of request (internal to adapter)",
      "default": "viewsPresenceGetDashboardV3PercentileDatapoints",
      "enum": [
        "viewsPresenceGetDashboardV3PercentileDatapoints"
      ],
      "external_name": "ph_request_type"
    },
    "tagId": {
      "type": "string",
      "description": "id of label/site/Campus/Building/floor",
      "parse": false,
      "encode": false,
      "encrypt": {
        "type": "AES",
        "key": ""
      },
      "external_name": "tag_id"
    },
    "startTime": {
      "type": "number",
      "description": "start time in epoch",
      "parse": false,
      "encode": false,
      "encrypt": {
        "type": "AES",
        "key": ""
      },
      "external_name": "start_time"
    },
    "endTime": {
      "type": "number",
      "description": "stop time in epoch",
      "parse": false,
      "encode": false,
      "encrypt": {
        "type": "AES",
        "key": ""
      },
      "external_name": "end_time"
    },
    "sampleFrequency": {
      "type": "string",
      "description": "frequency of the sampling",
      "parse": false,
      "encode": false,
      "encrypt": {
        "type": "AES",
        "key": ""
      },
      "external_name": "sample_frequency"
    }
  },
  "definitions": {}
}