{
  "data": [
    {
      "label": "all",
      "value": "32432",
      "name": "AirPlay"
    },
    {
      "label": "all",
      "value": "32432",
      "name": "AirPlay"
    },
    {
      "label": "all",
      "value": "32432",
      "name": "AirPlay"
    },
    {
      "label": "all",
      "value": "32432",
      "name": "AirPlay"
    },
    {
      "label": "all",
      "value": "32432",
      "name": "AirPlay"
    },
    {
      "label": "all",
      "value": "32432",
      "name": "AirPlay"
    },
    {
      "label": "all",
      "value": "32432",
      "name": "AirPlay"
    },
    {
      "label": "all",
      "value": "32432",
      "name": "AirPlay"
    },
    {
      "label": "all",
      "value": "32432",
      "name": "AirPlay"
    },
    {
      "label": "all",
      "value": "32432",
      "name": "AirPlay"
    }
  ]
}