{
  "voice_priority": 46,
  "dns_patterns": [
    {
      "dns_pattern": "verizon.com",
      "carrier_service_provider": "Verizon Inc"
    },
    {
      "dns_pattern": "verizon.com",
      "carrier_service_provider": "Verizon Inc"
    },
    {
      "dns_pattern": "verizon.com",
      "carrier_service_provider": "Verizon Inc"
    },
    {
      "dns_pattern": "verizon.com",
      "carrier_service_provider": "Verizon Inc"
    },
    {
      "dns_pattern": "verizon.com",
      "carrier_service_provider": "Verizon Inc"
    },
    {
      "dns_pattern": "verizon.com",
      "carrier_service_provider": "Verizon Inc"
    },
    {
      "dns_pattern": "verizon.com",
      "carrier_service_provider": "Verizon Inc"
    },
    {
      "dns_pattern": "verizon.com",
      "carrier_service_provider": "Verizon Inc"
    }
  ]
}