{
  "total_members": 4,
  "member_port_detail": [
    {
      "count": 6,
      "serial": "ST756576",
      "ports": [
        {
          "port_number": "1/1/1",
          "status": "Up",
          "type": "Ethernet",
          "mode": "Auto",
          "tx_usage": 232,
          "rx_usage": 234,
          "has_poe": true,
          "poe_state": "Down",
          "oper_state": "Down",
          "admin_state": "Down",
          "speed": 1000,
          "mux": true,
          "trusted": true,
          "power_consumption": 100,
          "allowed_vlan": [
            3333,
            3333,
            3333,
            3333,
            3333,
            3333,
            3333,
            3333,
            3333
          ],
          "vsx_enabled": true,
          "intf_state_down_reason": "Waiting for link",
          "native_vlan": 2,
          "vlan_mode": "Access",
          "slot": "slot1",
          "alignment": "PA_TOP",
          "internal": "Internal",
          "phy_type": "-",
          "sub_type": "100/1000T",
          "duplex_mode": "Full",
          "macaddr": "c8:b5:ad:c3:b2:04",
          "is_uplink": false,
          "port": 145
        },
        {
          "port_number": "1/1/1",
          "status": "Up",
          "type": "Ethernet",
          "mode": "Auto",
          "tx_usage": 232,
          "rx_usage": 234,
          "has_poe": true,
          "poe_state": "Down",
          "oper_state": "Down",
          "admin_state": "Down",
          "speed": 1000,
          "mux": true,
          "trusted": true,
          "power_consumption": 100,
          "allowed_vlan": [
            3333
          ],
          "vsx_enabled": false,
          "intf_state_down_reason": "Waiting for link",
          "native_vlan": 2,
          "vlan_mode": "Access",
          "slot": "slot1",
          "alignment": "PA_TOP",
          "internal": "Internal",
          "phy_type": "-",
          "sub_type": "100/1000T",
          "duplex_mode": "Full",
          "macaddr": "c8:b5:ad:c3:b2:04",
          "is_uplink": true,
          "port": 145
        },
        {
          "port_number": "1/1/1",
          "status": "Up",
          "type": "Ethernet",
          "mode": "Auto",
          "tx_usage": 232,
          "rx_usage": 234,
          "has_poe": true,
          "poe_state": "Down",
          "oper_state": "Down",
          "admin_state": "Down",
          "speed": 1000,
          "mux": true,
          "trusted": true,
          "power_consumption": 100,
          "allowed_vlan": [
            3333,
            3333,
            3333,
            3333,
            3333,
            3333,
            3333,
            3333
          ],
          "vsx_enabled": true,
          "intf_state_down_reason": "Waiting for link",
          "native_vlan": 2,
          "vlan_mode": "Access",
          "slot": "slot1",
          "alignment": "PA_TOP",
          "internal": "Internal",
          "phy_type": "-",
          "sub_type": "100/1000T",
          "duplex_mode": "Full",
          "macaddr": "c8:b5:ad:c3:b2:04",
          "is_uplink": true,
          "port": 145
        },
        {
          "port_number": "1/1/1",
          "status": "Up",
          "type": "Ethernet",
          "mode": "Auto",
          "tx_usage": 232,
          "rx_usage": 234,
          "has_poe": true,
          "poe_state": "Down",
          "oper_state": "Down",
          "admin_state": "Down",
          "speed": 1000,
          "mux": true,
          "trusted": true,
          "power_consumption": 100,
          "allowed_vlan": [
            3333,
            3333
          ],
          "vsx_enabled": true,
          "intf_state_down_reason": "Waiting for link",
          "native_vlan": 2,
          "vlan_mode": "Access",
          "slot": "slot1",
          "alignment": "PA_TOP",
          "internal": "Internal",
          "phy_type": "-",
          "sub_type": "100/1000T",
          "duplex_mode": "Full",
          "macaddr": "c8:b5:ad:c3:b2:04",
          "is_uplink": false,
          "port": 145
        },
        {
          "port_number": "1/1/1",
          "status": "Up",
          "type": "Ethernet",
          "mode": "Auto",
          "tx_usage": 232,
          "rx_usage": 234,
          "has_poe": true,
          "poe_state": "Down",
          "oper_state": "Down",
          "admin_state": "Down",
          "speed": 1000,
          "mux": true,
          "trusted": true,
          "power_consumption": 100,
          "allowed_vlan": [
            3333,
            3333,
            3333,
            3333,
            3333,
            3333,
            3333,
            3333,
            3333,
            3333
          ],
          "vsx_enabled": true,
          "intf_state_down_reason": "Waiting for link",
          "native_vlan": 2,
          "vlan_mode": "Access",
          "slot": "slot1",
          "alignment": "PA_TOP",
          "internal": "Internal",
          "phy_type": "-",
          "sub_type": "100/1000T",
          "duplex_mode": "Full",
          "macaddr": "c8:b5:ad:c3:b2:04",
          "is_uplink": true,
          "port": 145
        },
        {
          "port_number": "1/1/1",
          "status": "Up",
          "type": "Ethernet",
          "mode": "Auto",
          "tx_usage": 232,
          "rx_usage": 234,
          "has_poe": true,
          "poe_state": "Down",
          "oper_state": "Down",
          "admin_state": "Down",
          "speed": 1000,
          "mux": true,
          "trusted": true,
          "power_consumption": 100,
          "allowed_vlan": [
            3333,
            3333,
            3333,
            3333,
            3333,
            3333,
            3333,
            3333
          ],
          "vsx_enabled": true,
          "intf_state_down_reason": "Waiting for link",
          "native_vlan": 2,
          "vlan_mode": "Access",
          "slot": "slot1",
          "alignment": "PA_TOP",
          "internal": "Internal",
          "phy_type": "-",
          "sub_type": "100/1000T",
          "duplex_mode": "Full",
          "macaddr": "c8:b5:ad:c3:b2:04",
          "is_uplink": false,
          "port": 145
        }
      ],
      "stack_ports": [
        {
          "port_number": "1/1/25",
          "status": "Up"
        },
        {
          "port_number": "1/1/25",
          "status": "Up"
        },
        {
          "port_number": "1/1/25",
          "status": "Up"
        }
      ],
      "total": 28
    },
    {
      "count": 6,
      "serial": "ST756576",
      "ports": [
        {
          "port_number": "1/1/1",
          "status": "Up",
          "type": "Ethernet",
          "mode": "Auto",
          "tx_usage": 232,
          "rx_usage": 234,
          "has_poe": true,
          "poe_state": "Down",
          "oper_state": "Down",
          "admin_state": "Down",
          "speed": 1000,
          "mux": true,
          "trusted": true,
          "power_consumption": 100,
          "allowed_vlan": [
            3333,
            3333,
            3333,
            3333,
            3333
          ],
          "vsx_enabled": false,
          "intf_state_down_reason": "Waiting for link",
          "native_vlan": 2,
          "vlan_mode": "Access",
          "slot": "slot1",
          "alignment": "PA_TOP",
          "internal": "Internal",
          "phy_type": "-",
          "sub_type": "100/1000T",
          "duplex_mode": "Full",
          "macaddr": "c8:b5:ad:c3:b2:04",
          "is_uplink": true,
          "port": 145
        },
        {
          "port_number": "1/1/1",
          "status": "Up",
          "type": "Ethernet",
          "mode": "Auto",
          "tx_usage": 232,
          "rx_usage": 234,
          "has_poe": true,
          "poe_state": "Down",
          "oper_state": "Down",
          "admin_state": "Down",
          "speed": 1000,
          "mux": true,
          "trusted": true,
          "power_consumption": 100,
          "allowed_vlan": [
            3333,
            3333,
            3333,
            3333
          ],
          "vsx_enabled": false,
          "intf_state_down_reason": "Waiting for link",
          "native_vlan": 2,
          "vlan_mode": "Access",
          "slot": "slot1",
          "alignment": "PA_TOP",
          "internal": "Internal",
          "phy_type": "-",
          "sub_type": "100/1000T",
          "duplex_mode": "Full",
          "macaddr": "c8:b5:ad:c3:b2:04",
          "is_uplink": false,
          "port": 145
        },
        {
          "port_number": "1/1/1",
          "status": "Up",
          "type": "Ethernet",
          "mode": "Auto",
          "tx_usage": 232,
          "rx_usage": 234,
          "has_poe": true,
          "poe_state": "Down",
          "oper_state": "Down",
          "admin_state": "Down",
          "speed": 1000,
          "mux": true,
          "trusted": true,
          "power_consumption": 100,
          "allowed_vlan": [
            3333,
            3333,
            3333
          ],
          "vsx_enabled": true,
          "intf_state_down_reason": "Waiting for link",
          "native_vlan": 2,
          "vlan_mode": "Access",
          "slot": "slot1",
          "alignment": "PA_TOP",
          "internal": "Internal",
          "phy_type": "-",
          "sub_type": "100/1000T",
          "duplex_mode": "Full",
          "macaddr": "c8:b5:ad:c3:b2:04",
          "is_uplink": true,
          "port": 145
        },
        {
          "port_number": "1/1/1",
          "status": "Up",
          "type": "Ethernet",
          "mode": "Auto",
          "tx_usage": 232,
          "rx_usage": 234,
          "has_poe": true,
          "poe_state": "Down",
          "oper_state": "Down",
          "admin_state": "Down",
          "speed": 1000,
          "mux": true,
          "trusted": true,
          "power_consumption": 100,
          "allowed_vlan": [
            3333
          ],
          "vsx_enabled": true,
          "intf_state_down_reason": "Waiting for link",
          "native_vlan": 2,
          "vlan_mode": "Access",
          "slot": "slot1",
          "alignment": "PA_TOP",
          "internal": "Internal",
          "phy_type": "-",
          "sub_type": "100/1000T",
          "duplex_mode": "Full",
          "macaddr": "c8:b5:ad:c3:b2:04",
          "is_uplink": false,
          "port": 145
        },
        {
          "port_number": "1/1/1",
          "status": "Up",
          "type": "Ethernet",
          "mode": "Auto",
          "tx_usage": 232,
          "rx_usage": 234,
          "has_poe": true,
          "poe_state": "Down",
          "oper_state": "Down",
          "admin_state": "Down",
          "speed": 1000,
          "mux": true,
          "trusted": true,
          "power_consumption": 100,
          "allowed_vlan": [
            3333,
            3333,
            3333,
            3333,
            3333
          ],
          "vsx_enabled": true,
          "intf_state_down_reason": "Waiting for link",
          "native_vlan": 2,
          "vlan_mode": "Access",
          "slot": "slot1",
          "alignment": "PA_TOP",
          "internal": "Internal",
          "phy_type": "-",
          "sub_type": "100/1000T",
          "duplex_mode": "Full",
          "macaddr": "c8:b5:ad:c3:b2:04",
          "is_uplink": true,
          "port": 145
        },
        {
          "port_number": "1/1/1",
          "status": "Up",
          "type": "Ethernet",
          "mode": "Auto",
          "tx_usage": 232,
          "rx_usage": 234,
          "has_poe": true,
          "poe_state": "Down",
          "oper_state": "Down",
          "admin_state": "Down",
          "speed": 1000,
          "mux": true,
          "trusted": true,
          "power_consumption": 100,
          "allowed_vlan": [
            3333,
            3333,
            3333,
            3333,
            3333,
            3333
          ],
          "vsx_enabled": true,
          "intf_state_down_reason": "Waiting for link",
          "native_vlan": 2,
          "vlan_mode": "Access",
          "slot": "slot1",
          "alignment": "PA_TOP",
          "internal": "Internal",
          "phy_type": "-",
          "sub_type": "100/1000T",
          "duplex_mode": "Full",
          "macaddr": "c8:b5:ad:c3:b2:04",
          "is_uplink": true,
          "port": 145
        },
        {
          "port_number": "1/1/1",
          "status": "Up",
          "type": "Ethernet",
          "mode": "Auto",
          "tx_usage": 232,
          "rx_usage": 234,
          "has_poe": true,
          "poe_state": "Down",
          "oper_state": "Down",
          "admin_state": "Down",
          "speed": 1000,
          "mux": true,
          "trusted": true,
          "power_consumption": 100,
          "allowed_vlan": [
            3333,
            3333
          ],
          "vsx_enabled": true,
          "intf_state_down_reason": "Waiting for link",
          "native_vlan": 2,
          "vlan_mode": "Access",
          "slot": "slot1",
          "alignment": "PA_TOP",
          "internal": "Internal",
          "phy_type": "-",
          "sub_type": "100/1000T",
          "duplex_mode": "Full",
          "macaddr": "c8:b5:ad:c3:b2:04",
          "is_uplink": true,
          "port": 145
        },
        {
          "port_number": "1/1/1",
          "status": "Up",
          "type": "Ethernet",
          "mode": "Auto",
          "tx_usage": 232,
          "rx_usage": 234,
          "has_poe": true,
          "poe_state": "Down",
          "oper_state": "Down",
          "admin_state": "Down",
          "speed": 1000,
          "mux": true,
          "trusted": true,
          "power_consumption": 100,
          "allowed_vlan": [
            3333,
            3333,
            3333,
            3333,
            3333,
            3333,
            3333
          ],
          "vsx_enabled": true,
          "intf_state_down_reason": "Waiting for link",
          "native_vlan": 2,
          "vlan_mode": "Access",
          "slot": "slot1",
          "alignment": "PA_TOP",
          "internal": "Internal",
          "phy_type": "-",
          "sub_type": "100/1000T",
          "duplex_mode": "Full",
          "macaddr": "c8:b5:ad:c3:b2:04",
          "is_uplink": false,
          "port": 145
        }
      ],
      "stack_ports": [
        {
          "port_number": "1/1/25",
          "status": "Up"
        },
        {
          "port_number": "1/1/25",
          "status": "Up"
        },
        {
          "port_number": "1/1/25",
          "status": "Up"
        }
      ],
      "total": 28
    },
    {
      "count": 6,
      "serial": "ST756576",
      "ports": [
        {
          "port_number": "1/1/1",
          "status": "Up",
          "type": "Ethernet",
          "mode": "Auto",
          "tx_usage": 232,
          "rx_usage": 234,
          "has_poe": true,
          "poe_state": "Down",
          "oper_state": "Down",
          "admin_state": "Down",
          "speed": 1000,
          "mux": true,
          "trusted": true,
          "power_consumption": 100,
          "allowed_vlan": [
            3333,
            3333,
            3333,
            3333,
            3333
          ],
          "vsx_enabled": false,
          "intf_state_down_reason": "Waiting for link",
          "native_vlan": 2,
          "vlan_mode": "Access",
          "slot": "slot1",
          "alignment": "PA_TOP",
          "internal": "Internal",
          "phy_type": "-",
          "sub_type": "100/1000T",
          "duplex_mode": "Full",
          "macaddr": "c8:b5:ad:c3:b2:04",
          "is_uplink": true,
          "port": 145
        },
        {
          "port_number": "1/1/1",
          "status": "Up",
          "type": "Ethernet",
          "mode": "Auto",
          "tx_usage": 232,
          "rx_usage": 234,
          "has_poe": true,
          "poe_state": "Down",
          "oper_state": "Down",
          "admin_state": "Down",
          "speed": 1000,
          "mux": true,
          "trusted": true,
          "power_consumption": 100,
          "allowed_vlan": [
            3333,
            3333,
            3333,
            3333,
            3333,
            3333
          ],
          "vsx_enabled": true,
          "intf_state_down_reason": "Waiting for link",
          "native_vlan": 2,
          "vlan_mode": "Access",
          "slot": "slot1",
          "alignment": "PA_TOP",
          "internal": "Internal",
          "phy_type": "-",
          "sub_type": "100/1000T",
          "duplex_mode": "Full",
          "macaddr": "c8:b5:ad:c3:b2:04",
          "is_uplink": true,
          "port": 145
        },
        {
          "port_number": "1/1/1",
          "status": "Up",
          "type": "Ethernet",
          "mode": "Auto",
          "tx_usage": 232,
          "rx_usage": 234,
          "has_poe": true,
          "poe_state": "Down",
          "oper_state": "Down",
          "admin_state": "Down",
          "speed": 1000,
          "mux": true,
          "trusted": true,
          "power_consumption": 100,
          "allowed_vlan": [
            3333,
            3333,
            3333,
            3333
          ],
          "vsx_enabled": false,
          "intf_state_down_reason": "Waiting for link",
          "native_vlan": 2,
          "vlan_mode": "Access",
          "slot": "slot1",
          "alignment": "PA_TOP",
          "internal": "Internal",
          "phy_type": "-",
          "sub_type": "100/1000T",
          "duplex_mode": "Full",
          "macaddr": "c8:b5:ad:c3:b2:04",
          "is_uplink": false,
          "port": 145
        },
        {
          "port_number": "1/1/1",
          "status": "Up",
          "type": "Ethernet",
          "mode": "Auto",
          "tx_usage": 232,
          "rx_usage": 234,
          "has_poe": true,
          "poe_state": "Down",
          "oper_state": "Down",
          "admin_state": "Down",
          "speed": 1000,
          "mux": true,
          "trusted": true,
          "power_consumption": 100,
          "allowed_vlan": [
            3333,
            3333,
            3333,
            3333,
            3333
          ],
          "vsx_enabled": true,
          "intf_state_down_reason": "Waiting for link",
          "native_vlan": 2,
          "vlan_mode": "Access",
          "slot": "slot1",
          "alignment": "PA_TOP",
          "internal": "Internal",
          "phy_type": "-",
          "sub_type": "100/1000T",
          "duplex_mode": "Full",
          "macaddr": "c8:b5:ad:c3:b2:04",
          "is_uplink": false,
          "port": 145
        }
      ],
      "stack_ports": [
        {
          "port_number": "1/1/25",
          "status": "Up"
        },
        {
          "port_number": "1/1/25",
          "status": "Up"
        },
        {
          "port_number": "1/1/25",
          "status": "Up"
        }
      ],
      "total": 28
    },
    {
      "count": 6,
      "serial": "ST756576",
      "ports": [
        {
          "port_number": "1/1/1",
          "status": "Up",
          "type": "Ethernet",
          "mode": "Auto",
          "tx_usage": 232,
          "rx_usage": 234,
          "has_poe": true,
          "poe_state": "Down",
          "oper_state": "Down",
          "admin_state": "Down",
          "speed": 1000,
          "mux": true,
          "trusted": true,
          "power_consumption": 100,
          "allowed_vlan": [
            3333,
            3333
          ],
          "vsx_enabled": true,
          "intf_state_down_reason": "Waiting for link",
          "native_vlan": 2,
          "vlan_mode": "Access",
          "slot": "slot1",
          "alignment": "PA_TOP",
          "internal": "Internal",
          "phy_type": "-",
          "sub_type": "100/1000T",
          "duplex_mode": "Full",
          "macaddr": "c8:b5:ad:c3:b2:04",
          "is_uplink": true,
          "port": 145
        },
        {
          "port_number": "1/1/1",
          "status": "Up",
          "type": "Ethernet",
          "mode": "Auto",
          "tx_usage": 232,
          "rx_usage": 234,
          "has_poe": true,
          "poe_state": "Down",
          "oper_state": "Down",
          "admin_state": "Down",
          "speed": 1000,
          "mux": true,
          "trusted": true,
          "power_consumption": 100,
          "allowed_vlan": [
            3333,
            3333
          ],
          "vsx_enabled": false,
          "intf_state_down_reason": "Waiting for link",
          "native_vlan": 2,
          "vlan_mode": "Access",
          "slot": "slot1",
          "alignment": "PA_TOP",
          "internal": "Internal",
          "phy_type": "-",
          "sub_type": "100/1000T",
          "duplex_mode": "Full",
          "macaddr": "c8:b5:ad:c3:b2:04",
          "is_uplink": false,
          "port": 145
        },
        {
          "port_number": "1/1/1",
          "status": "Up",
          "type": "Ethernet",
          "mode": "Auto",
          "tx_usage": 232,
          "rx_usage": 234,
          "has_poe": true,
          "poe_state": "Down",
          "oper_state": "Down",
          "admin_state": "Down",
          "speed": 1000,
          "mux": true,
          "trusted": true,
          "power_consumption": 100,
          "allowed_vlan": [
            3333
          ],
          "vsx_enabled": false,
          "intf_state_down_reason": "Waiting for link",
          "native_vlan": 2,
          "vlan_mode": "Access",
          "slot": "slot1",
          "alignment": "PA_TOP",
          "internal": "Internal",
          "phy_type": "-",
          "sub_type": "100/1000T",
          "duplex_mode": "Full",
          "macaddr": "c8:b5:ad:c3:b2:04",
          "is_uplink": true,
          "port": 145
        },
        {
          "port_number": "1/1/1",
          "status": "Up",
          "type": "Ethernet",
          "mode": "Auto",
          "tx_usage": 232,
          "rx_usage": 234,
          "has_poe": true,
          "poe_state": "Down",
          "oper_state": "Down",
          "admin_state": "Down",
          "speed": 1000,
          "mux": true,
          "trusted": true,
          "power_consumption": 100,
          "allowed_vlan": [
            3333,
            3333,
            3333,
            3333,
            3333,
            3333,
            3333,
            3333
          ],
          "vsx_enabled": false,
          "intf_state_down_reason": "Waiting for link",
          "native_vlan": 2,
          "vlan_mode": "Access",
          "slot": "slot1",
          "alignment": "PA_TOP",
          "internal": "Internal",
          "phy_type": "-",
          "sub_type": "100/1000T",
          "duplex_mode": "Full",
          "macaddr": "c8:b5:ad:c3:b2:04",
          "is_uplink": false,
          "port": 145
        }
      ],
      "stack_ports": [
        {
          "port_number": "1/1/25",
          "status": "Up"
        },
        {
          "port_number": "1/1/25",
          "status": "Up"
        }
      ],
      "total": 28
    },
    {
      "count": 6,
      "serial": "ST756576",
      "ports": [
        {
          "port_number": "1/1/1",
          "status": "Up",
          "type": "Ethernet",
          "mode": "Auto",
          "tx_usage": 232,
          "rx_usage": 234,
          "has_poe": true,
          "poe_state": "Down",
          "oper_state": "Down",
          "admin_state": "Down",
          "speed": 1000,
          "mux": true,
          "trusted": true,
          "power_consumption": 100,
          "allowed_vlan": [
            3333,
            3333,
            3333,
            3333
          ],
          "vsx_enabled": true,
          "intf_state_down_reason": "Waiting for link",
          "native_vlan": 2,
          "vlan_mode": "Access",
          "slot": "slot1",
          "alignment": "PA_TOP",
          "internal": "Internal",
          "phy_type": "-",
          "sub_type": "100/1000T",
          "duplex_mode": "Full",
          "macaddr": "c8:b5:ad:c3:b2:04",
          "is_uplink": false,
          "port": 145
        },
        {
          "port_number": "1/1/1",
          "status": "Up",
          "type": "Ethernet",
          "mode": "Auto",
          "tx_usage": 232,
          "rx_usage": 234,
          "has_poe": true,
          "poe_state": "Down",
          "oper_state": "Down",
          "admin_state": "Down",
          "speed": 1000,
          "mux": true,
          "trusted": true,
          "power_consumption": 100,
          "allowed_vlan": [
            3333,
            3333,
            3333,
            3333,
            3333,
            3333
          ],
          "vsx_enabled": true,
          "intf_state_down_reason": "Waiting for link",
          "native_vlan": 2,
          "vlan_mode": "Access",
          "slot": "slot1",
          "alignment": "PA_TOP",
          "internal": "Internal",
          "phy_type": "-",
          "sub_type": "100/1000T",
          "duplex_mode": "Full",
          "macaddr": "c8:b5:ad:c3:b2:04",
          "is_uplink": false,
          "port": 145
        },
        {
          "port_number": "1/1/1",
          "status": "Up",
          "type": "Ethernet",
          "mode": "Auto",
          "tx_usage": 232,
          "rx_usage": 234,
          "has_poe": true,
          "poe_state": "Down",
          "oper_state": "Down",
          "admin_state": "Down",
          "speed": 1000,
          "mux": true,
          "trusted": true,
          "power_consumption": 100,
          "allowed_vlan": [
            3333,
            3333,
            3333,
            3333,
            3333,
            3333,
            3333
          ],
          "vsx_enabled": true,
          "intf_state_down_reason": "Waiting for link",
          "native_vlan": 2,
          "vlan_mode": "Access",
          "slot": "slot1",
          "alignment": "PA_TOP",
          "internal": "Internal",
          "phy_type": "-",
          "sub_type": "100/1000T",
          "duplex_mode": "Full",
          "macaddr": "c8:b5:ad:c3:b2:04",
          "is_uplink": true,
          "port": 145
        },
        {
          "port_number": "1/1/1",
          "status": "Up",
          "type": "Ethernet",
          "mode": "Auto",
          "tx_usage": 232,
          "rx_usage": 234,
          "has_poe": true,
          "poe_state": "Down",
          "oper_state": "Down",
          "admin_state": "Down",
          "speed": 1000,
          "mux": true,
          "trusted": true,
          "power_consumption": 100,
          "allowed_vlan": [
            3333,
            3333,
            3333
          ],
          "vsx_enabled": false,
          "intf_state_down_reason": "Waiting for link",
          "native_vlan": 2,
          "vlan_mode": "Access",
          "slot": "slot1",
          "alignment": "PA_TOP",
          "internal": "Internal",
          "phy_type": "-",
          "sub_type": "100/1000T",
          "duplex_mode": "Full",
          "macaddr": "c8:b5:ad:c3:b2:04",
          "is_uplink": true,
          "port": 145
        },
        {
          "port_number": "1/1/1",
          "status": "Up",
          "type": "Ethernet",
          "mode": "Auto",
          "tx_usage": 232,
          "rx_usage": 234,
          "has_poe": true,
          "poe_state": "Down",
          "oper_state": "Down",
          "admin_state": "Down",
          "speed": 1000,
          "mux": true,
          "trusted": true,
          "power_consumption": 100,
          "allowed_vlan": [
            3333,
            3333,
            3333,
            3333,
            3333,
            3333,
            3333
          ],
          "vsx_enabled": false,
          "intf_state_down_reason": "Waiting for link",
          "native_vlan": 2,
          "vlan_mode": "Access",
          "slot": "slot1",
          "alignment": "PA_TOP",
          "internal": "Internal",
          "phy_type": "-",
          "sub_type": "100/1000T",
          "duplex_mode": "Full",
          "macaddr": "c8:b5:ad:c3:b2:04",
          "is_uplink": false,
          "port": 145
        },
        {
          "port_number": "1/1/1",
          "status": "Up",
          "type": "Ethernet",
          "mode": "Auto",
          "tx_usage": 232,
          "rx_usage": 234,
          "has_poe": true,
          "poe_state": "Down",
          "oper_state": "Down",
          "admin_state": "Down",
          "speed": 1000,
          "mux": true,
          "trusted": true,
          "power_consumption": 100,
          "allowed_vlan": [
            3333,
            3333
          ],
          "vsx_enabled": false,
          "intf_state_down_reason": "Waiting for link",
          "native_vlan": 2,
          "vlan_mode": "Access",
          "slot": "slot1",
          "alignment": "PA_TOP",
          "internal": "Internal",
          "phy_type": "-",
          "sub_type": "100/1000T",
          "duplex_mode": "Full",
          "macaddr": "c8:b5:ad:c3:b2:04",
          "is_uplink": false,
          "port": 145
        },
        {
          "port_number": "1/1/1",
          "status": "Up",
          "type": "Ethernet",
          "mode": "Auto",
          "tx_usage": 232,
          "rx_usage": 234,
          "has_poe": true,
          "poe_state": "Down",
          "oper_state": "Down",
          "admin_state": "Down",
          "speed": 1000,
          "mux": true,
          "trusted": true,
          "power_consumption": 100,
          "allowed_vlan": [
            3333,
            3333,
            3333,
            3333,
            3333,
            3333,
            3333,
            3333
          ],
          "vsx_enabled": false,
          "intf_state_down_reason": "Waiting for link",
          "native_vlan": 2,
          "vlan_mode": "Access",
          "slot": "slot1",
          "alignment": "PA_TOP",
          "internal": "Internal",
          "phy_type": "-",
          "sub_type": "100/1000T",
          "duplex_mode": "Full",
          "macaddr": "c8:b5:ad:c3:b2:04",
          "is_uplink": false,
          "port": 145
        },
        {
          "port_number": "1/1/1",
          "status": "Up",
          "type": "Ethernet",
          "mode": "Auto",
          "tx_usage": 232,
          "rx_usage": 234,
          "has_poe": true,
          "poe_state": "Down",
          "oper_state": "Down",
          "admin_state": "Down",
          "speed": 1000,
          "mux": true,
          "trusted": true,
          "power_consumption": 100,
          "allowed_vlan": [
            3333,
            3333,
            3333,
            3333,
            3333
          ],
          "vsx_enabled": false,
          "intf_state_down_reason": "Waiting for link",
          "native_vlan": 2,
          "vlan_mode": "Access",
          "slot": "slot1",
          "alignment": "PA_TOP",
          "internal": "Internal",
          "phy_type": "-",
          "sub_type": "100/1000T",
          "duplex_mode": "Full",
          "macaddr": "c8:b5:ad:c3:b2:04",
          "is_uplink": true,
          "port": 145
        },
        {
          "port_number": "1/1/1",
          "status": "Up",
          "type": "Ethernet",
          "mode": "Auto",
          "tx_usage": 232,
          "rx_usage": 234,
          "has_poe": true,
          "poe_state": "Down",
          "oper_state": "Down",
          "admin_state": "Down",
          "speed": 1000,
          "mux": true,
          "trusted": true,
          "power_consumption": 100,
          "allowed_vlan": [
            3333,
            3333,
            3333,
            3333,
            3333
          ],
          "vsx_enabled": false,
          "intf_state_down_reason": "Waiting for link",
          "native_vlan": 2,
          "vlan_mode": "Access",
          "slot": "slot1",
          "alignment": "PA_TOP",
          "internal": "Internal",
          "phy_type": "-",
          "sub_type": "100/1000T",
          "duplex_mode": "Full",
          "macaddr": "c8:b5:ad:c3:b2:04",
          "is_uplink": false,
          "port": 145
        },
        {
          "port_number": "1/1/1",
          "status": "Up",
          "type": "Ethernet",
          "mode": "Auto",
          "tx_usage": 232,
          "rx_usage": 234,
          "has_poe": true,
          "poe_state": "Down",
          "oper_state": "Down",
          "admin_state": "Down",
          "speed": 1000,
          "mux": true,
          "trusted": true,
          "power_consumption": 100,
          "allowed_vlan": [
            3333,
            3333,
            3333,
            3333,
            3333,
            3333
          ],
          "vsx_enabled": true,
          "intf_state_down_reason": "Waiting for link",
          "native_vlan": 2,
          "vlan_mode": "Access",
          "slot": "slot1",
          "alignment": "PA_TOP",
          "internal": "Internal",
          "phy_type": "-",
          "sub_type": "100/1000T",
          "duplex_mode": "Full",
          "macaddr": "c8:b5:ad:c3:b2:04",
          "is_uplink": true,
          "port": 145
        }
      ],
      "stack_ports": [
        {
          "port_number": "1/1/25",
          "status": "Up"
        },
        {
          "port_number": "1/1/25",
          "status": "Up"
        },
        {
          "port_number": "1/1/25",
          "status": "Up"
        },
        {
          "port_number": "1/1/25",
          "status": "Up"
        },
        {
          "port_number": "1/1/25",
          "status": "Up"
        },
        {
          "port_number": "1/1/25",
          "status": "Up"
        },
        {
          "port_number": "1/1/25",
          "status": "Up"
        },
        {
          "port_number": "1/1/25",
          "status": "Up"
        },
        {
          "port_number": "1/1/25",
          "status": "Up"
        },
        {
          "port_number": "1/1/25",
          "status": "Up"
        }
      ],
      "total": 28
    },
    {
      "count": 6,
      "serial": "ST756576",
      "ports": [
        {
          "port_number": "1/1/1",
          "status": "Up",
          "type": "Ethernet",
          "mode": "Auto",
          "tx_usage": 232,
          "rx_usage": 234,
          "has_poe": true,
          "poe_state": "Down",
          "oper_state": "Down",
          "admin_state": "Down",
          "speed": 1000,
          "mux": true,
          "trusted": true,
          "power_consumption": 100,
          "allowed_vlan": [
            3333,
            3333,
            3333,
            3333,
            3333,
            3333,
            3333,
            3333,
            3333
          ],
          "vsx_enabled": false,
          "intf_state_down_reason": "Waiting for link",
          "native_vlan": 2,
          "vlan_mode": "Access",
          "slot": "slot1",
          "alignment": "PA_TOP",
          "internal": "Internal",
          "phy_type": "-",
          "sub_type": "100/1000T",
          "duplex_mode": "Full",
          "macaddr": "c8:b5:ad:c3:b2:04",
          "is_uplink": true,
          "port": 145
        },
        {
          "port_number": "1/1/1",
          "status": "Up",
          "type": "Ethernet",
          "mode": "Auto",
          "tx_usage": 232,
          "rx_usage": 234,
          "has_poe": true,
          "poe_state": "Down",
          "oper_state": "Down",
          "admin_state": "Down",
          "speed": 1000,
          "mux": true,
          "trusted": true,
          "power_consumption": 100,
          "allowed_vlan": [
            3333,
            3333,
            3333,
            3333,
            3333,
            3333,
            3333,
            3333
          ],
          "vsx_enabled": true,
          "intf_state_down_reason": "Waiting for link",
          "native_vlan": 2,
          "vlan_mode": "Access",
          "slot": "slot1",
          "alignment": "PA_TOP",
          "internal": "Internal",
          "phy_type": "-",
          "sub_type": "100/1000T",
          "duplex_mode": "Full",
          "macaddr": "c8:b5:ad:c3:b2:04",
          "is_uplink": false,
          "port": 145
        },
        {
          "port_number": "1/1/1",
          "status": "Up",
          "type": "Ethernet",
          "mode": "Auto",
          "tx_usage": 232,
          "rx_usage": 234,
          "has_poe": true,
          "poe_state": "Down",
          "oper_state": "Down",
          "admin_state": "Down",
          "speed": 1000,
          "mux": true,
          "trusted": true,
          "power_consumption": 100,
          "allowed_vlan": [
            3333,
            3333,
            3333,
            3333,
            3333
          ],
          "vsx_enabled": true,
          "intf_state_down_reason": "Waiting for link",
          "native_vlan": 2,
          "vlan_mode": "Access",
          "slot": "slot1",
          "alignment": "PA_TOP",
          "internal": "Internal",
          "phy_type": "-",
          "sub_type": "100/1000T",
          "duplex_mode": "Full",
          "macaddr": "c8:b5:ad:c3:b2:04",
          "is_uplink": false,
          "port": 145
        },
        {
          "port_number": "1/1/1",
          "status": "Up",
          "type": "Ethernet",
          "mode": "Auto",
          "tx_usage": 232,
          "rx_usage": 234,
          "has_poe": true,
          "poe_state": "Down",
          "oper_state": "Down",
          "admin_state": "Down",
          "speed": 1000,
          "mux": true,
          "trusted": true,
          "power_consumption": 100,
          "allowed_vlan": [
            3333,
            3333,
            3333,
            3333,
            3333,
            3333,
            3333,
            3333
          ],
          "vsx_enabled": false,
          "intf_state_down_reason": "Waiting for link",
          "native_vlan": 2,
          "vlan_mode": "Access",
          "slot": "slot1",
          "alignment": "PA_TOP",
          "internal": "Internal",
          "phy_type": "-",
          "sub_type": "100/1000T",
          "duplex_mode": "Full",
          "macaddr": "c8:b5:ad:c3:b2:04",
          "is_uplink": false,
          "port": 145
        },
        {
          "port_number": "1/1/1",
          "status": "Up",
          "type": "Ethernet",
          "mode": "Auto",
          "tx_usage": 232,
          "rx_usage": 234,
          "has_poe": true,
          "poe_state": "Down",
          "oper_state": "Down",
          "admin_state": "Down",
          "speed": 1000,
          "mux": true,
          "trusted": true,
          "power_consumption": 100,
          "allowed_vlan": [
            3333,
            3333,
            3333,
            3333,
            3333,
            3333,
            3333,
            3333
          ],
          "vsx_enabled": false,
          "intf_state_down_reason": "Waiting for link",
          "native_vlan": 2,
          "vlan_mode": "Access",
          "slot": "slot1",
          "alignment": "PA_TOP",
          "internal": "Internal",
          "phy_type": "-",
          "sub_type": "100/1000T",
          "duplex_mode": "Full",
          "macaddr": "c8:b5:ad:c3:b2:04",
          "is_uplink": true,
          "port": 145
        },
        {
          "port_number": "1/1/1",
          "status": "Up",
          "type": "Ethernet",
          "mode": "Auto",
          "tx_usage": 232,
          "rx_usage": 234,
          "has_poe": true,
          "poe_state": "Down",
          "oper_state": "Down",
          "admin_state": "Down",
          "speed": 1000,
          "mux": true,
          "trusted": true,
          "power_consumption": 100,
          "allowed_vlan": [
            3333
          ],
          "vsx_enabled": false,
          "intf_state_down_reason": "Waiting for link",
          "native_vlan": 2,
          "vlan_mode": "Access",
          "slot": "slot1",
          "alignment": "PA_TOP",
          "internal": "Internal",
          "phy_type": "-",
          "sub_type": "100/1000T",
          "duplex_mode": "Full",
          "macaddr": "c8:b5:ad:c3:b2:04",
          "is_uplink": false,
          "port": 145
        },
        {
          "port_number": "1/1/1",
          "status": "Up",
          "type": "Ethernet",
          "mode": "Auto",
          "tx_usage": 232,
          "rx_usage": 234,
          "has_poe": true,
          "poe_state": "Down",
          "oper_state": "Down",
          "admin_state": "Down",
          "speed": 1000,
          "mux": true,
          "trusted": true,
          "power_consumption": 100,
          "allowed_vlan": [
            3333,
            3333,
            3333,
            3333,
            3333
          ],
          "vsx_enabled": false,
          "intf_state_down_reason": "Waiting for link",
          "native_vlan": 2,
          "vlan_mode": "Access",
          "slot": "slot1",
          "alignment": "PA_TOP",
          "internal": "Internal",
          "phy_type": "-",
          "sub_type": "100/1000T",
          "duplex_mode": "Full",
          "macaddr": "c8:b5:ad:c3:b2:04",
          "is_uplink": false,
          "port": 145
        },
        {
          "port_number": "1/1/1",
          "status": "Up",
          "type": "Ethernet",
          "mode": "Auto",
          "tx_usage": 232,
          "rx_usage": 234,
          "has_poe": true,
          "poe_state": "Down",
          "oper_state": "Down",
          "admin_state": "Down",
          "speed": 1000,
          "mux": true,
          "trusted": true,
          "power_consumption": 100,
          "allowed_vlan": [
            3333,
            3333,
            3333,
            3333
          ],
          "vsx_enabled": true,
          "intf_state_down_reason": "Waiting for link",
          "native_vlan": 2,
          "vlan_mode": "Access",
          "slot": "slot1",
          "alignment": "PA_TOP",
          "internal": "Internal",
          "phy_type": "-",
          "sub_type": "100/1000T",
          "duplex_mode": "Full",
          "macaddr": "c8:b5:ad:c3:b2:04",
          "is_uplink": false,
          "port": 145
        },
        {
          "port_number": "1/1/1",
          "status": "Up",
          "type": "Ethernet",
          "mode": "Auto",
          "tx_usage": 232,
          "rx_usage": 234,
          "has_poe": true,
          "poe_state": "Down",
          "oper_state": "Down",
          "admin_state": "Down",
          "speed": 1000,
          "mux": true,
          "trusted": true,
          "power_consumption": 100,
          "allowed_vlan": [
            3333,
            3333,
            3333,
            3333,
            3333
          ],
          "vsx_enabled": true,
          "intf_state_down_reason": "Waiting for link",
          "native_vlan": 2,
          "vlan_mode": "Access",
          "slot": "slot1",
          "alignment": "PA_TOP",
          "internal": "Internal",
          "phy_type": "-",
          "sub_type": "100/1000T",
          "duplex_mode": "Full",
          "macaddr": "c8:b5:ad:c3:b2:04",
          "is_uplink": true,
          "port": 145
        },
        {
          "port_number": "1/1/1",
          "status": "Up",
          "type": "Ethernet",
          "mode": "Auto",
          "tx_usage": 232,
          "rx_usage": 234,
          "has_poe": true,
          "poe_state": "Down",
          "oper_state": "Down",
          "admin_state": "Down",
          "speed": 1000,
          "mux": true,
          "trusted": true,
          "power_consumption": 100,
          "allowed_vlan": [
            3333,
            3333,
            3333,
            3333,
            3333,
            3333,
            3333,
            3333,
            3333
          ],
          "vsx_enabled": true,
          "intf_state_down_reason": "Waiting for link",
          "native_vlan": 2,
          "vlan_mode": "Access",
          "slot": "slot1",
          "alignment": "PA_TOP",
          "internal": "Internal",
          "phy_type": "-",
          "sub_type": "100/1000T",
          "duplex_mode": "Full",
          "macaddr": "c8:b5:ad:c3:b2:04",
          "is_uplink": false,
          "port": 145
        }
      ],
      "stack_ports": [
        {
          "port_number": "1/1/25",
          "status": "Up"
        },
        {
          "port_number": "1/1/25",
          "status": "Up"
        },
        {
          "port_number": "1/1/25",
          "status": "Up"
        },
        {
          "port_number": "1/1/25",
          "status": "Up"
        },
        {
          "port_number": "1/1/25",
          "status": "Up"
        },
        {
          "port_number": "1/1/25",
          "status": "Up"
        }
      ],
      "total": 28
    },
    {
      "count": 6,
      "serial": "ST756576",
      "ports": [
        {
          "port_number": "1/1/1",
          "status": "Up",
          "type": "Ethernet",
          "mode": "Auto",
          "tx_usage": 232,
          "rx_usage": 234,
          "has_poe": true,
          "poe_state": "Down",
          "oper_state": "Down",
          "admin_state": "Down",
          "speed": 1000,
          "mux": true,
          "trusted": true,
          "power_consumption": 100,
          "allowed_vlan": [
            3333,
            3333,
            3333,
            3333
          ],
          "vsx_enabled": true,
          "intf_state_down_reason": "Waiting for link",
          "native_vlan": 2,
          "vlan_mode": "Access",
          "slot": "slot1",
          "alignment": "PA_TOP",
          "internal": "Internal",
          "phy_type": "-",
          "sub_type": "100/1000T",
          "duplex_mode": "Full",
          "macaddr": "c8:b5:ad:c3:b2:04",
          "is_uplink": true,
          "port": 145
        },
        {
          "port_number": "1/1/1",
          "status": "Up",
          "type": "Ethernet",
          "mode": "Auto",
          "tx_usage": 232,
          "rx_usage": 234,
          "has_poe": true,
          "poe_state": "Down",
          "oper_state": "Down",
          "admin_state": "Down",
          "speed": 1000,
          "mux": true,
          "trusted": true,
          "power_consumption": 100,
          "allowed_vlan": [
            3333,
            3333,
            3333
          ],
          "vsx_enabled": false,
          "intf_state_down_reason": "Waiting for link",
          "native_vlan": 2,
          "vlan_mode": "Access",
          "slot": "slot1",
          "alignment": "PA_TOP",
          "internal": "Internal",
          "phy_type": "-",
          "sub_type": "100/1000T",
          "duplex_mode": "Full",
          "macaddr": "c8:b5:ad:c3:b2:04",
          "is_uplink": true,
          "port": 145
        },
        {
          "port_number": "1/1/1",
          "status": "Up",
          "type": "Ethernet",
          "mode": "Auto",
          "tx_usage": 232,
          "rx_usage": 234,
          "has_poe": true,
          "poe_state": "Down",
          "oper_state": "Down",
          "admin_state": "Down",
          "speed": 1000,
          "mux": true,
          "trusted": true,
          "power_consumption": 100,
          "allowed_vlan": [
            3333,
            3333,
            3333
          ],
          "vsx_enabled": false,
          "intf_state_down_reason": "Waiting for link",
          "native_vlan": 2,
          "vlan_mode": "Access",
          "slot": "slot1",
          "alignment": "PA_TOP",
          "internal": "Internal",
          "phy_type": "-",
          "sub_type": "100/1000T",
          "duplex_mode": "Full",
          "macaddr": "c8:b5:ad:c3:b2:04",
          "is_uplink": true,
          "port": 145
        }
      ],
      "stack_ports": [
        {
          "port_number": "1/1/25",
          "status": "Up"
        },
        {
          "port_number": "1/1/25",
          "status": "Up"
        }
      ],
      "total": 28
    },
    {
      "count": 6,
      "serial": "ST756576",
      "ports": [
        {
          "port_number": "1/1/1",
          "status": "Up",
          "type": "Ethernet",
          "mode": "Auto",
          "tx_usage": 232,
          "rx_usage": 234,
          "has_poe": true,
          "poe_state": "Down",
          "oper_state": "Down",
          "admin_state": "Down",
          "speed": 1000,
          "mux": true,
          "trusted": true,
          "power_consumption": 100,
          "allowed_vlan": [
            3333,
            3333,
            3333,
            3333,
            3333,
            3333,
            3333,
            3333,
            3333
          ],
          "vsx_enabled": true,
          "intf_state_down_reason": "Waiting for link",
          "native_vlan": 2,
          "vlan_mode": "Access",
          "slot": "slot1",
          "alignment": "PA_TOP",
          "internal": "Internal",
          "phy_type": "-",
          "sub_type": "100/1000T",
          "duplex_mode": "Full",
          "macaddr": "c8:b5:ad:c3:b2:04",
          "is_uplink": false,
          "port": 145
        },
        {
          "port_number": "1/1/1",
          "status": "Up",
          "type": "Ethernet",
          "mode": "Auto",
          "tx_usage": 232,
          "rx_usage": 234,
          "has_poe": true,
          "poe_state": "Down",
          "oper_state": "Down",
          "admin_state": "Down",
          "speed": 1000,
          "mux": true,
          "trusted": true,
          "power_consumption": 100,
          "allowed_vlan": [
            3333,
            3333,
            3333,
            3333,
            3333,
            3333,
            3333,
            3333
          ],
          "vsx_enabled": true,
          "intf_state_down_reason": "Waiting for link",
          "native_vlan": 2,
          "vlan_mode": "Access",
          "slot": "slot1",
          "alignment": "PA_TOP",
          "internal": "Internal",
          "phy_type": "-",
          "sub_type": "100/1000T",
          "duplex_mode": "Full",
          "macaddr": "c8:b5:ad:c3:b2:04",
          "is_uplink": false,
          "port": 145
        },
        {
          "port_number": "1/1/1",
          "status": "Up",
          "type": "Ethernet",
          "mode": "Auto",
          "tx_usage": 232,
          "rx_usage": 234,
          "has_poe": true,
          "poe_state": "Down",
          "oper_state": "Down",
          "admin_state": "Down",
          "speed": 1000,
          "mux": true,
          "trusted": true,
          "power_consumption": 100,
          "allowed_vlan": [
            3333
          ],
          "vsx_enabled": false,
          "intf_state_down_reason": "Waiting for link",
          "native_vlan": 2,
          "vlan_mode": "Access",
          "slot": "slot1",
          "alignment": "PA_TOP",
          "internal": "Internal",
          "phy_type": "-",
          "sub_type": "100/1000T",
          "duplex_mode": "Full",
          "macaddr": "c8:b5:ad:c3:b2:04",
          "is_uplink": false,
          "port": 145
        }
      ],
      "stack_ports": [
        {
          "port_number": "1/1/25",
          "status": "Up"
        },
        {
          "port_number": "1/1/25",
          "status": "Up"
        }
      ],
      "total": 28
    },
    {
      "count": 6,
      "serial": "ST756576",
      "ports": [
        {
          "port_number": "1/1/1",
          "status": "Up",
          "type": "Ethernet",
          "mode": "Auto",
          "tx_usage": 232,
          "rx_usage": 234,
          "has_poe": true,
          "poe_state": "Down",
          "oper_state": "Down",
          "admin_state": "Down",
          "speed": 1000,
          "mux": true,
          "trusted": true,
          "power_consumption": 100,
          "allowed_vlan": [
            3333,
            3333
          ],
          "vsx_enabled": false,
          "intf_state_down_reason": "Waiting for link",
          "native_vlan": 2,
          "vlan_mode": "Access",
          "slot": "slot1",
          "alignment": "PA_TOP",
          "internal": "Internal",
          "phy_type": "-",
          "sub_type": "100/1000T",
          "duplex_mode": "Full",
          "macaddr": "c8:b5:ad:c3:b2:04",
          "is_uplink": false,
          "port": 145
        },
        {
          "port_number": "1/1/1",
          "status": "Up",
          "type": "Ethernet",
          "mode": "Auto",
          "tx_usage": 232,
          "rx_usage": 234,
          "has_poe": true,
          "poe_state": "Down",
          "oper_state": "Down",
          "admin_state": "Down",
          "speed": 1000,
          "mux": true,
          "trusted": true,
          "power_consumption": 100,
          "allowed_vlan": [
            3333,
            3333,
            3333,
            3333,
            3333
          ],
          "vsx_enabled": false,
          "intf_state_down_reason": "Waiting for link",
          "native_vlan": 2,
          "vlan_mode": "Access",
          "slot": "slot1",
          "alignment": "PA_TOP",
          "internal": "Internal",
          "phy_type": "-",
          "sub_type": "100/1000T",
          "duplex_mode": "Full",
          "macaddr": "c8:b5:ad:c3:b2:04",
          "is_uplink": true,
          "port": 145
        },
        {
          "port_number": "1/1/1",
          "status": "Up",
          "type": "Ethernet",
          "mode": "Auto",
          "tx_usage": 232,
          "rx_usage": 234,
          "has_poe": true,
          "poe_state": "Down",
          "oper_state": "Down",
          "admin_state": "Down",
          "speed": 1000,
          "mux": true,
          "trusted": true,
          "power_consumption": 100,
          "allowed_vlan": [
            3333,
            3333,
            3333,
            3333,
            3333,
            3333,
            3333,
            3333
          ],
          "vsx_enabled": true,
          "intf_state_down_reason": "Waiting for link",
          "native_vlan": 2,
          "vlan_mode": "Access",
          "slot": "slot1",
          "alignment": "PA_TOP",
          "internal": "Internal",
          "phy_type": "-",
          "sub_type": "100/1000T",
          "duplex_mode": "Full",
          "macaddr": "c8:b5:ad:c3:b2:04",
          "is_uplink": true,
          "port": 145
        },
        {
          "port_number": "1/1/1",
          "status": "Up",
          "type": "Ethernet",
          "mode": "Auto",
          "tx_usage": 232,
          "rx_usage": 234,
          "has_poe": true,
          "poe_state": "Down",
          "oper_state": "Down",
          "admin_state": "Down",
          "speed": 1000,
          "mux": true,
          "trusted": true,
          "power_consumption": 100,
          "allowed_vlan": [
            3333,
            3333
          ],
          "vsx_enabled": false,
          "intf_state_down_reason": "Waiting for link",
          "native_vlan": 2,
          "vlan_mode": "Access",
          "slot": "slot1",
          "alignment": "PA_TOP",
          "internal": "Internal",
          "phy_type": "-",
          "sub_type": "100/1000T",
          "duplex_mode": "Full",
          "macaddr": "c8:b5:ad:c3:b2:04",
          "is_uplink": false,
          "port": 145
        },
        {
          "port_number": "1/1/1",
          "status": "Up",
          "type": "Ethernet",
          "mode": "Auto",
          "tx_usage": 232,
          "rx_usage": 234,
          "has_poe": true,
          "poe_state": "Down",
          "oper_state": "Down",
          "admin_state": "Down",
          "speed": 1000,
          "mux": true,
          "trusted": true,
          "power_consumption": 100,
          "allowed_vlan": [
            3333,
            3333,
            3333,
            3333,
            3333,
            3333,
            3333,
            3333
          ],
          "vsx_enabled": false,
          "intf_state_down_reason": "Waiting for link",
          "native_vlan": 2,
          "vlan_mode": "Access",
          "slot": "slot1",
          "alignment": "PA_TOP",
          "internal": "Internal",
          "phy_type": "-",
          "sub_type": "100/1000T",
          "duplex_mode": "Full",
          "macaddr": "c8:b5:ad:c3:b2:04",
          "is_uplink": false,
          "port": 145
        },
        {
          "port_number": "1/1/1",
          "status": "Up",
          "type": "Ethernet",
          "mode": "Auto",
          "tx_usage": 232,
          "rx_usage": 234,
          "has_poe": true,
          "poe_state": "Down",
          "oper_state": "Down",
          "admin_state": "Down",
          "speed": 1000,
          "mux": true,
          "trusted": true,
          "power_consumption": 100,
          "allowed_vlan": [
            3333,
            3333,
            3333,
            3333,
            3333,
            3333,
            3333
          ],
          "vsx_enabled": true,
          "intf_state_down_reason": "Waiting for link",
          "native_vlan": 2,
          "vlan_mode": "Access",
          "slot": "slot1",
          "alignment": "PA_TOP",
          "internal": "Internal",
          "phy_type": "-",
          "sub_type": "100/1000T",
          "duplex_mode": "Full",
          "macaddr": "c8:b5:ad:c3:b2:04",
          "is_uplink": true,
          "port": 145
        },
        {
          "port_number": "1/1/1",
          "status": "Up",
          "type": "Ethernet",
          "mode": "Auto",
          "tx_usage": 232,
          "rx_usage": 234,
          "has_poe": true,
          "poe_state": "Down",
          "oper_state": "Down",
          "admin_state": "Down",
          "speed": 1000,
          "mux": true,
          "trusted": true,
          "power_consumption": 100,
          "allowed_vlan": [
            3333,
            3333,
            3333
          ],
          "vsx_enabled": false,
          "intf_state_down_reason": "Waiting for link",
          "native_vlan": 2,
          "vlan_mode": "Access",
          "slot": "slot1",
          "alignment": "PA_TOP",
          "internal": "Internal",
          "phy_type": "-",
          "sub_type": "100/1000T",
          "duplex_mode": "Full",
          "macaddr": "c8:b5:ad:c3:b2:04",
          "is_uplink": false,
          "port": 145
        },
        {
          "port_number": "1/1/1",
          "status": "Up",
          "type": "Ethernet",
          "mode": "Auto",
          "tx_usage": 232,
          "rx_usage": 234,
          "has_poe": true,
          "poe_state": "Down",
          "oper_state": "Down",
          "admin_state": "Down",
          "speed": 1000,
          "mux": true,
          "trusted": true,
          "power_consumption": 100,
          "allowed_vlan": [
            3333,
            3333,
            3333,
            3333,
            3333
          ],
          "vsx_enabled": false,
          "intf_state_down_reason": "Waiting for link",
          "native_vlan": 2,
          "vlan_mode": "Access",
          "slot": "slot1",
          "alignment": "PA_TOP",
          "internal": "Internal",
          "phy_type": "-",
          "sub_type": "100/1000T",
          "duplex_mode": "Full",
          "macaddr": "c8:b5:ad:c3:b2:04",
          "is_uplink": true,
          "port": 145
        },
        {
          "port_number": "1/1/1",
          "status": "Up",
          "type": "Ethernet",
          "mode": "Auto",
          "tx_usage": 232,
          "rx_usage": 234,
          "has_poe": true,
          "poe_state": "Down",
          "oper_state": "Down",
          "admin_state": "Down",
          "speed": 1000,
          "mux": true,
          "trusted": true,
          "power_consumption": 100,
          "allowed_vlan": [
            3333,
            3333,
            3333,
            3333,
            3333,
            3333
          ],
          "vsx_enabled": true,
          "intf_state_down_reason": "Waiting for link",
          "native_vlan": 2,
          "vlan_mode": "Access",
          "slot": "slot1",
          "alignment": "PA_TOP",
          "internal": "Internal",
          "phy_type": "-",
          "sub_type": "100/1000T",
          "duplex_mode": "Full",
          "macaddr": "c8:b5:ad:c3:b2:04",
          "is_uplink": true,
          "port": 145
        }
      ],
      "stack_ports": [
        {
          "port_number": "1/1/25",
          "status": "Up"
        },
        {
          "port_number": "1/1/25",
          "status": "Up"
        },
        {
          "port_number": "1/1/25",
          "status": "Up"
        },
        {
          "port_number": "1/1/25",
          "status": "Up"
        },
        {
          "port_number": "1/1/25",
          "status": "Up"
        },
        {
          "port_number": "1/1/25",
          "status": "Up"
        },
        {
          "port_number": "1/1/25",
          "status": "Up"
        },
        {
          "port_number": "1/1/25",
          "status": "Up"
        },
        {
          "port_number": "1/1/25",
          "status": "Up"
        }
      ],
      "total": 28
    }
  ]
}