{
  "actions": [
    {
      "name": "findTransportProfilesUsingGET",
      "protocol": "REST",
      "method": "GET",
      "entitypath": "{base_path}/{version}/v1/transport_profiles?{query}",
      "requestSchema": "schema.json",
      "responseSchema": "schema.json",
      "timeout": 0,
      "sendEmpty": false,
      "sendGetBody": false,
      "requestDatatype": "JSON",
      "responseDatatype": "JSON",
      "headers": {},
      "responseObjects": [
        {
          "type": "default",
          "key": "",
          "mockFile": "mockdatafiles/findTransportProfilesUsingGET-default.json"
        }
      ]
    },
    {
      "name": "addUsingPOST",
      "protocol": "REST",
      "method": "POST",
      "entitypath": "{base_path}/{version}/v1/transport_profiles?{query}",
      "requestSchema": "schema.json",
      "responseSchema": "schema.json",
      "timeout": 0,
      "sendEmpty": false,
      "requestDatatype": "JSON",
      "responseDatatype": "JSON",
      "headers": {},
      "responseObjects": [
        {
          "type": "default",
          "key": "",
          "mockFile": "mockdatafiles/addUsingPOST-default.json"
        }
      ]
    },
    {
      "name": "countTransportProfilesUsingGET",
      "protocol": "REST",
      "method": "GET",
      "entitypath": "{base_path}/{version}/v1/transport_profiles/count?{query}",
      "requestSchema": "schema.json",
      "responseSchema": "schema.json",
      "timeout": 0,
      "sendEmpty": false,
      "sendGetBody": false,
      "requestDatatype": "JSON",
      "responseDatatype": "JSON",
      "headers": {},
      "responseObjects": [
        {
          "type": "default",
          "key": "",
          "mockFile": "mockdatafiles/countTransportProfilesUsingGET-default.json"
        }
      ]
    },
    {
      "name": "findDeviceClassesUsingGET",
      "protocol": "REST",
      "method": "GET",
      "entitypath": "{base_path}/{version}/v1/transport_profiles/device_classes?{query}",
      "requestSchema": "schema.json",
      "responseSchema": "schema.json",
      "timeout": 0,
      "sendEmpty": false,
      "sendGetBody": false,
      "requestDatatype": "JSON",
      "responseDatatype": "JSON",
      "headers": {},
      "responseObjects": [
        {
          "type": "default",
          "key": "",
          "mockFile": "mockdatafiles/findDeviceClassesUsingGET-default.json"
        }
      ]
    },
    {
      "name": "getUsingGET",
      "protocol": "REST",
      "method": "GET",
      "entitypath": "{base_path}/{version}/v1/transport_profiles/{pathv1}?{query}",
      "requestSchema": "schema.json",
      "responseSchema": "schema.json",
      "timeout": 0,
      "sendEmpty": false,
      "sendGetBody": false,
      "requestDatatype": "JSON",
      "responseDatatype": "JSON",
      "headers": {},
      "responseObjects": [
        {
          "type": "default",
          "key": "",
          "mockFile": "mockdatafiles/getUsingGET-default.json"
        }
      ]
    },
    {
      "name": "saveUsingPUT",
      "protocol": "REST",
      "method": "PUT",
      "entitypath": "{base_path}/{version}/v1/transport_profiles/{pathv1}?{query}",
      "requestSchema": "schema.json",
      "responseSchema": "schema.json",
      "timeout": 0,
      "sendEmpty": false,
      "requestDatatype": "JSON",
      "responseDatatype": "JSON",
      "headers": {},
      "responseObjects": [
        {
          "type": "default",
          "key": "",
          "mockFile": "mockdatafiles/saveUsingPUT-default.json"
        }
      ]
    },
    {
      "name": "deleteTransportUsingDELETE",
      "protocol": "REST",
      "method": "DELETE",
      "entitypath": "{base_path}/{version}/v1/transport_profiles/{pathv1}?{query}",
      "requestSchema": "schema.json",
      "responseSchema": "schema.json",
      "timeout": 0,
      "sendEmpty": false,
      "requestDatatype": "JSON",
      "responseDatatype": "JSON",
      "headers": {},
      "responseObjects": [
        {
          "type": "default",
          "key": "",
          "mockFile": ""
        }
      ]
    }
  ]
}