{
  "firmware_scheduled_at": 1534885065,
  "status": "Firmware up to date/Newer firmware available/Scheduled/Not applicable",
  "firmware_compliance_version": "6.5.2.0_59123",
  "compliance_scheduled_at": 1534885065
}