{
  "$id": "schema.json",
  "type": "object",
  "schema": "http://json-schema.org/draft-07/schema#",
  "translate": true,
  "dynamicfields": true,
  "properties": {
    "ph_request_type": {
      "type": "string",
      "description": "type of request (internal to adapter)",
      "default": "viewsGetAirgroupServiceQuerySummary",
      "enum": [
        "viewsGetAirgroupServiceQuerySummary",
        "viewsGetAirgroupServerDistribution"
      ],
      "external_name": "ph_request_type"
    },
    "startTime": {
      "type": "number",
      "description": "start time in epoch",
      "parse": false,
      "encode": false,
      "encrypt": {
        "type": "AES",
        "key": ""
      },
      "external_name": "start_time"
    },
    "endTime": {
      "type": "number",
      "description": "stop time in epoch",
      "parse": false,
      "encode": false,
      "encrypt": {
        "type": "AES",
        "key": ""
      },
      "external_name": "end_time"
    }
  },
  "definitions": {}
}