{
  "$id": "schema.json",
  "type": "object",
  "schema": "http://json-schema.org/draft-07/schema#",
  "translate": true,
  "dynamicfields": true,
  "properties": {
    "ph_request_type": {
      "type": "string",
      "description": "type of request (internal to adapter)",
      "default": "apiHandlerBbsNBAPIRetrieveDesireBeacon",
      "enum": [
        "apiHandlerBbsNBAPIRetrieveDesireBeacon",
        "apiHandlerBbsNBAPIRetrieveActualBeacon",
        "apiHandlerBbsNBAPIRetrieveBeaconProfile",
        "apiHandlerBbsNBAPIUpdateDeviceBeacon",
        "apiHandlerBbsNBAPIDeleteDeviceBeacon"
      ],
      "external_name": "ph_request_type"
    },
    "profileId": {
      "type": "string",
      "description": "the ble beacon profile name that ap used",
      "parse": false,
      "encode": false,
      "encrypt": {
        "type": "AES",
        "key": ""
      },
      "external_name": "profile_id"
    },
    "apMac": {
      "type": "string",
      "description": "ap mac address for which to retrieve device beacon",
      "parse": false,
      "encode": false,
      "encrypt": {
        "type": "AES",
        "key": ""
      },
      "external_name": "ap_mac"
    },
    "iotRadioMac": {
      "type": "string",
      "description": "The field used to identify which device change beacon",
      "parse": false,
      "encode": false,
      "encrypt": {
        "type": "AES",
        "key": ""
      },
      "external_name": "iot_radio_mac"
    }
  },
  "definitions": {}
}