{
  "actions": [
    {
      "name": "apiExternalControllerGetSwarmsBandwidthUsageTopn",
      "protocol": "REST",
      "method": "GET",
      "entitypath": "{base_path}/{version}/monitoring/v1/swarms/bandwidth_usage/topn?{query}",
      "requestSchema": "schema.json",
      "responseSchema": "schema.json",
      "timeout": 0,
      "sendEmpty": false,
      "sendGetBody": false,
      "requestDatatype": "JSON",
      "responseDatatype": "JSON",
      "headers": {},
      "responseObjects": [
        {
          "type": "default",
          "key": "",
          "mockFile": "mockdatafiles/apiExternalControllerGetSwarmsBandwidthUsageTopn-default.json"
        }
      ]
    },
    {
      "name": "apiExternalControllerGetSwarmsClientsCountTopn",
      "protocol": "REST",
      "method": "GET",
      "entitypath": "{base_path}/{version}/monitoring/v1/swarms/clients_count/topn?{query}",
      "requestSchema": "schema.json",
      "responseSchema": "schema.json",
      "timeout": 0,
      "sendEmpty": false,
      "sendGetBody": false,
      "requestDatatype": "JSON",
      "responseDatatype": "JSON",
      "headers": {},
      "responseObjects": [
        {
          "type": "default",
          "key": "",
          "mockFile": "mockdatafiles/apiExternalControllerGetSwarmsClientsCountTopn-default.json"
        }
      ]
    },
    {
      "name": "apiExternalControllerGetSwarms",
      "protocol": "REST",
      "method": "GET",
      "entitypath": "{base_path}/{version}/monitoring/v1/swarms?{query}",
      "requestSchema": "schema.json",
      "responseSchema": "schema.json",
      "timeout": 0,
      "sendEmpty": false,
      "sendGetBody": false,
      "requestDatatype": "JSON",
      "responseDatatype": "JSON",
      "headers": {},
      "responseObjects": [
        {
          "type": "default",
          "key": "",
          "mockFile": "mockdatafiles/apiExternalControllerGetSwarms-default.json"
        }
      ]
    },
    {
      "name": "apiExternalControllerGetSwarm",
      "protocol": "REST",
      "method": "GET",
      "entitypath": "{base_path}/{version}/monitoring/v1/swarms/{pathv1}?{query}",
      "requestSchema": "schema.json",
      "responseSchema": "schema.json",
      "timeout": 0,
      "sendEmpty": false,
      "sendGetBody": false,
      "requestDatatype": "JSON",
      "responseDatatype": "JSON",
      "headers": {},
      "responseObjects": [
        {
          "type": "default",
          "key": "",
          "mockFile": "mockdatafiles/apiExternalControllerGetSwarm-default.json"
        }
      ]
    }
  ]
}