{
  "$id": "schema.json",
  "type": "object",
  "schema": "http://json-schema.org/draft-07/schema#",
  "translate": true,
  "dynamicfields": true,
  "properties": {
    "ph_request_type": {
      "type": "string",
      "description": "type of request (internal to adapter)",
      "default": "apiHandlersRecieverGetAllDeviceConfig",
      "enum": [
        "apiHandlersRecieverGetAllDeviceConfig",
        "apiHandlersRecieverGetDeviceConfig",
        "apiHandlersRecieverSetDeviceConfig",
        "apiHandlersFeasibilityGetDeviceConfig",
        "apiHandlersFeasibilitySetDeviceConfig",
        "apiHandlersFeasibilityGetAllDeviceConfig"
      ],
      "external_name": "ph_request_type"
    },
    "tenantId": {
      "type": "string",
      "description": "Customer(Tenant) ID",
      "parse": false,
      "encode": false,
      "encrypt": {
        "type": "AES",
        "key": ""
      },
      "external_name": "tenant_id"
    },
    "apSerial": {
      "type": "string",
      "description": "AP Serial Num",
      "parse": false,
      "encode": false,
      "encrypt": {
        "type": "AES",
        "key": ""
      },
      "external_name": "ap_serial"
    }
  },
  "definitions": {}
}