{
  "$id": "schema.json",
  "type": "object",
  "schema": "http://json-schema.org/draft-07/schema#",
  "translate": true,
  "dynamicfields": true,
  "properties": {
    "ph_request_type": {
      "type": "string",
      "description": "type of request (internal to adapter)",
      "default": "apiNotificationsExternalApiGetCountBySeverityApi",
      "enum": [
        "apiNotificationsExternalApiGetCountBySeverityApi",
        "apiNotificationsExternalApiGetNotificationsApi",
        "apiNotificationsExternalApiAcknowledgeNotifications",
        "apiNotificationsExternalApiAcknowledgeNotification"
      ],
      "external_name": "ph_request_type"
    },
    "customerId": {
      "type": "string",
      "description": "MSP user can filter notifications based on customer id",
      "parse": false,
      "encode": false,
      "encrypt": {
        "type": "AES",
        "key": ""
      },
      "external_name": "customer_id"
    },
    "fromTimestamp": {
      "type": "number",
      "description": "1)start of duration within which alerts are raised\n2)described using Unix Epoch time in seconds",
      "parse": false,
      "encode": false,
      "encrypt": {
        "type": "AES",
        "key": ""
      },
      "external_name": "from_timestamp"
    },
    "toTimestamp": {
      "type": "number",
      "description": "1)end of duration within which alerts are raised\n2)described using Unix Epoch time in seconds",
      "parse": false,
      "encode": false,
      "encrypt": {
        "type": "AES",
        "key": ""
      },
      "external_name": "to_timestamp"
    },
    "calculateTotal": {
      "type": "boolean",
      "description": "Whether to count total items in the response",
      "parse": false,
      "encode": false,
      "encrypt": {
        "type": "AES",
        "key": ""
      },
      "external_name": "calculate_total"
    },
    "notificationId": {
      "type": "string",
      "description": "Notification ID",
      "parse": false,
      "encode": false,
      "encrypt": {
        "type": "AES",
        "key": ""
      },
      "external_name": "notification_id"
    }
  },
  "definitions": {}
}