{
  "call_type": [
    [
      "Skype For Business",
      "Wifi-calling"
    ],
    [
      "Skype For Business",
      "Wifi-calling"
    ]
  ],
  "good_calls": [
    [
      0,
      1
    ],
    [
      0,
      1
    ],
    [
      0,
      1
    ],
    [
      0,
      1
    ]
  ],
  "fair_calls": [
    [
      0,
      1
    ],
    [
      0,
      1
    ],
    [
      0,
      1
    ],
    [
      0,
      1
    ],
    [
      0,
      1
    ],
    [
      0,
      1
    ],
    [
      0,
      1
    ],
    [
      0,
      1
    ]
  ],
  "poor_calls": [
    [
      0,
      1
    ]
  ],
  "unknown_calls": [
    [
      0,
      1
    ],
    [
      0,
      1
    ],
    [
      0,
      1
    ],
    [
      0,
      1
    ],
    [
      0,
      1
    ],
    [
      0,
      1
    ],
    [
      0,
      1
    ]
  ],
  "good_calls_percentage": [
    [
      0,
      100
    ],
    [
      0,
      100
    ]
  ],
  "fair_calls_percentage": [
    [
      0,
      100
    ],
    [
      0,
      100
    ],
    [
      0,
      100
    ],
    [
      0,
      100
    ],
    [
      0,
      100
    ]
  ],
  "poor_calls_percentage": [
    [
      0,
      100
    ],
    [
      0,
      100
    ],
    [
      0,
      100
    ],
    [
      0,
      100
    ],
    [
      0,
      100
    ],
    [
      0,
      100
    ],
    [
      0,
      100
    ],
    [
      0,
      100
    ],
    [
      0,
      100
    ],
    [
      0,
      100
    ]
  ],
  "unknown_calls_percentage": [
    [
      0,
      100
    ],
    [
      0,
      100
    ],
    [
      0,
      100
    ],
    [
      0,
      100
    ],
    [
      0,
      100
    ],
    [
      0,
      100
    ],
    [
      0,
      100
    ],
    [
      0,
      100
    ]
  ]
}