{
  "service_name": {
    "services": [
      "bittorrent",
      "bittorrent",
      "bittorrent",
      "bittorrent",
      "bittorrent",
      "bittorrent",
      "bittorrent",
      "bittorrent",
      "bittorrent",
      "bittorrent"
    ],
    "throttling": false,
    "destination": true
  }
}