{
  "actions": [
    {
      "name": "apiDevicesGetDeviceTemplateVariables",
      "protocol": "REST",
      "method": "GET",
      "entitypath": "{base_path}/{version}/configuration/v1/devices/{pathv1}/template_variables?{query}",
      "requestSchema": "schema.json",
      "responseSchema": "schema.json",
      "timeout": 0,
      "sendEmpty": false,
      "sendGetBody": false,
      "requestDatatype": "JSON",
      "responseDatatype": "JSON",
      "headers": {},
      "responseObjects": [
        {
          "type": "default",
          "key": "",
          "mockFile": "mockdatafiles/apiDevicesGetDeviceTemplateVariables-default.json"
        }
      ]
    },
    {
      "name": "apiDevicesCreateDeviceTemplateVariables",
      "protocol": "REST",
      "method": "POST",
      "entitypath": "{base_path}/{version}/configuration/v1/devices/{pathv1}/template_variables?{query}",
      "requestSchema": "schema.json",
      "responseSchema": "schema.json",
      "timeout": 0,
      "sendEmpty": false,
      "requestDatatype": "JSON",
      "responseDatatype": "JSON",
      "headers": {},
      "responseObjects": [
        {
          "type": "default",
          "key": "",
          "mockFile": ""
        }
      ]
    },
    {
      "name": "apiDevicesUpdateDeviceTemplateVariables",
      "protocol": "REST",
      "method": "PATCH",
      "entitypath": "{base_path}/{version}/configuration/v1/devices/{pathv1}/template_variables?{query}",
      "requestSchema": "schema.json",
      "responseSchema": "schema.json",
      "timeout": 0,
      "sendEmpty": false,
      "requestDatatype": "JSON",
      "responseDatatype": "JSON",
      "headers": {},
      "responseObjects": [
        {
          "type": "default",
          "key": "",
          "mockFile": ""
        }
      ]
    },
    {
      "name": "apiDevicesReplaceDeviceTemplateVariables",
      "protocol": "REST",
      "method": "PUT",
      "entitypath": "{base_path}/{version}/configuration/v1/devices/{pathv1}/template_variables?{query}",
      "requestSchema": "schema.json",
      "responseSchema": "schema.json",
      "timeout": 0,
      "sendEmpty": false,
      "requestDatatype": "JSON",
      "responseDatatype": "JSON",
      "headers": {},
      "responseObjects": [
        {
          "type": "default",
          "key": "",
          "mockFile": ""
        }
      ]
    },
    {
      "name": "apiDevicesDeleteDeviceTemplateVariables",
      "protocol": "REST",
      "method": "DELETE",
      "entitypath": "{base_path}/{version}/configuration/v1/devices/{pathv1}/template_variables?{query}",
      "requestSchema": "schema.json",
      "responseSchema": "schema.json",
      "timeout": 0,
      "sendEmpty": false,
      "requestDatatype": "JSON",
      "responseDatatype": "JSON",
      "headers": {},
      "responseObjects": [
        {
          "type": "default",
          "key": "",
          "mockFile": ""
        }
      ]
    },
    {
      "name": "apiDevicesGetAllDevicesTemplateVariables",
      "protocol": "REST",
      "method": "GET",
      "entitypath": "{base_path}/{version}/configuration/v1/devices/template_variables?{query}",
      "requestSchema": "schema.json",
      "responseSchema": "schema.json",
      "timeout": 0,
      "sendEmpty": false,
      "sendGetBody": false,
      "requestDatatype": "JSON",
      "responseDatatype": "FORM",
      "headers": {},
      "responseObjects": [
        {
          "type": "default",
          "key": "",
          "mockFile": ""
        }
      ]
    },
    {
      "name": "apiDevicesCreateAllDevicesTemplateVariables",
      "protocol": "REST",
      "method": "POST",
      "entitypath": "{base_path}/{version}/configuration/v1/devices/template_variables?{query}",
      "requestSchema": "schema.json",
      "responseSchema": "schema.json",
      "timeout": 0,
      "sendEmpty": false,
      "requestDatatype": "FORM",
      "responseDatatype": "JSON",
      "headers": {},
      "responseObjects": [
        {
          "type": "default",
          "key": "",
          "mockFile": ""
        }
      ]
    },
    {
      "name": "apiDevicesReplaceAllDevicesTemplateVariables",
      "protocol": "REST",
      "method": "PUT",
      "entitypath": "{base_path}/{version}/configuration/v1/devices/template_variables?{query}",
      "requestSchema": "schema.json",
      "responseSchema": "schema.json",
      "timeout": 0,
      "sendEmpty": false,
      "requestDatatype": "FORM",
      "responseDatatype": "JSON",
      "headers": {},
      "responseObjects": [
        {
          "type": "default",
          "key": "",
          "mockFile": ""
        }
      ]
    },
    {
      "name": "apiDevicesUpdateAllDevicesTemplateVariables",
      "protocol": "REST",
      "method": "PATCH",
      "entitypath": "{base_path}/{version}/configuration/v1/devices/template_variables?{query}",
      "requestSchema": "schema.json",
      "responseSchema": "schema.json",
      "timeout": 0,
      "sendEmpty": false,
      "requestDatatype": "FORM",
      "responseDatatype": "JSON",
      "headers": {},
      "responseObjects": [
        {
          "type": "default",
          "key": "",
          "mockFile": ""
        }
      ]
    }
  ]
}