{
  "actions": [
    {
      "name": "apiTemplatesGetTemplates",
      "protocol": "REST",
      "method": "GET",
      "entitypath": "{base_path}/{version}/configuration/v1/groups/{pathv1}/templates?{query}",
      "requestSchema": "schema.json",
      "responseSchema": "schema.json",
      "timeout": 0,
      "sendEmpty": false,
      "sendGetBody": false,
      "requestDatatype": "JSON",
      "responseDatatype": "JSON",
      "headers": {},
      "responseObjects": [
        {
          "type": "default",
          "key": "",
          "mockFile": "mockdatafiles/apiTemplatesGetTemplates-default.json"
        }
      ]
    },
    {
      "name": "apiTemplatesCreateTemplate",
      "protocol": "REST",
      "method": "POST",
      "entitypath": "{base_path}/{version}/configuration/v1/groups/{pathv1}/templates?{query}",
      "requestSchema": "schema.json",
      "responseSchema": "schema.json",
      "timeout": 0,
      "sendEmpty": false,
      "requestDatatype": "FORM",
      "responseDatatype": "JSON",
      "headers": {},
      "responseObjects": [
        {
          "type": "default",
          "key": "",
          "mockFile": ""
        }
      ]
    },
    {
      "name": "apiTemplatesUpdateTemplate",
      "protocol": "REST",
      "method": "PATCH",
      "entitypath": "{base_path}/{version}/configuration/v1/groups/{pathv1}/templates?{query}",
      "requestSchema": "schema.json",
      "responseSchema": "schema.json",
      "timeout": 0,
      "sendEmpty": false,
      "requestDatatype": "FORM",
      "responseDatatype": "JSON",
      "headers": {},
      "responseObjects": [
        {
          "type": "default",
          "key": "",
          "mockFile": ""
        }
      ]
    },
    {
      "name": "apiTemplatesGetTemplate",
      "protocol": "REST",
      "method": "GET",
      "entitypath": "{base_path}/{version}/configuration/v1/groups/{pathv1}/templates/{pathv2}?{query}",
      "requestSchema": "schema.json",
      "responseSchema": "schema.json",
      "timeout": 0,
      "sendEmpty": false,
      "sendGetBody": false,
      "requestDatatype": "JSON",
      "responseDatatype": "FORM",
      "headers": {},
      "responseObjects": [
        {
          "type": "default",
          "key": "",
          "mockFile": ""
        }
      ]
    },
    {
      "name": "apiTemplatesDeleteTemplate",
      "protocol": "REST",
      "method": "DELETE",
      "entitypath": "{base_path}/{version}/configuration/v1/groups/{pathv1}/templates/{pathv2}?{query}",
      "requestSchema": "schema.json",
      "responseSchema": "schema.json",
      "timeout": 0,
      "sendEmpty": false,
      "requestDatatype": "JSON",
      "responseDatatype": "JSON",
      "headers": {},
      "responseObjects": [
        {
          "type": "default",
          "key": "",
          "mockFile": ""
        }
      ]
    }
  ]
}