{
  "data": [
    {
      "insight_id": 59,
      "description": "Show the number of tunnels that went down over time",
      "insight": "Gateway tunnels failed to get established",
      "category": "Wireless Quality",
      "severity": "low",
      "is_config_recommendation_insight": true,
      "impact": "1 Tunnels Down"
    },
    {
      "insight_id": 59,
      "description": "Show the number of tunnels that went down over time",
      "insight": "Gateway tunnels failed to get established",
      "category": "Wireless Quality",
      "severity": "low",
      "is_config_recommendation_insight": true,
      "impact": "1 Tunnels Down"
    }
  ]
}