{
  "$id": "schema.json",
  "type": "object",
  "schema": "http://json-schema.org/draft-07/schema#",
  "translate": true,
  "dynamicfields": true,
  "properties": {
    "ph_request_type": {
      "type": "string",
      "description": "type of request (internal to adapter)",
      "default": "apiExternalControllerGetWirelessClients",
      "enum": [
        "apiExternalControllerGetWirelessClients",
        "apiExternalControllerGetWiredClients",
        "apiExternalControllerGetV2UnifiedClients",
        "apiExternalControllerGetV2UnifiedClientDetail",
        "apiExternalControllerGetWirelessClient",
        "apiExternalControllerGetWirelessClientMobility",
        "apiExternalControllerGetWiredClient",
        "apiExternalControllerGetClientsBandwidthUsage",
        "apiExternalControllerGetClientsBandwidthUsageTopn",
        "apiExternalControllerGetClientsCount"
      ],
      "external_name": "ph_request_type"
    },
    "swarmId": {
      "type": "string",
      "description": "Filter by Swarm ID. Field supported for AP clients only",
      "parse": false,
      "encode": false,
      "encrypt": {
        "type": "AES",
        "key": ""
      },
      "external_name": "swarm_id"
    },
    "osType": {
      "type": "string",
      "description": "Filter by OS Type",
      "parse": false,
      "encode": false,
      "encrypt": {
        "type": "AES",
        "key": ""
      },
      "external_name": "os_type"
    },
    "clusterId": {
      "type": "string",
      "description": "Filter by Mobility Controller serial number",
      "parse": false,
      "encode": false,
      "encrypt": {
        "type": "AES",
        "key": ""
      },
      "external_name": "cluster_id"
    },
    "calculateTotal": {
      "type": "boolean",
      "description": "Whether to calculate total transitions",
      "parse": false,
      "encode": false,
      "encrypt": {
        "type": "AES",
        "key": ""
      },
      "external_name": "calculate_total"
    },
    "lastClientMac": {
      "type": "string",
      "description": "Input the last processed client mac that got received in your last response. Please note that when last_client_mac is inputted , offset will not make any sense and by def...(description truncated)",
      "parse": false,
      "encode": false,
      "encrypt": {
        "type": "AES",
        "key": ""
      },
      "external_name": "last_client_mac"
    },
    "stackId": {
      "type": "string",
      "description": "Filter by Switch stack_id",
      "parse": false,
      "encode": false,
      "encrypt": {
        "type": "AES",
        "key": ""
      },
      "external_name": "stack_id"
    },
    "clientType": {
      "type": "string",
      "description": "WIRED = List Wired Clients, WIRELESS = List Wireless Clients.",
      "parse": false,
      "encode": false,
      "encrypt": {
        "type": "AES",
        "key": ""
      },
      "external_name": "client_type"
    },
    "clientStatus": {
      "type": "string",
      "description": "CONNECTED = List Connected Clients, FAILED_TO_CONNECT = List Failed Clients.\nFailed to connect status not supported for wired clients.",
      "parse": false,
      "encode": false,
      "encrypt": {
        "type": "AES",
        "key": ""
      },
      "external_name": "client_status"
    },
    "showUsage": {
      "type": "boolean",
      "description": "Whether to show usage",
      "parse": false,
      "encode": false,
      "encrypt": {
        "type": "AES",
        "key": ""
      },
      "external_name": "show_usage"
    },
    "showManufacturer": {
      "type": "boolean",
      "description": "Whether to show manufacturer",
      "parse": false,
      "encode": false,
      "encrypt": {
        "type": "AES",
        "key": ""
      },
      "external_name": "show_manufacturer"
    },
    "showSignalDb": {
      "type": "boolean",
      "description": "Whether to show signal_db and signal_strength. Field supported for wireless clients only",
      "parse": false,
      "encode": false,
      "encrypt": {
        "type": "AES",
        "key": ""
      },
      "external_name": "show_signal_db"
    },
    "fromTimestamp": {
      "type": "number",
      "description": "Need information from this timestamp. Timestamp is epoch in seconds. Default is current timestamp minus 3 hours",
      "parse": false,
      "encode": false,
      "encrypt": {
        "type": "AES",
        "key": ""
      },
      "external_name": "from_timestamp"
    },
    "toTimestamp": {
      "type": "number",
      "description": "Need information to this timestamp. Timestamp is epoch in seconds. Default is current timestamp",
      "parse": false,
      "encode": false,
      "encrypt": {
        "type": "AES",
        "key": ""
      },
      "external_name": "to_timestamp"
    },
    "deviceType": {
      "type": "string",
      "description": "Filter by device type. Value can be either &#34;AP&#34; or &#34;Switch&#34;",
      "parse": false,
      "encode": false,
      "encrypt": {
        "type": "AES",
        "key": ""
      },
      "external_name": "device_type"
    },
    "radioNumber": {
      "type": "number",
      "description": "Filter by radio_number (0, 1 or 2). Valid only when serial parameter is specified. If band is provided and radio_number is not provided then radio_number is defaulted to ...(description truncated)",
      "parse": false,
      "encode": false,
      "encrypt": {
        "type": "AES",
        "key": ""
      },
      "external_name": "radio_number"
    }
  },
  "definitions": {}
}