{
  "data": [
    {
      "label": "US West",
      "server_name": "Google Cast",
      "value": "543"
    },
    {
      "label": "US West",
      "server_name": "Google Cast",
      "value": "543"
    },
    {
      "label": "US West",
      "server_name": "Google Cast",
      "value": "543"
    },
    {
      "label": "US West",
      "server_name": "Google Cast",
      "value": "543"
    },
    {
      "label": "US West",
      "server_name": "Google Cast",
      "value": "543"
    },
    {
      "label": "US West",
      "server_name": "Google Cast",
      "value": "543"
    },
    {
      "label": "US West",
      "server_name": "Google Cast",
      "value": "543"
    },
    {
      "label": "US West",
      "server_name": "Google Cast",
      "value": "543"
    },
    {
      "label": "US West",
      "server_name": "Google Cast",
      "value": "543"
    }
  ]
}