{
  "$id": "schema.json",
  "type": "object",
  "schema": "http://json-schema.org/draft-07/schema#",
  "translate": true,
  "dynamicfields": true,
  "properties": {
    "ph_request_type": {
      "type": "string",
      "description": "type of request (internal to adapter)",
      "default": "apiNbUiGroupConfigSetGroupConfigCountryCode",
      "enum": [
        "apiNbUiGroupConfigSetGroupConfigCountryCode",
        "apiNbUiGroupConfigGetGroupCountry"
      ],
      "external_name": "ph_request_type"
    },
    "setGroupConfigCountryCode": {
      "type": "object",
      "description": "Country code to be set at groups&#39; level.",
      "parse": false,
      "encode": false,
      "encrypt": {
        "type": "AES",
        "key": ""
      },
      "external_name": "set_group_config_country_code"
    }
  },
  "definitions": {}
}