{
  "Items": [
    {
      "ConnectionId": "string",
      "ConnectionType": "VPC_LINK",
      "ContentHandlingStrategy": "CONVERT_TO_TEXT",
      "CredentialsArn": "string",
      "Description": "string",
      "IntegrationId": "string",
      "IntegrationMethod": "string",
      "IntegrationResponseSelectionExpression": "string",
      "IntegrationType": "AWS_PROXY",
      "IntegrationUri": "string",
      "PassthroughBehavior": "WHEN_NO_TEMPLATES",
      "RequestParameters": {},
      "RequestTemplates": {},
      "TemplateSelectionExpression": "string",
      "TimeoutInMillis": 3
    },
    {
      "ConnectionId": "string",
      "ConnectionType": "INTERNET",
      "ContentHandlingStrategy": "CONVERT_TO_TEXT",
      "CredentialsArn": "string",
      "Description": "string",
      "IntegrationId": "string",
      "IntegrationMethod": "string",
      "IntegrationResponseSelectionExpression": "string",
      "IntegrationType": "MOCK",
      "IntegrationUri": "string",
      "PassthroughBehavior": "WHEN_NO_TEMPLATES",
      "RequestParameters": {},
      "RequestTemplates": {},
      "TemplateSelectionExpression": "string",
      "TimeoutInMillis": 10
    }
  ],
  "NextToken": "string"
}