{
  "ApiKeyRequired": true,
  "AuthorizationScopes": [
    "string"
  ],
  "AuthorizationType": "NONE",
  "AuthorizerId": "string",
  "ModelSelectionExpression": "string",
  "OperationName": "string",
  "RequestModels": {},
  "RequestParameters": {},
  "RouteId": "string",
  "RouteKey": "string",
  "RouteResponseSelectionExpression": "string",
  "Target": "string"
}