{
  "Items": [
    {
      "ModelSelectionExpression": "string",
      "ResponseModels": {},
      "ResponseParameters": {},
      "RouteResponseId": "string",
      "RouteResponseKey": "string"
    },
    {
      "ModelSelectionExpression": "string",
      "ResponseModels": {},
      "ResponseParameters": {},
      "RouteResponseId": "string",
      "RouteResponseKey": "string"
    },
    {
      "ModelSelectionExpression": "string",
      "ResponseModels": {},
      "ResponseParameters": {},
      "RouteResponseId": "string",
      "RouteResponseKey": "string"
    },
    {
      "ModelSelectionExpression": "string",
      "ResponseModels": {},
      "ResponseParameters": {},
      "RouteResponseId": "string",
      "RouteResponseKey": "string"
    },
    {
      "ModelSelectionExpression": "string",
      "ResponseModels": {},
      "ResponseParameters": {},
      "RouteResponseId": "string",
      "RouteResponseKey": "string"
    },
    {
      "ModelSelectionExpression": "string",
      "ResponseModels": {},
      "ResponseParameters": {},
      "RouteResponseId": "string",
      "RouteResponseKey": "string"
    },
    {
      "ModelSelectionExpression": "string",
      "ResponseModels": {},
      "ResponseParameters": {},
      "RouteResponseId": "string",
      "RouteResponseKey": "string"
    },
    {
      "ModelSelectionExpression": "string",
      "ResponseModels": {},
      "ResponseParameters": {},
      "RouteResponseId": "string",
      "RouteResponseKey": "string"
    },
    {
      "ModelSelectionExpression": "string",
      "ResponseModels": {},
      "ResponseParameters": {},
      "RouteResponseId": "string",
      "RouteResponseKey": "string"
    },
    {
      "ModelSelectionExpression": "string",
      "ResponseModels": {},
      "ResponseParameters": {},
      "RouteResponseId": "string",
      "RouteResponseKey": "string"
    }
  ],
  "NextToken": "string"
}