{
  "ApiEndpoint": "string",
  "ApiId": "string",
  "ApiKeySelectionExpression": "string",
  "CreatedDate": "string",
  "Description": "string",
  "DisableSchemaValidation": false,
  "Name": "string",
  "ProtocolType": "WEBSOCKET",
  "RouteSelectionExpression": "string",
  "Tags": {},
  "Version": "string",
  "Warnings": [
    "string",
    "string",
    "string",
    "string",
    "string",
    "string",
    "string",
    "string",
    "string",
    "string"
  ]
}