{
  "actions": [
    {
      "name": "getApis",
      "protocol": "REST",
      "method": "GET",
      "entitypath": "{base_path}/{version}/apis?{query}",
      "requestSchema": "schema.json",
      "responseSchema": "schema.json",
      "timeout": 0,
      "sendEmpty": false,
      "sendGetBody": false,
      "requestDatatype": "JSON",
      "responseDatatype": "JSON",
      "headers": {},
      "responseObjects": [
        {
          "type": "default",
          "key": "",
          "mockFile": "mockdatafiles/getApis-default.json"
        }
      ]
    },
    {
      "name": "createApi",
      "protocol": "REST",
      "method": "POST",
      "entitypath": "{base_path}/{version}/apis?{query}",
      "requestSchema": "schema.json",
      "responseSchema": "schema.json",
      "timeout": 0,
      "sendEmpty": false,
      "sendGetBody": false,
      "requestDatatype": "JSON",
      "responseDatatype": "JSON",
      "headers": {},
      "responseObjects": [
        {
          "type": "default",
          "key": "",
          "mockFile": "mockdatafiles/createApi-default.json"
        }
      ]
    },
    {
      "name": "deleteApi",
      "protocol": "REST",
      "method": "DELETE",
      "entitypath": "{base_path}/{version}/apis/{pathv1}?{query}",
      "requestSchema": "schema.json",
      "responseSchema": "schema.json",
      "timeout": 0,
      "sendEmpty": false,
      "sendGetBody": false,
      "requestDatatype": "JSON",
      "responseDatatype": "JSON",
      "headers": {},
      "responseObjects": [
        {
          "type": "default",
          "key": "",
          "mockFile": ""
        }
      ]
    },
    {
      "name": "getApi",
      "protocol": "REST",
      "method": "GET",
      "entitypath": "{base_path}/{version}/apis/{pathv1}?{query}",
      "requestSchema": "schema.json",
      "responseSchema": "schema.json",
      "timeout": 0,
      "sendEmpty": false,
      "sendGetBody": false,
      "requestDatatype": "JSON",
      "responseDatatype": "JSON",
      "headers": {},
      "responseObjects": [
        {
          "type": "default",
          "key": "",
          "mockFile": "mockdatafiles/getApi-default.json"
        }
      ]
    },
    {
      "name": "updateApi",
      "protocol": "REST",
      "method": "PATCH",
      "entitypath": "{base_path}/{version}/apis/{pathv1}?{query}",
      "requestSchema": "schema.json",
      "responseSchema": "schema.json",
      "timeout": 0,
      "sendEmpty": false,
      "sendGetBody": false,
      "requestDatatype": "JSON",
      "responseDatatype": "JSON",
      "headers": {},
      "responseObjects": [
        {
          "type": "default",
          "key": "",
          "mockFile": "mockdatafiles/updateApi-default.json"
        }
      ]
    },
    {
      "name": "getAuthorizers",
      "protocol": "REST",
      "method": "GET",
      "entitypath": "{base_path}/{version}/apis/{pathv1}/authorizers?{query}",
      "requestSchema": "schema.json",
      "responseSchema": "schema.json",
      "timeout": 0,
      "sendEmpty": false,
      "sendGetBody": false,
      "requestDatatype": "JSON",
      "responseDatatype": "JSON",
      "headers": {},
      "responseObjects": [
        {
          "type": "default",
          "key": "",
          "mockFile": "mockdatafiles/getAuthorizers-default.json"
        }
      ]
    },
    {
      "name": "createAuthorizer",
      "protocol": "REST",
      "method": "POST",
      "entitypath": "{base_path}/{version}/apis/{pathv1}/authorizers?{query}",
      "requestSchema": "schema.json",
      "responseSchema": "schema.json",
      "timeout": 0,
      "sendEmpty": false,
      "sendGetBody": false,
      "requestDatatype": "JSON",
      "responseDatatype": "JSON",
      "headers": {},
      "responseObjects": [
        {
          "type": "default",
          "key": "",
          "mockFile": "mockdatafiles/createAuthorizer-default.json"
        }
      ]
    },
    {
      "name": "deleteAuthorizer",
      "protocol": "REST",
      "method": "DELETE",
      "entitypath": "{base_path}/{version}/apis/{pathv1}/authorizers/{pathv2}?{query}",
      "requestSchema": "schema.json",
      "responseSchema": "schema.json",
      "timeout": 0,
      "sendEmpty": false,
      "sendGetBody": false,
      "requestDatatype": "JSON",
      "responseDatatype": "JSON",
      "headers": {},
      "responseObjects": [
        {
          "type": "default",
          "key": "",
          "mockFile": ""
        }
      ]
    },
    {
      "name": "getAuthorizer",
      "protocol": "REST",
      "method": "GET",
      "entitypath": "{base_path}/{version}/apis/{pathv1}/authorizers/{pathv2}?{query}",
      "requestSchema": "schema.json",
      "responseSchema": "schema.json",
      "timeout": 0,
      "sendEmpty": false,
      "sendGetBody": false,
      "requestDatatype": "JSON",
      "responseDatatype": "JSON",
      "headers": {},
      "responseObjects": [
        {
          "type": "default",
          "key": "",
          "mockFile": "mockdatafiles/getAuthorizer-default.json"
        }
      ]
    },
    {
      "name": "updateAuthorizer",
      "protocol": "REST",
      "method": "PATCH",
      "entitypath": "{base_path}/{version}/apis/{pathv1}/authorizers/{pathv2}?{query}",
      "requestSchema": "schema.json",
      "responseSchema": "schema.json",
      "timeout": 0,
      "sendEmpty": false,
      "sendGetBody": false,
      "requestDatatype": "JSON",
      "responseDatatype": "JSON",
      "headers": {},
      "responseObjects": [
        {
          "type": "default",
          "key": "",
          "mockFile": "mockdatafiles/updateAuthorizer-default.json"
        }
      ]
    },
    {
      "name": "getDeployments",
      "protocol": "REST",
      "method": "GET",
      "entitypath": "{base_path}/{version}/apis/{pathv1}/deployments?{query}",
      "requestSchema": "schema.json",
      "responseSchema": "schema.json",
      "timeout": 0,
      "sendEmpty": false,
      "sendGetBody": false,
      "requestDatatype": "JSON",
      "responseDatatype": "JSON",
      "headers": {},
      "responseObjects": [
        {
          "type": "default",
          "key": "",
          "mockFile": "mockdatafiles/getDeployments-default.json"
        }
      ]
    },
    {
      "name": "createDeployment",
      "protocol": "REST",
      "method": "POST",
      "entitypath": "{base_path}/{version}/apis/{pathv1}/deployments?{query}",
      "requestSchema": "schema.json",
      "responseSchema": "schema.json",
      "timeout": 0,
      "sendEmpty": false,
      "sendGetBody": false,
      "requestDatatype": "JSON",
      "responseDatatype": "JSON",
      "headers": {},
      "responseObjects": [
        {
          "type": "default",
          "key": "",
          "mockFile": "mockdatafiles/createDeployment-default.json"
        }
      ]
    },
    {
      "name": "deleteDeployment",
      "protocol": "REST",
      "method": "DELETE",
      "entitypath": "{base_path}/{version}/apis/{pathv1}/deployments/{pathv2}?{query}",
      "requestSchema": "schema.json",
      "responseSchema": "schema.json",
      "timeout": 0,
      "sendEmpty": false,
      "sendGetBody": false,
      "requestDatatype": "JSON",
      "responseDatatype": "JSON",
      "headers": {},
      "responseObjects": [
        {
          "type": "default",
          "key": "",
          "mockFile": ""
        }
      ]
    },
    {
      "name": "getDeployment",
      "protocol": "REST",
      "method": "GET",
      "entitypath": "{base_path}/{version}/apis/{pathv1}/deployments/{pathv2}?{query}",
      "requestSchema": "schema.json",
      "responseSchema": "schema.json",
      "timeout": 0,
      "sendEmpty": false,
      "sendGetBody": false,
      "requestDatatype": "JSON",
      "responseDatatype": "JSON",
      "headers": {},
      "responseObjects": [
        {
          "type": "default",
          "key": "",
          "mockFile": "mockdatafiles/getDeployment-default.json"
        }
      ]
    },
    {
      "name": "updateDeployment",
      "protocol": "REST",
      "method": "PATCH",
      "entitypath": "{base_path}/{version}/apis/{pathv1}/deployments/{pathv2}?{query}",
      "requestSchema": "schema.json",
      "responseSchema": "schema.json",
      "timeout": 0,
      "sendEmpty": false,
      "sendGetBody": false,
      "requestDatatype": "JSON",
      "responseDatatype": "JSON",
      "headers": {},
      "responseObjects": [
        {
          "type": "default",
          "key": "",
          "mockFile": "mockdatafiles/updateDeployment-default.json"
        }
      ]
    },
    {
      "name": "getIntegrations",
      "protocol": "REST",
      "method": "GET",
      "entitypath": "{base_path}/{version}/apis/{pathv1}/integrations?{query}",
      "requestSchema": "schema.json",
      "responseSchema": "schema.json",
      "timeout": 0,
      "sendEmpty": false,
      "sendGetBody": false,
      "requestDatatype": "JSON",
      "responseDatatype": "JSON",
      "headers": {},
      "responseObjects": [
        {
          "type": "default",
          "key": "",
          "mockFile": "mockdatafiles/getIntegrations-default.json"
        }
      ]
    },
    {
      "name": "createIntegration",
      "protocol": "REST",
      "method": "POST",
      "entitypath": "{base_path}/{version}/apis/{pathv1}/integrations?{query}",
      "requestSchema": "schema.json",
      "responseSchema": "schema.json",
      "timeout": 0,
      "sendEmpty": false,
      "sendGetBody": false,
      "requestDatatype": "JSON",
      "responseDatatype": "JSON",
      "headers": {},
      "responseObjects": [
        {
          "type": "default",
          "key": "",
          "mockFile": "mockdatafiles/createIntegration-default.json"
        }
      ]
    },
    {
      "name": "deleteIntegration",
      "protocol": "REST",
      "method": "DELETE",
      "entitypath": "{base_path}/{version}/apis/{pathv1}/integrations/{pathv2}?{query}",
      "requestSchema": "schema.json",
      "responseSchema": "schema.json",
      "timeout": 0,
      "sendEmpty": false,
      "sendGetBody": false,
      "requestDatatype": "JSON",
      "responseDatatype": "JSON",
      "headers": {},
      "responseObjects": [
        {
          "type": "default",
          "key": "",
          "mockFile": ""
        }
      ]
    },
    {
      "name": "getIntegration",
      "protocol": "REST",
      "method": "GET",
      "entitypath": "{base_path}/{version}/apis/{pathv1}/integrations/{pathv2}?{query}",
      "requestSchema": "schema.json",
      "responseSchema": "schema.json",
      "timeout": 0,
      "sendEmpty": false,
      "sendGetBody": false,
      "requestDatatype": "JSON",
      "responseDatatype": "JSON",
      "headers": {},
      "responseObjects": [
        {
          "type": "default",
          "key": "",
          "mockFile": "mockdatafiles/getIntegration-default.json"
        }
      ]
    },
    {
      "name": "updateIntegration",
      "protocol": "REST",
      "method": "PATCH",
      "entitypath": "{base_path}/{version}/apis/{pathv1}/integrations/{pathv2}?{query}",
      "requestSchema": "schema.json",
      "responseSchema": "schema.json",
      "timeout": 0,
      "sendEmpty": false,
      "sendGetBody": false,
      "requestDatatype": "JSON",
      "responseDatatype": "JSON",
      "headers": {},
      "responseObjects": [
        {
          "type": "default",
          "key": "",
          "mockFile": "mockdatafiles/updateIntegration-default.json"
        }
      ]
    },
    {
      "name": "getIntegrationResponses",
      "protocol": "REST",
      "method": "GET",
      "entitypath": "{base_path}/{version}/apis/{pathv1}/integrations/{pathv2}/integrationresponses?{query}",
      "requestSchema": "schema.json",
      "responseSchema": "schema.json",
      "timeout": 0,
      "sendEmpty": false,
      "sendGetBody": false,
      "requestDatatype": "JSON",
      "responseDatatype": "JSON",
      "headers": {},
      "responseObjects": [
        {
          "type": "default",
          "key": "",
          "mockFile": "mockdatafiles/getIntegrationResponses-default.json"
        }
      ]
    },
    {
      "name": "createIntegrationResponse",
      "protocol": "REST",
      "method": "POST",
      "entitypath": "{base_path}/{version}/apis/{pathv1}/integrations/{pathv2}/integrationresponses?{query}",
      "requestSchema": "schema.json",
      "responseSchema": "schema.json",
      "timeout": 0,
      "sendEmpty": false,
      "sendGetBody": false,
      "requestDatatype": "JSON",
      "responseDatatype": "JSON",
      "headers": {},
      "responseObjects": [
        {
          "type": "default",
          "key": "",
          "mockFile": "mockdatafiles/createIntegrationResponse-default.json"
        }
      ]
    },
    {
      "name": "deleteIntegrationResponse",
      "protocol": "REST",
      "method": "DELETE",
      "entitypath": "{base_path}/{version}/apis/{pathv1}/integrations/{pathv2}/integrationresponses/{pathv3}?{query}",
      "requestSchema": "schema.json",
      "responseSchema": "schema.json",
      "timeout": 0,
      "sendEmpty": false,
      "sendGetBody": false,
      "requestDatatype": "JSON",
      "responseDatatype": "JSON",
      "headers": {},
      "responseObjects": [
        {
          "type": "default",
          "key": "",
          "mockFile": ""
        }
      ]
    },
    {
      "name": "getIntegrationResponse",
      "protocol": "REST",
      "method": "GET",
      "entitypath": "{base_path}/{version}/apis/{pathv1}/integrations/{pathv2}/integrationresponses/{pathv3}?{query}",
      "requestSchema": "schema.json",
      "responseSchema": "schema.json",
      "timeout": 0,
      "sendEmpty": false,
      "sendGetBody": false,
      "requestDatatype": "JSON",
      "responseDatatype": "JSON",
      "headers": {},
      "responseObjects": [
        {
          "type": "default",
          "key": "",
          "mockFile": "mockdatafiles/getIntegrationResponse-default.json"
        }
      ]
    },
    {
      "name": "updateIntegrationResponse",
      "protocol": "REST",
      "method": "PATCH",
      "entitypath": "{base_path}/{version}/apis/{pathv1}/integrations/{pathv2}/integrationresponses/{pathv3}?{query}",
      "requestSchema": "schema.json",
      "responseSchema": "schema.json",
      "timeout": 0,
      "sendEmpty": false,
      "sendGetBody": false,
      "requestDatatype": "JSON",
      "responseDatatype": "JSON",
      "headers": {},
      "responseObjects": [
        {
          "type": "default",
          "key": "",
          "mockFile": "mockdatafiles/updateIntegrationResponse-default.json"
        }
      ]
    },
    {
      "name": "getModels",
      "protocol": "REST",
      "method": "GET",
      "entitypath": "{base_path}/{version}/apis/{pathv1}/models?{query}",
      "requestSchema": "schema.json",
      "responseSchema": "schema.json",
      "timeout": 0,
      "sendEmpty": false,
      "sendGetBody": false,
      "requestDatatype": "JSON",
      "responseDatatype": "JSON",
      "headers": {},
      "responseObjects": [
        {
          "type": "default",
          "key": "",
          "mockFile": "mockdatafiles/getModels-default.json"
        }
      ]
    },
    {
      "name": "createModel",
      "protocol": "REST",
      "method": "POST",
      "entitypath": "{base_path}/{version}/apis/{pathv1}/models?{query}",
      "requestSchema": "schema.json",
      "responseSchema": "schema.json",
      "timeout": 0,
      "sendEmpty": false,
      "sendGetBody": false,
      "requestDatatype": "JSON",
      "responseDatatype": "JSON",
      "headers": {},
      "responseObjects": [
        {
          "type": "default",
          "key": "",
          "mockFile": "mockdatafiles/createModel-default.json"
        }
      ]
    },
    {
      "name": "deleteModel",
      "protocol": "REST",
      "method": "DELETE",
      "entitypath": "{base_path}/{version}/apis/{pathv1}/models/{pathv2}?{query}",
      "requestSchema": "schema.json",
      "responseSchema": "schema.json",
      "timeout": 0,
      "sendEmpty": false,
      "sendGetBody": false,
      "requestDatatype": "JSON",
      "responseDatatype": "JSON",
      "headers": {},
      "responseObjects": [
        {
          "type": "default",
          "key": "",
          "mockFile": ""
        }
      ]
    },
    {
      "name": "getModel",
      "protocol": "REST",
      "method": "GET",
      "entitypath": "{base_path}/{version}/apis/{pathv1}/models/{pathv2}?{query}",
      "requestSchema": "schema.json",
      "responseSchema": "schema.json",
      "timeout": 0,
      "sendEmpty": false,
      "sendGetBody": false,
      "requestDatatype": "JSON",
      "responseDatatype": "JSON",
      "headers": {},
      "responseObjects": [
        {
          "type": "default",
          "key": "",
          "mockFile": "mockdatafiles/getModel-default.json"
        }
      ]
    },
    {
      "name": "updateModel",
      "protocol": "REST",
      "method": "PATCH",
      "entitypath": "{base_path}/{version}/apis/{pathv1}/models/{pathv2}?{query}",
      "requestSchema": "schema.json",
      "responseSchema": "schema.json",
      "timeout": 0,
      "sendEmpty": false,
      "sendGetBody": false,
      "requestDatatype": "JSON",
      "responseDatatype": "JSON",
      "headers": {},
      "responseObjects": [
        {
          "type": "default",
          "key": "",
          "mockFile": "mockdatafiles/updateModel-default.json"
        }
      ]
    },
    {
      "name": "getModelTemplate",
      "protocol": "REST",
      "method": "GET",
      "entitypath": "{base_path}/{version}/apis/{pathv1}/models/{pathv2}/template?{query}",
      "requestSchema": "schema.json",
      "responseSchema": "schema.json",
      "timeout": 0,
      "sendEmpty": false,
      "sendGetBody": false,
      "requestDatatype": "JSON",
      "responseDatatype": "JSON",
      "headers": {},
      "responseObjects": [
        {
          "type": "default",
          "key": "",
          "mockFile": "mockdatafiles/getModelTemplate-default.json"
        }
      ]
    },
    {
      "name": "getRoutes",
      "protocol": "REST",
      "method": "GET",
      "entitypath": "{base_path}/{version}/apis/{pathv1}/routes?{query}",
      "requestSchema": "schema.json",
      "responseSchema": "schema.json",
      "timeout": 0,
      "sendEmpty": false,
      "sendGetBody": false,
      "requestDatatype": "JSON",
      "responseDatatype": "JSON",
      "headers": {},
      "responseObjects": [
        {
          "type": "default",
          "key": "",
          "mockFile": "mockdatafiles/getRoutes-default.json"
        }
      ]
    },
    {
      "name": "createRoute",
      "protocol": "REST",
      "method": "POST",
      "entitypath": "{base_path}/{version}/apis/{pathv1}/routes?{query}",
      "requestSchema": "schema.json",
      "responseSchema": "schema.json",
      "timeout": 0,
      "sendEmpty": false,
      "sendGetBody": false,
      "requestDatatype": "JSON",
      "responseDatatype": "JSON",
      "headers": {},
      "responseObjects": [
        {
          "type": "default",
          "key": "",
          "mockFile": "mockdatafiles/createRoute-default.json"
        }
      ]
    },
    {
      "name": "deleteRoute",
      "protocol": "REST",
      "method": "DELETE",
      "entitypath": "{base_path}/{version}/apis/{pathv1}/routes/{pathv2}?{query}",
      "requestSchema": "schema.json",
      "responseSchema": "schema.json",
      "timeout": 0,
      "sendEmpty": false,
      "sendGetBody": false,
      "requestDatatype": "JSON",
      "responseDatatype": "JSON",
      "headers": {},
      "responseObjects": [
        {
          "type": "default",
          "key": "",
          "mockFile": ""
        }
      ]
    },
    {
      "name": "getRoute",
      "protocol": "REST",
      "method": "GET",
      "entitypath": "{base_path}/{version}/apis/{pathv1}/routes/{pathv2}?{query}",
      "requestSchema": "schema.json",
      "responseSchema": "schema.json",
      "timeout": 0,
      "sendEmpty": false,
      "sendGetBody": false,
      "requestDatatype": "JSON",
      "responseDatatype": "JSON",
      "headers": {},
      "responseObjects": [
        {
          "type": "default",
          "key": "",
          "mockFile": "mockdatafiles/getRoute-default.json"
        }
      ]
    },
    {
      "name": "updateRoute",
      "protocol": "REST",
      "method": "PATCH",
      "entitypath": "{base_path}/{version}/apis/{pathv1}/routes/{pathv2}?{query}",
      "requestSchema": "schema.json",
      "responseSchema": "schema.json",
      "timeout": 0,
      "sendEmpty": false,
      "sendGetBody": false,
      "requestDatatype": "JSON",
      "responseDatatype": "JSON",
      "headers": {},
      "responseObjects": [
        {
          "type": "default",
          "key": "",
          "mockFile": "mockdatafiles/updateRoute-default.json"
        }
      ]
    },
    {
      "name": "getRouteResponses",
      "protocol": "REST",
      "method": "GET",
      "entitypath": "{base_path}/{version}/apis/{pathv1}/routes/{pathv2}/routeresponses?{query}",
      "requestSchema": "schema.json",
      "responseSchema": "schema.json",
      "timeout": 0,
      "sendEmpty": false,
      "sendGetBody": false,
      "requestDatatype": "JSON",
      "responseDatatype": "JSON",
      "headers": {},
      "responseObjects": [
        {
          "type": "default",
          "key": "",
          "mockFile": "mockdatafiles/getRouteResponses-default.json"
        }
      ]
    },
    {
      "name": "createRouteResponse",
      "protocol": "REST",
      "method": "POST",
      "entitypath": "{base_path}/{version}/apis/{pathv1}/routes/{pathv2}/routeresponses?{query}",
      "requestSchema": "schema.json",
      "responseSchema": "schema.json",
      "timeout": 0,
      "sendEmpty": false,
      "sendGetBody": false,
      "requestDatatype": "JSON",
      "responseDatatype": "JSON",
      "headers": {},
      "responseObjects": [
        {
          "type": "default",
          "key": "",
          "mockFile": "mockdatafiles/createRouteResponse-default.json"
        }
      ]
    },
    {
      "name": "deleteRouteResponse",
      "protocol": "REST",
      "method": "DELETE",
      "entitypath": "{base_path}/{version}/apis/{pathv1}/routes/{pathv2}/routeresponses/{pathv3}?{query}",
      "requestSchema": "schema.json",
      "responseSchema": "schema.json",
      "timeout": 0,
      "sendEmpty": false,
      "sendGetBody": false,
      "requestDatatype": "JSON",
      "responseDatatype": "JSON",
      "headers": {},
      "responseObjects": [
        {
          "type": "default",
          "key": "",
          "mockFile": ""
        }
      ]
    },
    {
      "name": "getRouteResponse",
      "protocol": "REST",
      "method": "GET",
      "entitypath": "{base_path}/{version}/apis/{pathv1}/routes/{pathv2}/routeresponses/{pathv3}?{query}",
      "requestSchema": "schema.json",
      "responseSchema": "schema.json",
      "timeout": 0,
      "sendEmpty": false,
      "sendGetBody": false,
      "requestDatatype": "JSON",
      "responseDatatype": "JSON",
      "headers": {},
      "responseObjects": [
        {
          "type": "default",
          "key": "",
          "mockFile": "mockdatafiles/getRouteResponse-default.json"
        }
      ]
    },
    {
      "name": "updateRouteResponse",
      "protocol": "REST",
      "method": "PATCH",
      "entitypath": "{base_path}/{version}/apis/{pathv1}/routes/{pathv2}/routeresponses/{pathv3}?{query}",
      "requestSchema": "schema.json",
      "responseSchema": "schema.json",
      "timeout": 0,
      "sendEmpty": false,
      "sendGetBody": false,
      "requestDatatype": "JSON",
      "responseDatatype": "JSON",
      "headers": {},
      "responseObjects": [
        {
          "type": "default",
          "key": "",
          "mockFile": "mockdatafiles/updateRouteResponse-default.json"
        }
      ]
    },
    {
      "name": "getStages",
      "protocol": "REST",
      "method": "GET",
      "entitypath": "{base_path}/{version}/apis/{pathv1}/stages?{query}",
      "requestSchema": "schema.json",
      "responseSchema": "schema.json",
      "timeout": 0,
      "sendEmpty": false,
      "sendGetBody": false,
      "requestDatatype": "JSON",
      "responseDatatype": "JSON",
      "headers": {},
      "responseObjects": [
        {
          "type": "default",
          "key": "",
          "mockFile": "mockdatafiles/getStages-default.json"
        }
      ]
    },
    {
      "name": "createStage",
      "protocol": "REST",
      "method": "POST",
      "entitypath": "{base_path}/{version}/apis/{pathv1}/stages?{query}",
      "requestSchema": "schema.json",
      "responseSchema": "schema.json",
      "timeout": 0,
      "sendEmpty": false,
      "sendGetBody": false,
      "requestDatatype": "JSON",
      "responseDatatype": "JSON",
      "headers": {},
      "responseObjects": [
        {
          "type": "default",
          "key": "",
          "mockFile": "mockdatafiles/createStage-default.json"
        }
      ]
    },
    {
      "name": "deleteStage",
      "protocol": "REST",
      "method": "DELETE",
      "entitypath": "{base_path}/{version}/apis/{pathv1}/stages/{pathv2}?{query}",
      "requestSchema": "schema.json",
      "responseSchema": "schema.json",
      "timeout": 0,
      "sendEmpty": false,
      "sendGetBody": false,
      "requestDatatype": "JSON",
      "responseDatatype": "JSON",
      "headers": {},
      "responseObjects": [
        {
          "type": "default",
          "key": "",
          "mockFile": ""
        }
      ]
    },
    {
      "name": "getStage",
      "protocol": "REST",
      "method": "GET",
      "entitypath": "{base_path}/{version}/apis/{pathv1}/stages/{pathv2}?{query}",
      "requestSchema": "schema.json",
      "responseSchema": "schema.json",
      "timeout": 0,
      "sendEmpty": false,
      "sendGetBody": false,
      "requestDatatype": "JSON",
      "responseDatatype": "JSON",
      "headers": {},
      "responseObjects": [
        {
          "type": "default",
          "key": "",
          "mockFile": "mockdatafiles/getStage-default.json"
        }
      ]
    },
    {
      "name": "updateStage",
      "protocol": "REST",
      "method": "PATCH",
      "entitypath": "{base_path}/{version}/apis/{pathv1}/stages/{pathv2}?{query}",
      "requestSchema": "schema.json",
      "responseSchema": "schema.json",
      "timeout": 0,
      "sendEmpty": false,
      "sendGetBody": false,
      "requestDatatype": "JSON",
      "responseDatatype": "JSON",
      "headers": {},
      "responseObjects": [
        {
          "type": "default",
          "key": "",
          "mockFile": "mockdatafiles/updateStage-default.json"
        }
      ]
    }
  ]
}