{
  "actions": [
    {
      "name": "activate",
      "protocol": "REST",
      "method": "POST",
      "entitypath": "{base_path}/{version}/disasterrecovery/activate?{query}",
      "requestSchema": "schema.json",
      "responseSchema": "schema.json",
      "timeout": 0,
      "sendEmpty": false,
      "requestDatatype": "JSON",
      "responseDatatype": "JSON",
      "headers": {},
      "responseObjects": [
        {
          "type": "default",
          "key": "",
          "mockFile": ""
        }
      ]
    },
    {
      "name": "getClusterInfo",
      "protocol": "REST",
      "method": "GET",
      "entitypath": "{base_path}/{version}/disasterrecovery/clusterInfo?{query}",
      "requestSchema": "schema.json",
      "responseSchema": "schema.json",
      "timeout": 0,
      "sendEmpty": false,
      "sendGetBody": false,
      "requestDatatype": "JSON",
      "responseDatatype": "JSON",
      "headers": {},
      "responseObjects": [
        {
          "type": "default",
          "key": "",
          "mockFile": ""
        }
      ]
    },
    {
      "name": "deleteLocalDC",
      "protocol": "REST",
      "method": "POST",
      "entitypath": "{base_path}/{version}/disasterrecovery/deleteLocalDataCenter?{query}",
      "requestSchema": "schema.json",
      "responseSchema": "schema.json",
      "timeout": 0,
      "sendEmpty": false,
      "requestDatatype": "JSON",
      "responseDatatype": "JSON",
      "headers": {},
      "responseObjects": [
        {
          "type": "default",
          "key": "",
          "mockFile": ""
        }
      ]
    },
    {
      "name": "deleteDC",
      "protocol": "REST",
      "method": "POST",
      "entitypath": "{base_path}/{version}/disasterrecovery/deleteRemoteDataCenter?{query}",
      "requestSchema": "schema.json",
      "responseSchema": "schema.json",
      "timeout": 0,
      "sendEmpty": false,
      "requestDatatype": "JSON",
      "responseDatatype": "JSON",
      "headers": {},
      "responseObjects": [
        {
          "type": "default",
          "key": "",
          "mockFile": ""
        }
      ]
    },
    {
      "name": "delete",
      "protocol": "REST",
      "method": "POST",
      "entitypath": "{base_path}/{version}/disasterrecovery/deregister?{query}",
      "requestSchema": "schema.json",
      "responseSchema": "schema.json",
      "timeout": 0,
      "sendEmpty": false,
      "requestDatatype": "JSON",
      "responseDatatype": "JSON",
      "headers": {},
      "responseObjects": [
        {
          "type": "default",
          "key": "",
          "mockFile": ""
        }
      ]
    },
    {
      "name": "getDetails",
      "protocol": "REST",
      "method": "GET",
      "entitypath": "{base_path}/{version}/disasterrecovery/details?{query}",
      "requestSchema": "schema.json",
      "responseSchema": "schema.json",
      "timeout": 0,
      "sendEmpty": false,
      "sendGetBody": false,
      "requestDatatype": "JSON",
      "responseDatatype": "JSON",
      "headers": {},
      "responseObjects": [
        {
          "type": "default",
          "key": "",
          "mockFile": ""
        }
      ]
    },
    {
      "name": "downloadReplicationData",
      "protocol": "REST",
      "method": "GET",
      "entitypath": "{base_path}/{version}/disasterrecovery/download/{pathv1}/{pathv2}?{query}",
      "requestSchema": "schema.json",
      "responseSchema": "schema.json",
      "timeout": 0,
      "sendEmpty": false,
      "sendGetBody": false,
      "requestDatatype": "JSON",
      "responseDatatype": "JSON",
      "headers": {},
      "responseObjects": [
        {
          "type": "default",
          "key": "",
          "mockFile": "mockdatafiles/downloadReplicationData-default.json"
        }
      ]
    },
    {
      "name": "getDisasterRecoveryStatus",
      "protocol": "REST",
      "method": "GET",
      "entitypath": "{base_path}/{version}/disasterrecovery/drstatus?{query}",
      "requestSchema": "schema.json",
      "responseSchema": "schema.json",
      "timeout": 0,
      "sendEmpty": false,
      "sendGetBody": false,
      "requestDatatype": "JSON",
      "responseDatatype": "JSON",
      "headers": {},
      "responseObjects": [
        {
          "type": "default",
          "key": "",
          "mockFile": "mockdatafiles/getDisasterRecoveryStatus-default.json"
        }
      ]
    },
    {
      "name": "getHistory",
      "protocol": "REST",
      "method": "GET",
      "entitypath": "{base_path}/{version}/disasterrecovery/history?{query}",
      "requestSchema": "schema.json",
      "responseSchema": "schema.json",
      "timeout": 0,
      "sendEmpty": false,
      "sendGetBody": false,
      "requestDatatype": "JSON",
      "responseDatatype": "JSON",
      "headers": {},
      "responseObjects": [
        {
          "type": "default",
          "key": "",
          "mockFile": ""
        }
      ]
    },
    {
      "name": "getLocalHistory",
      "protocol": "REST",
      "method": "GET",
      "entitypath": "{base_path}/{version}/disasterrecovery/localLatestHistory?{query}",
      "requestSchema": "schema.json",
      "responseSchema": "schema.json",
      "timeout": 0,
      "sendEmpty": false,
      "sendGetBody": false,
      "requestDatatype": "JSON",
      "responseDatatype": "JSON",
      "headers": {},
      "responseObjects": [
        {
          "type": "default",
          "key": "",
          "mockFile": ""
        }
      ]
    },
    {
      "name": "getLocalDataCenterState",
      "protocol": "REST",
      "method": "GET",
      "entitypath": "{base_path}/{version}/disasterrecovery/localdc?{query}",
      "requestSchema": "schema.json",
      "responseSchema": "schema.json",
      "timeout": 0,
      "sendEmpty": false,
      "sendGetBody": false,
      "requestDatatype": "JSON",
      "responseDatatype": "JSON",
      "headers": {},
      "responseObjects": [
        {
          "type": "default",
          "key": "",
          "mockFile": "mockdatafiles/getLocalDataCenterState-default.json"
        }
      ]
    },
    {
      "name": "pauseDR",
      "protocol": "REST",
      "method": "POST",
      "entitypath": "{base_path}/{version}/disasterrecovery/pause?{query}",
      "requestSchema": "schema.json",
      "responseSchema": "schema.json",
      "timeout": 0,
      "sendEmpty": false,
      "requestDatatype": "JSON",
      "responseDatatype": "JSON",
      "headers": {},
      "responseObjects": [
        {
          "type": "default",
          "key": "",
          "mockFile": ""
        }
      ]
    },
    {
      "name": "pauseLocalArbitrator",
      "protocol": "REST",
      "method": "POST",
      "entitypath": "{base_path}/{version}/disasterrecovery/pauseLocalArbitrator?{query}",
      "requestSchema": "schema.json",
      "responseSchema": "schema.json",
      "timeout": 0,
      "sendEmpty": false,
      "requestDatatype": "JSON",
      "responseDatatype": "JSON",
      "headers": {},
      "responseObjects": [
        {
          "type": "default",
          "key": "",
          "mockFile": ""
        }
      ]
    },
    {
      "name": "pauseLocalDCForDR",
      "protocol": "REST",
      "method": "POST",
      "entitypath": "{base_path}/{version}/disasterrecovery/pauseLocalDC?{query}",
      "requestSchema": "schema.json",
      "responseSchema": "schema.json",
      "timeout": 0,
      "sendEmpty": false,
      "requestDatatype": "JSON",
      "responseDatatype": "JSON",
      "headers": {},
      "responseObjects": [
        {
          "type": "default",
          "key": "",
          "mockFile": ""
        }
      ]
    },
    {
      "name": "pauseLocalDCReplication",
      "protocol": "REST",
      "method": "POST",
      "entitypath": "{base_path}/{version}/disasterrecovery/pauseLocalReplication?{query}",
      "requestSchema": "schema.json",
      "responseSchema": "schema.json",
      "timeout": 0,
      "sendEmpty": false,
      "requestDatatype": "JSON",
      "responseDatatype": "JSON",
      "headers": {},
      "responseObjects": [
        {
          "type": "default",
          "key": "",
          "mockFile": ""
        }
      ]
    },
    {
      "name": "disasterRecoveryPauseReplication",
      "protocol": "REST",
      "method": "POST",
      "entitypath": "{base_path}/{version}/disasterrecovery/pausereplication?{query}",
      "requestSchema": "schema.json",
      "responseSchema": "schema.json",
      "timeout": 0,
      "sendEmpty": false,
      "requestDatatype": "JSON",
      "responseDatatype": "JSON",
      "headers": {},
      "responseObjects": [
        {
          "type": "default",
          "key": "",
          "mockFile": ""
        }
      ]
    },
    {
      "name": "update",
      "protocol": "REST",
      "method": "PUT",
      "entitypath": "{base_path}/{version}/disasterrecovery/register?{query}",
      "requestSchema": "schema.json",
      "responseSchema": "schema.json",
      "timeout": 0,
      "sendEmpty": false,
      "requestDatatype": "JSON",
      "responseDatatype": "JSON",
      "headers": {},
      "responseObjects": [
        {
          "type": "default",
          "key": "",
          "mockFile": ""
        }
      ]
    },
    {
      "name": "register",
      "protocol": "REST",
      "method": "POST",
      "entitypath": "{base_path}/{version}/disasterrecovery/register?{query}",
      "requestSchema": "schema.json",
      "responseSchema": "schema.json",
      "timeout": 0,
      "sendEmpty": false,
      "requestDatatype": "JSON",
      "responseDatatype": "JSON",
      "headers": {},
      "responseObjects": [
        {
          "type": "default",
          "key": "",
          "mockFile": ""
        }
      ]
    },
    {
      "name": "getRemoteDCMembersState",
      "protocol": "REST",
      "method": "GET",
      "entitypath": "{base_path}/{version}/disasterrecovery/remoteDcState?{query}",
      "requestSchema": "schema.json",
      "responseSchema": "schema.json",
      "timeout": 0,
      "sendEmpty": false,
      "sendGetBody": false,
      "requestDatatype": "JSON",
      "responseDatatype": "JSON",
      "headers": {},
      "responseObjects": [
        {
          "type": "default",
          "key": "",
          "mockFile": "mockdatafiles/getRemoteDCMembersState-default.json"
        }
      ]
    },
    {
      "name": "getRemoteDataCenterState",
      "protocol": "REST",
      "method": "GET",
      "entitypath": "{base_path}/{version}/disasterrecovery/remotedc?{query}",
      "requestSchema": "schema.json",
      "responseSchema": "schema.json",
      "timeout": 0,
      "sendEmpty": false,
      "sendGetBody": false,
      "requestDatatype": "JSON",
      "responseDatatype": "JSON",
      "headers": {},
      "responseObjects": [
        {
          "type": "default",
          "key": "",
          "mockFile": "mockdatafiles/getRemoteDataCenterState-default.json"
        }
      ]
    },
    {
      "name": "updateDisasterRecoveryState",
      "protocol": "REST",
      "method": "POST",
      "entitypath": "{base_path}/{version}/disasterrecovery/remotedc?{query}",
      "requestSchema": "schema.json",
      "responseSchema": "schema.json",
      "timeout": 0,
      "sendEmpty": false,
      "requestDatatype": "JSON",
      "responseDatatype": "JSON",
      "headers": {},
      "responseObjects": [
        {
          "type": "default",
          "key": "",
          "mockFile": ""
        }
      ]
    },
    {
      "name": "getRemoteDataCenterVersion",
      "protocol": "REST",
      "method": "GET",
      "entitypath": "{base_path}/{version}/disasterrecovery/remotedc/swversion?{query}",
      "requestSchema": "schema.json",
      "responseSchema": "schema.json",
      "timeout": 0,
      "sendEmpty": false,
      "sendGetBody": false,
      "requestDatatype": "JSON",
      "responseDatatype": "JSON",
      "headers": {},
      "responseObjects": [
        {
          "type": "default",
          "key": "",
          "mockFile": ""
        }
      ]
    },
    {
      "name": "disasterRecoveryReplicationRequest",
      "protocol": "REST",
      "method": "POST",
      "entitypath": "{base_path}/{version}/disasterrecovery/requestimport?{query}",
      "requestSchema": "schema.json",
      "responseSchema": "schema.json",
      "timeout": 0,
      "sendEmpty": false,
      "requestDatatype": "JSON",
      "responseDatatype": "JSON",
      "headers": {},
      "responseObjects": [
        {
          "type": "default",
          "key": "",
          "mockFile": ""
        }
      ]
    },
    {
      "name": "restartDataCenter",
      "protocol": "REST",
      "method": "POST",
      "entitypath": "{base_path}/{version}/disasterrecovery/restartDataCenter?{query}",
      "requestSchema": "schema.json",
      "responseSchema": "schema.json",
      "timeout": 0,
      "sendEmpty": false,
      "requestDatatype": "JSON",
      "responseDatatype": "JSON",
      "headers": {},
      "responseObjects": [
        {
          "type": "default",
          "key": "",
          "mockFile": ""
        }
      ]
    },
    {
      "name": "getDisasterRecoveryLocalReplicationSchedule",
      "protocol": "REST",
      "method": "GET",
      "entitypath": "{base_path}/{version}/disasterrecovery/schedule?{query}",
      "requestSchema": "schema.json",
      "responseSchema": "schema.json",
      "timeout": 0,
      "sendEmpty": false,
      "sendGetBody": false,
      "requestDatatype": "JSON",
      "responseDatatype": "JSON",
      "headers": {},
      "responseObjects": [
        {
          "type": "default",
          "key": "",
          "mockFile": ""
        }
      ]
    },
    {
      "name": "getdrStatus",
      "protocol": "REST",
      "method": "GET",
      "entitypath": "{base_path}/{version}/disasterrecovery/status?{query}",
      "requestSchema": "schema.json",
      "responseSchema": "schema.json",
      "timeout": 0,
      "sendEmpty": false,
      "sendGetBody": false,
      "requestDatatype": "JSON",
      "responseDatatype": "JSON",
      "headers": {},
      "responseObjects": [
        {
          "type": "default",
          "key": "",
          "mockFile": ""
        }
      ]
    },
    {
      "name": "unpauseDR",
      "protocol": "REST",
      "method": "POST",
      "entitypath": "{base_path}/{version}/disasterrecovery/unpause?{query}",
      "requestSchema": "schema.json",
      "responseSchema": "schema.json",
      "timeout": 0,
      "sendEmpty": false,
      "requestDatatype": "JSON",
      "responseDatatype": "JSON",
      "headers": {},
      "responseObjects": [
        {
          "type": "default",
          "key": "",
          "mockFile": ""
        }
      ]
    },
    {
      "name": "unpauseLocalArbitrator",
      "protocol": "REST",
      "method": "POST",
      "entitypath": "{base_path}/{version}/disasterrecovery/unpauseLocalArbitrator?{query}",
      "requestSchema": "schema.json",
      "responseSchema": "schema.json",
      "timeout": 0,
      "sendEmpty": false,
      "requestDatatype": "JSON",
      "responseDatatype": "JSON",
      "headers": {},
      "responseObjects": [
        {
          "type": "default",
          "key": "",
          "mockFile": ""
        }
      ]
    },
    {
      "name": "unpauseLocalDCForDR",
      "protocol": "REST",
      "method": "POST",
      "entitypath": "{base_path}/{version}/disasterrecovery/unpauseLocalDC?{query}",
      "requestSchema": "schema.json",
      "responseSchema": "schema.json",
      "timeout": 0,
      "sendEmpty": false,
      "requestDatatype": "JSON",
      "responseDatatype": "JSON",
      "headers": {},
      "responseObjects": [
        {
          "type": "default",
          "key": "",
          "mockFile": ""
        }
      ]
    },
    {
      "name": "unpauseLocalDCReplication",
      "protocol": "REST",
      "method": "POST",
      "entitypath": "{base_path}/{version}/disasterrecovery/unpauseLocalReplication?{query}",
      "requestSchema": "schema.json",
      "responseSchema": "schema.json",
      "timeout": 0,
      "sendEmpty": false,
      "requestDatatype": "JSON",
      "responseDatatype": "JSON",
      "headers": {},
      "responseObjects": [
        {
          "type": "default",
          "key": "",
          "mockFile": ""
        }
      ]
    },
    {
      "name": "disasterRecoveryUnPauseReplication",
      "protocol": "REST",
      "method": "POST",
      "entitypath": "{base_path}/{version}/disasterrecovery/unpausereplication?{query}",
      "requestSchema": "schema.json",
      "responseSchema": "schema.json",
      "timeout": 0,
      "sendEmpty": false,
      "requestDatatype": "JSON",
      "responseDatatype": "JSON",
      "headers": {},
      "responseObjects": [
        {
          "type": "default",
          "key": "",
          "mockFile": ""
        }
      ]
    },
    {
      "name": "updateDrState",
      "protocol": "REST",
      "method": "POST",
      "entitypath": "{base_path}/{version}/disasterrecovery/updateDRConfigOnArbitrator?{query}",
      "requestSchema": "schema.json",
      "responseSchema": "schema.json",
      "timeout": 0,
      "sendEmpty": false,
      "requestDatatype": "JSON",
      "responseDatatype": "JSON",
      "headers": {},
      "responseObjects": [
        {
          "type": "default",
          "key": "",
          "mockFile": ""
        }
      ]
    },
    {
      "name": "updateReplication",
      "protocol": "REST",
      "method": "POST",
      "entitypath": "{base_path}/{version}/disasterrecovery/updateReplication?{query}",
      "requestSchema": "schema.json",
      "responseSchema": "schema.json",
      "timeout": 0,
      "sendEmpty": false,
      "requestDatatype": "JSON",
      "responseDatatype": "JSON",
      "headers": {},
      "responseObjects": [
        {
          "type": "default",
          "key": "",
          "mockFile": ""
        }
      ]
    },
    {
      "name": "getReachabilityInfo",
      "protocol": "REST",
      "method": "POST",
      "entitypath": "{base_path}/{version}/disasterrecovery/validateNodes?{query}",
      "requestSchema": "schema.json",
      "responseSchema": "schema.json",
      "timeout": 0,
      "sendEmpty": false,
      "requestDatatype": "JSON",
      "responseDatatype": "JSON",
      "headers": {},
      "responseObjects": [
        {
          "type": "default",
          "key": "",
          "mockFile": "mockdatafiles/getReachabilityInfo-default.json"
        }
      ]
    }
  ]
}