{
    "data": [
      {
        "mastersAttached": 0,
        "lastUpdatedBy": "admin",
        "policyName": "AppVisibility",
        "policyDefinition": "policy\n app-visibility\n flow-visibility\n!\n",
        "policyDefinitionEdit": "policy\n app-visibility\n flow-visibility\n!\n",
        "createdOn": 1505676829880,
        "policyDescription": "Application Visibility Only",
        "@rid": 481,
        "policyId": "0b860b3a-9446-4c19-86f4-49699f4ed2c7",
        "createdBy": "admin",
        "devicesAttached": 0,
        "lastUpdatedOn": 1505676829880,
        "policyType": "cli"
      },
      {
        "mastersAttached": 1,
        "lastUpdatedBy": "admin",
        "policyName": "BaselinePolicy",
        "policyDefinition": "{\"assembly\":[{\"definitionId\":\"48a7a27a-54e9-443b-a254-cc87ef13f3f5\",\"type\":\"qosMap\"},{\"definitionId\":\"dfe3891d-ee1f-44e1-ba84-caa2e5e9f128\",\"type\":\"acl\"},{\"definitionId\":\"7bdedee2-f87d-4f26-855b-4338b14716a1\",\"type\":\"acl\"},{\"definitionId\":\"e4b25c74-f594-49db-b78b-61bbb41464ba\",\"type\":\"acl\"},{\"definitionId\":\"b628d664-d4ec-428f-831c-aff2b688c54c\",\"type\":\"vedgeRoute\"}],\"settings\":{\"appVisibility\":true,\"cloudQos\":true,\"cloudQosServiceSide\":true,\"flowVisibility\":true,\"logFrequency\":10}}",
        "policyDefinitionEdit": "{\"assembly\":[{\"definitionId\":\"48a7a27a-54e9-443b-a254-cc87ef13f3f5\",\"type\":\"qosMap\"},{\"definitionId\":\"dfe3891d-ee1f-44e1-ba84-caa2e5e9f128\",\"type\":\"acl\"},{\"definitionId\":\"7bdedee2-f87d-4f26-855b-4338b14716a1\",\"type\":\"acl\"},{\"definitionId\":\"e4b25c74-f594-49db-b78b-61bbb41464ba\",\"type\":\"acl\"},{\"definitionId\":\"b628d664-d4ec-428f-831c-aff2b688c54c\",\"type\":\"vedgeRoute\"}],\"settings\":{\"appVisibility\":true,\"cloudQos\":true,\"cloudQosServiceSide\":true,\"flowVisibility\":true,\"logFrequency\":10}}",
        "createdOn": 1548341101877,
        "policyDescription": "Baseline dCloud Policy for all WAN Edge",
        "@rid": 2095,
        "policyId": "f73b285f-72eb-4f6d-865f-eae0e453bd8e",
        "createdBy": "admin",
        "devicesAttached": 2,
        "policyType": "feature",
        "lastUpdatedOn": 1548341101877
      }
    ]
  }