{
  "applicationClassToApplication": {},
  "applicationToApplicationClass": {},
  "applicationClasses": null,
  "applications": [
    {
      "class": 9,
      "description": "string",
      "displayName": "string",
      "name": "string",
      "id": 2,
      "knownIpPortMapping": {
        "subnets": [
          "string",
          "string",
          "string",
          "string",
          "string",
          "string",
          "string",
          "string"
        ],
        "tcpPorts": [
          6,
          5,
          9,
          6
        ],
        "udpPorts": [
          9,
          3,
          2,
          7,
          9,
          4,
          10
        ]
      },
      "protocolPortMapping": {
        "tcpPorts": [
          9,
          10,
          10,
          2,
          7,
          10
        ],
        "udpPorts": [
          6
        ]
      }
    },
    {
      "class": 8,
      "description": "string",
      "displayName": "string",
      "name": "string",
      "id": 5,
      "knownIpPortMapping": {
        "subnets": [
          "string",
          "string"
        ],
        "tcpPorts": [
          4,
          8,
          10,
          9,
          1,
          7,
          6
        ],
        "udpPorts": [
          10,
          3,
          6,
          6
        ]
      },
      "protocolPortMapping": {
        "tcpPorts": [
          2,
          6,
          1,
          1,
          7,
          2,
          6
        ],
        "udpPorts": [
          7,
          5
        ]
      }
    },
    {
      "class": 8,
      "description": "string",
      "displayName": "string",
      "name": "string",
      "id": 5,
      "knownIpPortMapping": {
        "subnets": [
          "string",
          "string",
          "string",
          "string",
          "string"
        ],
        "tcpPorts": [
          6,
          8
        ],
        "udpPorts": [
          9,
          3,
          5,
          7
        ]
      },
      "protocolPortMapping": {
        "tcpPorts": [
          5,
          7,
          5,
          7,
          7,
          4
        ],
        "udpPorts": [
          7,
          8,
          9,
          8
        ]
      }
    },
    {
      "class": 1,
      "description": "string",
      "displayName": "string",
      "name": "string",
      "id": 10,
      "knownIpPortMapping": {
        "subnets": [
          "string"
        ],
        "tcpPorts": [
          9,
          2
        ],
        "udpPorts": [
          9,
          1,
          2,
          4,
          2,
          2,
          4,
          10,
          3
        ]
      },
      "protocolPortMapping": {
        "tcpPorts": [
          1,
          7,
          3,
          8,
          6
        ],
        "udpPorts": [
          5,
          6,
          9,
          1,
          9,
          3,
          10,
          9,
          10
        ]
      }
    },
    {
      "class": 3,
      "description": "string",
      "displayName": "string",
      "name": "string",
      "id": 1,
      "knownIpPortMapping": {
        "subnets": [
          "string",
          "string",
          "string",
          "string",
          "string",
          "string",
          "string",
          "string"
        ],
        "tcpPorts": [
          3,
          7,
          3,
          3,
          6,
          9,
          8,
          4,
          4,
          8
        ],
        "udpPorts": [
          5
        ]
      },
      "protocolPortMapping": {
        "tcpPorts": [
          5,
          5,
          9,
          2,
          2,
          2
        ],
        "udpPorts": [
          1,
          3
        ]
      }
    },
    {
      "class": 8,
      "description": "string",
      "displayName": "string",
      "name": "string",
      "id": 7,
      "knownIpPortMapping": {
        "subnets": [
          "string",
          "string"
        ],
        "tcpPorts": [
          2,
          3,
          7,
          7,
          4
        ],
        "udpPorts": [
          4,
          6,
          10,
          8,
          1,
          6,
          7,
          9,
          4
        ]
      },
      "protocolPortMapping": {
        "tcpPorts": [
          9,
          6,
          2,
          4,
          1,
          3,
          3,
          7,
          3,
          3
        ],
        "udpPorts": [
          1,
          8,
          10
        ]
      }
    },
    {
      "class": 10,
      "description": "string",
      "displayName": "string",
      "name": "string",
      "id": 9,
      "knownIpPortMapping": {
        "subnets": [
          "string",
          "string"
        ],
        "tcpPorts": [
          7,
          1,
          1,
          6,
          6,
          5,
          6,
          3
        ],
        "udpPorts": [
          7,
          9,
          10,
          3,
          3,
          8,
          7,
          10
        ]
      },
      "protocolPortMapping": {
        "tcpPorts": [
          4,
          5
        ],
        "udpPorts": [
          9,
          7,
          8,
          8,
          9,
          4,
          1
        ]
      }
    },
    {
      "class": 2,
      "description": "string",
      "displayName": "string",
      "name": "string",
      "id": 1,
      "knownIpPortMapping": {
        "subnets": [
          "string",
          "string",
          "string",
          "string",
          "string",
          "string",
          "string"
        ],
        "tcpPorts": [
          4,
          1,
          6,
          10
        ],
        "udpPorts": [
          2,
          4,
          1,
          7,
          4,
          4
        ]
      },
      "protocolPortMapping": {
        "tcpPorts": [
          1,
          6,
          1,
          9,
          4,
          10
        ],
        "udpPorts": [
          7,
          3,
          5,
          1,
          4,
          2,
          1,
          4,
          3
        ]
      }
    },
    {
      "class": 8,
      "description": "string",
      "displayName": "string",
      "name": "string",
      "id": 1,
      "knownIpPortMapping": {
        "subnets": [
          "string",
          "string",
          "string",
          "string",
          "string",
          "string"
        ],
        "tcpPorts": [
          2
        ],
        "udpPorts": [
          10,
          6,
          6,
          1,
          1,
          6,
          7,
          1,
          3,
          9
        ]
      },
      "protocolPortMapping": {
        "tcpPorts": [
          6,
          5,
          4,
          7
        ],
        "udpPorts": [
          7,
          5,
          1,
          7,
          8,
          8
        ]
      }
    },
    {
      "class": 7,
      "description": "string",
      "displayName": "string",
      "name": "string",
      "id": 4,
      "knownIpPortMapping": {
        "subnets": [
          "string",
          "string",
          "string",
          "string",
          "string",
          "string"
        ],
        "tcpPorts": [
          2,
          10,
          10,
          9,
          7,
          3,
          3,
          10,
          5
        ],
        "udpPorts": [
          7,
          4,
          9,
          3,
          9,
          3,
          3
        ]
      },
      "protocolPortMapping": {
        "tcpPorts": [
          10,
          2,
          6,
          5,
          2,
          5,
          6,
          7,
          9,
          3
        ],
        "udpPorts": [
          3,
          8,
          10,
          10,
          5,
          7
        ]
      }
    }
  ]
}