{
  "actions": [
    {
      "name": "edgeEdgeCancelReactivation",
      "protocol": "REST",
      "method": "POST",
      "entitypath": "{base_path}/{version}/edge/edgeCancelReactivation?{query}",
      "requestSchema": "schema.json",
      "responseSchema": "schema.json",
      "timeout": 0,
      "sendEmpty": false,
      "requestDatatype": "JSON",
      "responseDatatype": "JSON",
      "headers": {},
      "responseObjects": [
        {
          "type": "default",
          "key": "",
          "mockFile": "mockdatafiles/edgeEdgeCancelReactivation-default.json"
        }
      ]
    },
    {
      "name": "edgeEdgeProvision",
      "protocol": "REST",
      "method": "POST",
      "entitypath": "{base_path}/{version}/edge/edgeProvision?{query}",
      "requestSchema": "schema.json",
      "responseSchema": "schema.json",
      "timeout": 0,
      "sendEmpty": false,
      "requestDatatype": "JSON",
      "responseDatatype": "JSON",
      "headers": {},
      "responseObjects": [
        {
          "type": "default",
          "key": "",
          "mockFile": "mockdatafiles/edgeEdgeProvision-default.json"
        }
      ]
    },
    {
      "name": "edgeEdgeRequestReactivation",
      "protocol": "REST",
      "method": "POST",
      "entitypath": "{base_path}/{version}/edge/edgeRequestReactivation?{query}",
      "requestSchema": "schema.json",
      "responseSchema": "schema.json",
      "timeout": 0,
      "sendEmpty": false,
      "requestDatatype": "JSON",
      "responseDatatype": "JSON",
      "headers": {},
      "responseObjects": [
        {
          "type": "default",
          "key": "",
          "mockFile": "mockdatafiles/edgeEdgeRequestReactivation-default.json"
        }
      ]
    },
    {
      "name": "edgeGetClientVisibilityMode",
      "protocol": "REST",
      "method": "POST",
      "entitypath": "{base_path}/{version}/edge/getClientVisibilityMode?{query}",
      "requestSchema": "schema.json",
      "responseSchema": "schema.json",
      "timeout": 0,
      "sendEmpty": false,
      "requestDatatype": "JSON",
      "responseDatatype": "JSON",
      "headers": {},
      "responseObjects": [
        {
          "type": "default",
          "key": "",
          "mockFile": "mockdatafiles/edgeGetClientVisibilityMode-default.json"
        }
      ]
    },
    {
      "name": "edgeGetEdge",
      "protocol": "REST",
      "method": "POST",
      "entitypath": "{base_path}/{version}/edge/getEdge?{query}",
      "requestSchema": "schema.json",
      "responseSchema": "schema.json",
      "timeout": 0,
      "sendEmpty": false,
      "requestDatatype": "JSON",
      "responseDatatype": "JSON",
      "headers": {},
      "responseObjects": [
        {
          "type": "default",
          "key": "",
          "mockFile": "mockdatafiles/edgeGetEdge-default.json"
        }
      ]
    },
    {
      "name": "edgeGetEdgeConfigurationModules",
      "protocol": "REST",
      "method": "POST",
      "entitypath": "{base_path}/{version}/edge/getEdgeConfigurationModules?{query}",
      "requestSchema": "schema.json",
      "responseSchema": "schema.json",
      "timeout": 0,
      "sendEmpty": false,
      "requestDatatype": "JSON",
      "responseDatatype": "JSON",
      "headers": {},
      "responseObjects": [
        {
          "type": "default",
          "key": "",
          "mockFile": "mockdatafiles/edgeGetEdgeConfigurationModules-default.json"
        }
      ]
    },
    {
      "name": "edgeGetEdgeConfigurationStack",
      "protocol": "REST",
      "method": "POST",
      "entitypath": "{base_path}/{version}/edge/getEdgeConfigurationStack?{query}",
      "requestSchema": "schema.json",
      "responseSchema": "schema.json",
      "timeout": 0,
      "sendEmpty": false,
      "requestDatatype": "JSON",
      "responseDatatype": "JSON",
      "headers": {},
      "responseObjects": [
        {
          "type": "default",
          "key": "",
          "mockFile": "mockdatafiles/edgeGetEdgeConfigurationStack-default.json"
        }
      ]
    },
    {
      "name": "edgeUpdateEdgeAdminPassword",
      "protocol": "REST",
      "method": "POST",
      "entitypath": "{base_path}/{version}/edge/updateEdgeAdminPassword?{query}",
      "requestSchema": "schema.json",
      "responseSchema": "schema.json",
      "timeout": 0,
      "sendEmpty": false,
      "requestDatatype": "JSON",
      "responseDatatype": "JSON",
      "headers": {},
      "responseObjects": [
        {
          "type": "default",
          "key": "",
          "mockFile": "mockdatafiles/edgeUpdateEdgeAdminPassword-default.json"
        }
      ]
    },
    {
      "name": "edgeUpdateEdgeAttributes",
      "protocol": "REST",
      "method": "POST",
      "entitypath": "{base_path}/{version}/edge/updateEdgeAttributes?{query}",
      "requestSchema": "schema.json",
      "responseSchema": "schema.json",
      "timeout": 0,
      "sendEmpty": false,
      "requestDatatype": "JSON",
      "responseDatatype": "JSON",
      "headers": {},
      "responseObjects": [
        {
          "type": "default",
          "key": "",
          "mockFile": "mockdatafiles/edgeUpdateEdgeAttributes-default.json"
        }
      ]
    },
    {
      "name": "edgeUpdateEdgeCredentialsByConfiguration",
      "protocol": "REST",
      "method": "POST",
      "entitypath": "{base_path}/{version}/edge/updateEdgeCredentialsByConfiguration?{query}",
      "requestSchema": "schema.json",
      "responseSchema": "schema.json",
      "timeout": 0,
      "sendEmpty": false,
      "requestDatatype": "JSON",
      "responseDatatype": "JSON",
      "headers": {},
      "responseObjects": [
        {
          "type": "default",
          "key": "",
          "mockFile": "mockdatafiles/edgeUpdateEdgeCredentialsByConfiguration-default.json"
        }
      ]
    }
  ]
}