[
  {
    "id": 5,
    "created": "string",
    "networkId": 9,
    "gatewayPoolId": 1,
    "alertsEnabled": 0,
    "operatorAlertsEnabled": 0,
    "endpointPkiMode": "CERTIFICATE_DISABLED",
    "name": "string",
    "domain": "string",
    "prefix": "string",
    "logicalId": "string",
    "accountNumber": "string",
    "description": "string",
    "contactName": "string",
    "contactPhone": "string",
    "contactMobile": "string",
    "contactEmail": "string",
    "streetAddress": "string",
    "streetAddress2": "string",
    "city": "string",
    "state": "string",
    "postalCode": "string",
    "country": "string",
    "lat": 4,
    "lon": 3,
    "timezone": "string",
    "locale": "string",
    "modified": "string",
    "edgeCount": 10,
    "edges": [
      {
        "id": 3,
        "created": "string",
        "name": "string",
        "contactName": "string",
        "contactPhone": "string",
        "contactMobile": "string",
        "contactEmail": "string",
        "streetAddress": "string",
        "streetAddress2": "string",
        "city": "string",
        "state": "string",
        "postalCode": "string",
        "country": "string",
        "lat": 4,
        "lon": 4,
        "timezone": "string",
        "locale": "string",
        "shippingSameAsLocation": 0,
        "shippingContactName": "string",
        "shippingAddress": "string",
        "shippingAddress2": "string",
        "shippingCity": "string",
        "shippingState": "string",
        "shippingCountry": "string",
        "shippingPostalCode": "string",
        "modified": "string",
        "gatewayPoolId": 4,
        "networkId": 3,
        "returnData": true,
        "user": {
          "email": "string",
          "password": "string",
          "password2": "string",
          "username": "string"
        }
      },
      {
        "id": 8,
        "created": "string",
        "name": "string",
        "contactName": "string",
        "contactPhone": "string",
        "contactMobile": "string",
        "contactEmail": "string",
        "streetAddress": "string",
        "streetAddress2": "string",
        "city": "string",
        "state": "string",
        "postalCode": "string",
        "country": "string",
        "lat": 10,
        "lon": 3,
        "timezone": "string",
        "locale": "string",
        "shippingSameAsLocation": 1,
        "shippingContactName": "string",
        "shippingAddress": "string",
        "shippingAddress2": "string",
        "shippingCity": "string",
        "shippingState": "string",
        "shippingCountry": "string",
        "shippingPostalCode": "string",
        "modified": "string",
        "gatewayPoolId": 5,
        "networkId": 10,
        "returnData": true,
        "user": {
          "email": "string",
          "password": "string",
          "password2": "string",
          "username": "string"
        }
      },
      {
        "id": 1,
        "created": "string",
        "name": "string",
        "contactName": "string",
        "contactPhone": "string",
        "contactMobile": "string",
        "contactEmail": "string",
        "streetAddress": "string",
        "streetAddress2": "string",
        "city": "string",
        "state": "string",
        "postalCode": "string",
        "country": "string",
        "lat": 3,
        "lon": 10,
        "timezone": "string",
        "locale": "string",
        "shippingSameAsLocation": 0,
        "shippingContactName": "string",
        "shippingAddress": "string",
        "shippingAddress2": "string",
        "shippingCity": "string",
        "shippingState": "string",
        "shippingCountry": "string",
        "shippingPostalCode": "string",
        "modified": "string",
        "gatewayPoolId": 1,
        "networkId": 4,
        "returnData": true,
        "user": {
          "email": "string",
          "password": "string",
          "password2": "string",
          "username": "string"
        }
      },
      {
        "id": 10,
        "created": "string",
        "name": "string",
        "contactName": "string",
        "contactPhone": "string",
        "contactMobile": "string",
        "contactEmail": "string",
        "streetAddress": "string",
        "streetAddress2": "string",
        "city": "string",
        "state": "string",
        "postalCode": "string",
        "country": "string",
        "lat": 5,
        "lon": 3,
        "timezone": "string",
        "locale": "string",
        "shippingSameAsLocation": 1,
        "shippingContactName": "string",
        "shippingAddress": "string",
        "shippingAddress2": "string",
        "shippingCity": "string",
        "shippingState": "string",
        "shippingCountry": "string",
        "shippingPostalCode": "string",
        "modified": "string",
        "gatewayPoolId": 2,
        "networkId": 6,
        "returnData": true,
        "user": {
          "email": "string",
          "password": "string",
          "password2": "string",
          "username": "string"
        }
      },
      {
        "id": 2,
        "created": "string",
        "name": "string",
        "contactName": "string",
        "contactPhone": "string",
        "contactMobile": "string",
        "contactEmail": "string",
        "streetAddress": "string",
        "streetAddress2": "string",
        "city": "string",
        "state": "string",
        "postalCode": "string",
        "country": "string",
        "lat": 7,
        "lon": 6,
        "timezone": "string",
        "locale": "string",
        "shippingSameAsLocation": 0,
        "shippingContactName": "string",
        "shippingAddress": "string",
        "shippingAddress2": "string",
        "shippingCity": "string",
        "shippingState": "string",
        "shippingCountry": "string",
        "shippingPostalCode": "string",
        "modified": "string",
        "gatewayPoolId": 8,
        "networkId": 1,
        "returnData": true,
        "user": {
          "email": "string",
          "password": "string",
          "password2": "string",
          "username": "string"
        }
      }
    ]
  }
]