{
  "actions": [
    {
      "name": "postLoginoperatorLogin",
      "protocol": "REST",
      "method": "POST",
      "entitypath": "{base_path}/{version}/login/operatorLogin?{query}",
      "requestSchema": "schema.json",
      "responseSchema": "schema.json",
      "timeout": 0,
      "sendEmpty": false,
      "sendGetBody": false,
      "requestDatatype": "JSON",
      "responseDatatype": "JSON",
      "headers": {},
      "responseObjects": [
        {
          "type": "default",
          "key": "",
          "mockFile": ""
        }
      ]
    },
    {
      "name": "postLoginenterpriseLogin",
      "protocol": "REST",
      "method": "POST",
      "entitypath": "{base_path}/{version}/login/enterpriseLogin?{query}",
      "requestSchema": "schema.json",
      "responseSchema": "schema.json",
      "timeout": 0,
      "sendEmpty": false,
      "sendGetBody": false,
      "requestDatatype": "JSON",
      "responseDatatype": "JSON",
      "headers": {},
      "responseObjects": [
        {
          "type": "default",
          "key": "",
          "mockFile": ""
        }
      ]
    },
    {
      "name": "postLogout",
      "protocol": "REST",
      "method": "POST",
      "entitypath": "{base_path}/{version}/logout?{query}",
      "requestSchema": "schema.json",
      "responseSchema": "schema.json",
      "timeout": 0,
      "sendEmpty": false,
      "sendGetBody": false,
      "requestDatatype": "JSON",
      "responseDatatype": "JSON",
      "headers": {},
      "responseObjects": [
        {
          "type": "default",
          "key": "",
          "mockFile": ""
        }
      ]
    },
    {
      "name": "postMetaapiPath",
      "protocol": "REST",
      "method": "POST",
      "entitypath": "{base_path}/{version}/meta/{pathv1}?{query}",
      "requestSchema": "schema.json",
      "responseSchema": "schema.json",
      "timeout": 0,
      "sendEmpty": false,
      "sendGetBody": false,
      "requestDatatype": "JSON",
      "responseDatatype": "JSON",
      "headers": {},
      "responseObjects": [
        {
          "type": "default",
          "key": "",
          "mockFile": "mockdatafiles/postMetaapiPath-default.json"
        }
      ]
    },
    {
      "name": "postConfigurationcloneEnterpriseTemplate",
      "protocol": "REST",
      "method": "POST",
      "entitypath": "{base_path}/{version}/configuration/cloneEnterpriseTemplate?{query}",
      "requestSchema": "schema.json",
      "responseSchema": "schema.json",
      "timeout": 0,
      "sendEmpty": false,
      "sendGetBody": false,
      "requestDatatype": "JSON",
      "responseDatatype": "JSON",
      "headers": {},
      "responseObjects": [
        {
          "type": "default",
          "key": "",
          "mockFile": "mockdatafiles/postConfigurationcloneEnterpriseTemplate-default.json"
        }
      ]
    },
    {
      "name": "postConfigurationdeleteConfiguration",
      "protocol": "REST",
      "method": "POST",
      "entitypath": "{base_path}/{version}/configuration/deleteConfiguration?{query}",
      "requestSchema": "schema.json",
      "responseSchema": "schema.json",
      "timeout": 0,
      "sendEmpty": false,
      "sendGetBody": false,
      "requestDatatype": "JSON",
      "responseDatatype": "JSON",
      "headers": {},
      "responseObjects": [
        {
          "type": "default",
          "key": "",
          "mockFile": "mockdatafiles/postConfigurationdeleteConfiguration-default.json"
        }
      ]
    },
    {
      "name": "postConfigurationgetConfiguration",
      "protocol": "REST",
      "method": "POST",
      "entitypath": "{base_path}/{version}/configuration/getConfiguration?{query}",
      "requestSchema": "schema.json",
      "responseSchema": "schema.json",
      "timeout": 0,
      "sendEmpty": false,
      "sendGetBody": false,
      "requestDatatype": "JSON",
      "responseDatatype": "JSON",
      "headers": {},
      "responseObjects": [
        {
          "type": "default",
          "key": "",
          "mockFile": "mockdatafiles/postConfigurationgetConfiguration-default.json"
        }
      ]
    },
    {
      "name": "postConfigurationgetRoutableApplications",
      "protocol": "REST",
      "method": "POST",
      "entitypath": "{base_path}/{version}/configuration/getRoutableApplications?{query}",
      "requestSchema": "schema.json",
      "responseSchema": "schema.json",
      "timeout": 0,
      "sendEmpty": false,
      "sendGetBody": false,
      "requestDatatype": "JSON",
      "responseDatatype": "JSON",
      "headers": {},
      "responseObjects": [
        {
          "type": "default",
          "key": "",
          "mockFile": "mockdatafiles/postConfigurationgetRoutableApplications-default.json"
        }
      ]
    },
    {
      "name": "postDisasterRecoveryconfigureActiveForReplication",
      "protocol": "REST",
      "method": "POST",
      "entitypath": "{base_path}/{version}/disasterRecovery/configureActiveForReplication?{query}",
      "requestSchema": "schema.json",
      "responseSchema": "schema.json",
      "timeout": 0,
      "sendEmpty": false,
      "sendGetBody": false,
      "requestDatatype": "JSON",
      "responseDatatype": "JSON",
      "headers": {},
      "responseObjects": [
        {
          "type": "default",
          "key": "",
          "mockFile": "mockdatafiles/postDisasterRecoveryconfigureActiveForReplication-default.json"
        }
      ]
    },
    {
      "name": "postDisasterRecoverydemoteActive",
      "protocol": "REST",
      "method": "POST",
      "entitypath": "{base_path}/{version}/disasterRecovery/demoteActive?{query}",
      "requestSchema": "schema.json",
      "responseSchema": "schema.json",
      "timeout": 0,
      "sendEmpty": false,
      "sendGetBody": false,
      "requestDatatype": "JSON",
      "responseDatatype": "JSON",
      "headers": {},
      "responseObjects": [
        {
          "type": "default",
          "key": "",
          "mockFile": "mockdatafiles/postDisasterRecoverydemoteActive-default.json"
        }
      ]
    },
    {
      "name": "postDisasterRecoverygetReplicationBlob",
      "protocol": "REST",
      "method": "POST",
      "entitypath": "{base_path}/{version}/disasterRecovery/getReplicationBlob?{query}",
      "requestSchema": "schema.json",
      "responseSchema": "schema.json",
      "timeout": 0,
      "sendEmpty": false,
      "sendGetBody": false,
      "requestDatatype": "JSON",
      "responseDatatype": "JSON",
      "headers": {},
      "responseObjects": [
        {
          "type": "default",
          "key": "",
          "mockFile": "mockdatafiles/postDisasterRecoverygetReplicationBlob-default.json"
        }
      ]
    },
    {
      "name": "postDisasterRecoverygetReplicationStatus",
      "protocol": "REST",
      "method": "POST",
      "entitypath": "{base_path}/{version}/disasterRecovery/getReplicationStatus?{query}",
      "requestSchema": "schema.json",
      "responseSchema": "schema.json",
      "timeout": 0,
      "sendEmpty": false,
      "sendGetBody": false,
      "requestDatatype": "JSON",
      "responseDatatype": "JSON",
      "headers": {},
      "responseObjects": [
        {
          "type": "default",
          "key": "",
          "mockFile": "mockdatafiles/postDisasterRecoverygetReplicationStatus-default.json"
        }
      ]
    },
    {
      "name": "postDisasterRecoveryprepareForStandby",
      "protocol": "REST",
      "method": "POST",
      "entitypath": "{base_path}/{version}/disasterRecovery/prepareForStandby?{query}",
      "requestSchema": "schema.json",
      "responseSchema": "schema.json",
      "timeout": 0,
      "sendEmpty": false,
      "sendGetBody": false,
      "requestDatatype": "JSON",
      "responseDatatype": "JSON",
      "headers": {},
      "responseObjects": [
        {
          "type": "default",
          "key": "",
          "mockFile": "mockdatafiles/postDisasterRecoveryprepareForStandby-default.json"
        }
      ]
    },
    {
      "name": "postDisasterRecoverypromoteStandbyToActive",
      "protocol": "REST",
      "method": "POST",
      "entitypath": "{base_path}/{version}/disasterRecovery/promoteStandbyToActive?{query}",
      "requestSchema": "schema.json",
      "responseSchema": "schema.json",
      "timeout": 0,
      "sendEmpty": false,
      "sendGetBody": false,
      "requestDatatype": "JSON",
      "responseDatatype": "JSON",
      "headers": {},
      "responseObjects": [
        {
          "type": "default",
          "key": "",
          "mockFile": "mockdatafiles/postDisasterRecoverypromoteStandbyToActive-default.json"
        }
      ]
    },
    {
      "name": "postDisasterRecoveryremoveStandby",
      "protocol": "REST",
      "method": "POST",
      "entitypath": "{base_path}/{version}/disasterRecovery/removeStandby?{query}",
      "requestSchema": "schema.json",
      "responseSchema": "schema.json",
      "timeout": 0,
      "sendEmpty": false,
      "sendGetBody": false,
      "requestDatatype": "JSON",
      "responseDatatype": "JSON",
      "headers": {},
      "responseObjects": [
        {
          "type": "default",
          "key": "",
          "mockFile": "mockdatafiles/postDisasterRecoveryremoveStandby-default.json"
        }
      ]
    },
    {
      "name": "postDisasterRecoverytransitionToStandby",
      "protocol": "REST",
      "method": "POST",
      "entitypath": "{base_path}/{version}/disasterRecovery/transitionToStandby?{query}",
      "requestSchema": "schema.json",
      "responseSchema": "schema.json",
      "timeout": 0,
      "sendEmpty": false,
      "sendGetBody": false,
      "requestDatatype": "JSON",
      "responseDatatype": "JSON",
      "headers": {},
      "responseObjects": [
        {
          "type": "default",
          "key": "",
          "mockFile": "mockdatafiles/postDisasterRecoverytransitionToStandby-default.json"
        }
      ]
    },
    {
      "name": "postEdgedeleteEdge",
      "protocol": "REST",
      "method": "POST",
      "entitypath": "{base_path}/{version}/edge/deleteEdge?{query}",
      "requestSchema": "schema.json",
      "responseSchema": "schema.json",
      "timeout": 0,
      "sendEmpty": false,
      "sendGetBody": false,
      "requestDatatype": "JSON",
      "responseDatatype": "JSON",
      "headers": {},
      "responseObjects": [
        {
          "type": "default",
          "key": "",
          "mockFile": "mockdatafiles/postEdgedeleteEdge-default.json"
        }
      ]
    },
    {
      "name": "postEdgedeleteEdgeBgpNeighborRecords",
      "protocol": "REST",
      "method": "POST",
      "entitypath": "{base_path}/{version}/edge/deleteEdgeBgpNeighborRecords?{query}",
      "requestSchema": "schema.json",
      "responseSchema": "schema.json",
      "timeout": 0,
      "sendEmpty": false,
      "sendGetBody": false,
      "requestDatatype": "JSON",
      "responseDatatype": "JSON",
      "headers": {},
      "responseObjects": [
        {
          "type": "default",
          "key": "",
          "mockFile": "mockdatafiles/postEdgedeleteEdgeBgpNeighborRecords-default.json"
        }
      ]
    },
    {
      "name": "postEdgesetEdgeEnterpriseConfiguration",
      "protocol": "REST",
      "method": "POST",
      "entitypath": "{base_path}/{version}/edge/setEdgeEnterpriseConfiguration?{query}",
      "requestSchema": "schema.json",
      "responseSchema": "schema.json",
      "timeout": 0,
      "sendEmpty": false,
      "sendGetBody": false,
      "requestDatatype": "JSON",
      "responseDatatype": "JSON",
      "headers": {},
      "responseObjects": [
        {
          "type": "default",
          "key": "",
          "mockFile": "mockdatafiles/postEdgesetEdgeEnterpriseConfiguration-default.json"
        }
      ]
    },
    {
      "name": "postEdgesetEdgeHandOffGateways",
      "protocol": "REST",
      "method": "POST",
      "entitypath": "{base_path}/{version}/edge/setEdgeHandOffGateways?{query}",
      "requestSchema": "schema.json",
      "responseSchema": "schema.json",
      "timeout": 0,
      "sendEmpty": false,
      "sendGetBody": false,
      "requestDatatype": "JSON",
      "responseDatatype": "JSON",
      "headers": {},
      "responseObjects": [
        {
          "type": "default",
          "key": "",
          "mockFile": "mockdatafiles/postEdgesetEdgeHandOffGateways-default.json"
        }
      ]
    },
    {
      "name": "postEdgesetEdgeOperatorConfiguration",
      "protocol": "REST",
      "method": "POST",
      "entitypath": "{base_path}/{version}/edge/setEdgeOperatorConfiguration?{query}",
      "requestSchema": "schema.json",
      "responseSchema": "schema.json",
      "timeout": 0,
      "sendEmpty": false,
      "sendGetBody": false,
      "requestDatatype": "JSON",
      "responseDatatype": "JSON",
      "headers": {},
      "responseObjects": [
        {
          "type": "default",
          "key": "",
          "mockFile": "mockdatafiles/postEdgesetEdgeOperatorConfiguration-default.json"
        }
      ]
    },
    {
      "name": "postEnterprisedeleteEnterprise",
      "protocol": "REST",
      "method": "POST",
      "entitypath": "{base_path}/{version}/enterprise/deleteEnterprise?{query}",
      "requestSchema": "schema.json",
      "responseSchema": "schema.json",
      "timeout": 0,
      "sendEmpty": false,
      "sendGetBody": false,
      "requestDatatype": "JSON",
      "responseDatatype": "JSON",
      "headers": {},
      "responseObjects": [
        {
          "type": "default",
          "key": "",
          "mockFile": "mockdatafiles/postEnterprisedeleteEnterprise-default.json"
        }
      ]
    },
    {
      "name": "postEnterprisedeleteEnterpriseGatewayRecords",
      "protocol": "REST",
      "method": "POST",
      "entitypath": "{base_path}/{version}/enterprise/deleteEnterpriseGatewayRecords?{query}",
      "requestSchema": "schema.json",
      "responseSchema": "schema.json",
      "timeout": 0,
      "sendEmpty": false,
      "sendGetBody": false,
      "requestDatatype": "JSON",
      "responseDatatype": "JSON",
      "headers": {},
      "responseObjects": [
        {
          "type": "default",
          "key": "",
          "mockFile": "mockdatafiles/postEnterprisedeleteEnterpriseGatewayRecords-default.json"
        }
      ]
    },
    {
      "name": "postEnterprisedeleteEnterpriseNetworkAllocation",
      "protocol": "REST",
      "method": "POST",
      "entitypath": "{base_path}/{version}/enterprise/deleteEnterpriseNetworkAllocation?{query}",
      "requestSchema": "schema.json",
      "responseSchema": "schema.json",
      "timeout": 0,
      "sendEmpty": false,
      "sendGetBody": false,
      "requestDatatype": "JSON",
      "responseDatatype": "JSON",
      "headers": {},
      "responseObjects": [
        {
          "type": "default",
          "key": "",
          "mockFile": "mockdatafiles/postEnterprisedeleteEnterpriseNetworkAllocation-default.json"
        }
      ]
    },
    {
      "name": "postEnterprisedeleteEnterpriseService",
      "protocol": "REST",
      "method": "POST",
      "entitypath": "{base_path}/{version}/enterprise/deleteEnterpriseService?{query}",
      "requestSchema": "schema.json",
      "responseSchema": "schema.json",
      "timeout": 0,
      "sendEmpty": false,
      "sendGetBody": false,
      "requestDatatype": "JSON",
      "responseDatatype": "JSON",
      "headers": {},
      "responseObjects": [
        {
          "type": "default",
          "key": "",
          "mockFile": "mockdatafiles/postEnterprisedeleteEnterpriseService-default.json"
        }
      ]
    },
    {
      "name": "postEnterprisegetEnterpriseAddresses",
      "protocol": "REST",
      "method": "POST",
      "entitypath": "{base_path}/{version}/enterprise/getEnterpriseAddresses?{query}",
      "requestSchema": "schema.json",
      "responseSchema": "schema.json",
      "timeout": 0,
      "sendEmpty": false,
      "sendGetBody": false,
      "requestDatatype": "JSON",
      "responseDatatype": "JSON",
      "headers": {},
      "responseObjects": [
        {
          "type": "default",
          "key": "",
          "mockFile": "mockdatafiles/postEnterprisegetEnterpriseAddresses-default.json"
        }
      ]
    },
    {
      "name": "postEnterprisegetEnterpriseAlertConfigurations",
      "protocol": "REST",
      "method": "POST",
      "entitypath": "{base_path}/{version}/enterprise/getEnterpriseAlertConfigurations?{query}",
      "requestSchema": "schema.json",
      "responseSchema": "schema.json",
      "timeout": 0,
      "sendEmpty": false,
      "sendGetBody": false,
      "requestDatatype": "JSON",
      "responseDatatype": "JSON",
      "headers": {},
      "responseObjects": [
        {
          "type": "default",
          "key": "",
          "mockFile": "mockdatafiles/postEnterprisegetEnterpriseAlertConfigurations-default.json"
        }
      ]
    },
    {
      "name": "postEnterprisegetEnterpriseAlerts",
      "protocol": "REST",
      "method": "POST",
      "entitypath": "{base_path}/{version}/enterprise/getEnterpriseAlerts?{query}",
      "requestSchema": "schema.json",
      "responseSchema": "schema.json",
      "timeout": 0,
      "sendEmpty": false,
      "sendGetBody": false,
      "requestDatatype": "JSON",
      "responseDatatype": "JSON",
      "headers": {},
      "responseObjects": [
        {
          "type": "default",
          "key": "",
          "mockFile": "mockdatafiles/postEnterprisegetEnterpriseAlerts-default.json"
        }
      ]
    },
    {
      "name": "postEnterprisegetEnterpriseAllAlertsRecipients",
      "protocol": "REST",
      "method": "POST",
      "entitypath": "{base_path}/{version}/enterprise/getEnterpriseAllAlertsRecipients?{query}",
      "requestSchema": "schema.json",
      "responseSchema": "schema.json",
      "timeout": 0,
      "sendEmpty": false,
      "sendGetBody": false,
      "requestDatatype": "JSON",
      "responseDatatype": "JSON",
      "headers": {},
      "responseObjects": [
        {
          "type": "default",
          "key": "",
          "mockFile": "mockdatafiles/postEnterprisegetEnterpriseAllAlertsRecipients-default.json"
        }
      ]
    },
    {
      "name": "postEnterprisegetEnterpriseConfigurations",
      "protocol": "REST",
      "method": "POST",
      "entitypath": "{base_path}/{version}/enterprise/getEnterpriseConfigurations?{query}",
      "requestSchema": "schema.json",
      "responseSchema": "schema.json",
      "timeout": 0,
      "sendEmpty": false,
      "sendGetBody": false,
      "requestDatatype": "JSON",
      "responseDatatype": "JSON",
      "headers": {},
      "responseObjects": [
        {
          "type": "default",
          "key": "",
          "mockFile": "mockdatafiles/postEnterprisegetEnterpriseConfigurations-default.json"
        }
      ]
    },
    {
      "name": "postEnterprisegetEnterpriseNetworkAllocations",
      "protocol": "REST",
      "method": "POST",
      "entitypath": "{base_path}/{version}/enterprise/getEnterpriseNetworkAllocations?{query}",
      "requestSchema": "schema.json",
      "responseSchema": "schema.json",
      "timeout": 0,
      "sendEmpty": false,
      "sendGetBody": false,
      "requestDatatype": "JSON",
      "responseDatatype": "JSON",
      "headers": {},
      "responseObjects": [
        {
          "type": "default",
          "key": "",
          "mockFile": "mockdatafiles/postEnterprisegetEnterpriseNetworkAllocations-default.json"
        }
      ]
    },
    {
      "name": "postEnterprisegetEnterpriseRouteConfiguration",
      "protocol": "REST",
      "method": "POST",
      "entitypath": "{base_path}/{version}/enterprise/getEnterpriseRouteConfiguration?{query}",
      "requestSchema": "schema.json",
      "responseSchema": "schema.json",
      "timeout": 0,
      "sendEmpty": false,
      "sendGetBody": false,
      "requestDatatype": "JSON",
      "responseDatatype": "JSON",
      "headers": {},
      "responseObjects": [
        {
          "type": "default",
          "key": "",
          "mockFile": "mockdatafiles/postEnterprisegetEnterpriseRouteConfiguration-default.json"
        }
      ]
    },
    {
      "name": "postEnterprisegetEnterpriseRouteTable",
      "protocol": "REST",
      "method": "POST",
      "entitypath": "{base_path}/{version}/enterprise/getEnterpriseRouteTable?{query}",
      "requestSchema": "schema.json",
      "responseSchema": "schema.json",
      "timeout": 0,
      "sendEmpty": false,
      "sendGetBody": false,
      "requestDatatype": "JSON",
      "responseDatatype": "JSON",
      "headers": {},
      "responseObjects": [
        {
          "type": "default",
          "key": "",
          "mockFile": "mockdatafiles/postEnterprisegetEnterpriseRouteTable-default.json"
        }
      ]
    },
    {
      "name": "postEnterprisegetEnterpriseServices",
      "protocol": "REST",
      "method": "POST",
      "entitypath": "{base_path}/{version}/enterprise/getEnterpriseServices?{query}",
      "requestSchema": "schema.json",
      "responseSchema": "schema.json",
      "timeout": 0,
      "sendEmpty": false,
      "sendGetBody": false,
      "requestDatatype": "JSON",
      "responseDatatype": "JSON",
      "headers": {},
      "responseObjects": [
        {
          "type": "default",
          "key": "",
          "mockFile": "mockdatafiles/postEnterprisegetEnterpriseServices-default.json"
        }
      ]
    },
    {
      "name": "postEnterpriseinsertEnterpriseService",
      "protocol": "REST",
      "method": "POST",
      "entitypath": "{base_path}/{version}/enterprise/insertEnterpriseService?{query}",
      "requestSchema": "schema.json",
      "responseSchema": "schema.json",
      "timeout": 0,
      "sendEmpty": false,
      "sendGetBody": false,
      "requestDatatype": "JSON",
      "responseDatatype": "JSON",
      "headers": {},
      "responseObjects": [
        {
          "type": "default",
          "key": "",
          "mockFile": "mockdatafiles/postEnterpriseinsertEnterpriseService-default.json"
        }
      ]
    },
    {
      "name": "postEnterpriseinsertOrUpdateEnterpriseAlertConfigurations",
      "protocol": "REST",
      "method": "POST",
      "entitypath": "{base_path}/{version}/enterprise/insertOrUpdateEnterpriseAlertConfigurations?{query}",
      "requestSchema": "schema.json",
      "responseSchema": "schema.json",
      "timeout": 0,
      "sendEmpty": false,
      "sendGetBody": false,
      "requestDatatype": "JSON",
      "responseDatatype": "JSON",
      "headers": {},
      "responseObjects": [
        {
          "type": "default",
          "key": "",
          "mockFile": "mockdatafiles/postEnterpriseinsertOrUpdateEnterpriseAlertConfigurations-default.json"
        }
      ]
    },
    {
      "name": "postEnterprisesetEnterpriseAllAlertsRecipients",
      "protocol": "REST",
      "method": "POST",
      "entitypath": "{base_path}/{version}/enterprise/setEnterpriseAllAlertsRecipients?{query}",
      "requestSchema": "schema.json",
      "responseSchema": "schema.json",
      "timeout": 0,
      "sendEmpty": false,
      "sendGetBody": false,
      "requestDatatype": "JSON",
      "responseDatatype": "JSON",
      "headers": {},
      "responseObjects": [
        {
          "type": "default",
          "key": "",
          "mockFile": "mockdatafiles/postEnterprisesetEnterpriseAllAlertsRecipients-default.json"
        }
      ]
    },
    {
      "name": "postEnterpriseupdateEnterpriseRoute",
      "protocol": "REST",
      "method": "POST",
      "entitypath": "{base_path}/{version}/enterprise/updateEnterpriseRoute?{query}",
      "requestSchema": "schema.json",
      "responseSchema": "schema.json",
      "timeout": 0,
      "sendEmpty": false,
      "sendGetBody": false,
      "requestDatatype": "JSON",
      "responseDatatype": "JSON",
      "headers": {},
      "responseObjects": [
        {
          "type": "default",
          "key": "",
          "mockFile": "mockdatafiles/postEnterpriseupdateEnterpriseRoute-default.json"
        }
      ]
    },
    {
      "name": "postEnterpriseupdateEnterpriseRouteConfiguration",
      "protocol": "REST",
      "method": "POST",
      "entitypath": "{base_path}/{version}/enterprise/updateEnterpriseRouteConfiguration?{query}",
      "requestSchema": "schema.json",
      "responseSchema": "schema.json",
      "timeout": 0,
      "sendEmpty": false,
      "sendGetBody": false,
      "requestDatatype": "JSON",
      "responseDatatype": "JSON",
      "headers": {},
      "responseObjects": [
        {
          "type": "default",
          "key": "",
          "mockFile": "mockdatafiles/postEnterpriseupdateEnterpriseRouteConfiguration-default.json"
        }
      ]
    },
    {
      "name": "postEnterpriseupdateEnterpriseService",
      "protocol": "REST",
      "method": "POST",
      "entitypath": "{base_path}/{version}/enterprise/updateEnterpriseService?{query}",
      "requestSchema": "schema.json",
      "responseSchema": "schema.json",
      "timeout": 0,
      "sendEmpty": false,
      "sendGetBody": false,
      "requestDatatype": "JSON",
      "responseDatatype": "JSON",
      "headers": {},
      "responseObjects": [
        {
          "type": "default",
          "key": "",
          "mockFile": "mockdatafiles/postEnterpriseupdateEnterpriseService-default.json"
        }
      ]
    },
    {
      "name": "postEnterpriseProxydeleteEnterpriseProxyUser",
      "protocol": "REST",
      "method": "POST",
      "entitypath": "{base_path}/{version}/enterpriseProxy/deleteEnterpriseProxyUser?{query}",
      "requestSchema": "schema.json",
      "responseSchema": "schema.json",
      "timeout": 0,
      "sendEmpty": false,
      "sendGetBody": false,
      "requestDatatype": "JSON",
      "responseDatatype": "JSON",
      "headers": {},
      "responseObjects": [
        {
          "type": "default",
          "key": "",
          "mockFile": "mockdatafiles/postEnterpriseProxydeleteEnterpriseProxyUser-default.json"
        }
      ]
    },
    {
      "name": "postEnterpriseProxygetEnterpriseProxyEdgeInventory",
      "protocol": "REST",
      "method": "POST",
      "entitypath": "{base_path}/{version}/enterpriseProxy/getEnterpriseProxyEdgeInventory?{query}",
      "requestSchema": "schema.json",
      "responseSchema": "schema.json",
      "timeout": 0,
      "sendEmpty": false,
      "sendGetBody": false,
      "requestDatatype": "JSON",
      "responseDatatype": "JSON",
      "headers": {},
      "responseObjects": [
        {
          "type": "default",
          "key": "",
          "mockFile": "mockdatafiles/postEnterpriseProxygetEnterpriseProxyEdgeInventory-default.json"
        }
      ]
    },
    {
      "name": "postEnterpriseProxygetEnterpriseProxyEnterprises",
      "protocol": "REST",
      "method": "POST",
      "entitypath": "{base_path}/{version}/enterpriseProxy/getEnterpriseProxyEnterprises?{query}",
      "requestSchema": "schema.json",
      "responseSchema": "schema.json",
      "timeout": 0,
      "sendEmpty": false,
      "sendGetBody": false,
      "requestDatatype": "JSON",
      "responseDatatype": "JSON",
      "headers": {},
      "responseObjects": [
        {
          "type": "default",
          "key": "",
          "mockFile": "mockdatafiles/postEnterpriseProxygetEnterpriseProxyEnterprises-default.json"
        }
      ]
    },
    {
      "name": "postEnterpriseProxygetEnterpriseProxyGatewayPools",
      "protocol": "REST",
      "method": "POST",
      "entitypath": "{base_path}/{version}/enterpriseProxy/getEnterpriseProxyGatewayPools?{query}",
      "requestSchema": "schema.json",
      "responseSchema": "schema.json",
      "timeout": 0,
      "sendEmpty": false,
      "sendGetBody": false,
      "requestDatatype": "JSON",
      "responseDatatype": "JSON",
      "headers": {},
      "responseObjects": [
        {
          "type": "default",
          "key": "",
          "mockFile": "mockdatafiles/postEnterpriseProxygetEnterpriseProxyGatewayPools-default.json"
        }
      ]
    },
    {
      "name": "postEnterpriseProxygetEnterpriseProxyOperatorProfiles",
      "protocol": "REST",
      "method": "POST",
      "entitypath": "{base_path}/{version}/enterpriseProxy/getEnterpriseProxyOperatorProfiles?{query}",
      "requestSchema": "schema.json",
      "responseSchema": "schema.json",
      "timeout": 0,
      "sendEmpty": false,
      "sendGetBody": false,
      "requestDatatype": "JSON",
      "responseDatatype": "JSON",
      "headers": {},
      "responseObjects": [
        {
          "type": "default",
          "key": "",
          "mockFile": "mockdatafiles/postEnterpriseProxygetEnterpriseProxyOperatorProfiles-default.json"
        }
      ]
    },
    {
      "name": "postEnterpriseProxygetEnterpriseProxyUser",
      "protocol": "REST",
      "method": "POST",
      "entitypath": "{base_path}/{version}/enterpriseProxy/getEnterpriseProxyUser?{query}",
      "requestSchema": "schema.json",
      "responseSchema": "schema.json",
      "timeout": 0,
      "sendEmpty": false,
      "sendGetBody": false,
      "requestDatatype": "JSON",
      "responseDatatype": "JSON",
      "headers": {},
      "responseObjects": [
        {
          "type": "default",
          "key": "",
          "mockFile": ""
        }
      ]
    },
    {
      "name": "postEnterpriseProxyinsertEnterpriseProxyUser",
      "protocol": "REST",
      "method": "POST",
      "entitypath": "{base_path}/{version}/enterpriseProxy/insertEnterpriseProxyUser?{query}",
      "requestSchema": "schema.json",
      "responseSchema": "schema.json",
      "timeout": 0,
      "sendEmpty": false,
      "sendGetBody": false,
      "requestDatatype": "JSON",
      "responseDatatype": "JSON",
      "headers": {},
      "responseObjects": [
        {
          "type": "default",
          "key": "",
          "mockFile": "mockdatafiles/postEnterpriseProxyinsertEnterpriseProxyUser-default.json"
        }
      ]
    },
    {
      "name": "postEnterpriseProxyupdateEnterpriseProxyUser",
      "protocol": "REST",
      "method": "POST",
      "entitypath": "{base_path}/{version}/enterpriseProxy/updateEnterpriseProxyUser?{query}",
      "requestSchema": "schema.json",
      "responseSchema": "schema.json",
      "timeout": 0,
      "sendEmpty": false,
      "sendGetBody": false,
      "requestDatatype": "JSON",
      "responseDatatype": "JSON",
      "headers": {},
      "responseObjects": [
        {
          "type": "default",
          "key": "",
          "mockFile": "mockdatafiles/postEnterpriseProxyupdateEnterpriseProxyUser-default.json"
        }
      ]
    },
    {
      "name": "postEnterpriseUserdeleteEnterpriseUser",
      "protocol": "REST",
      "method": "POST",
      "entitypath": "{base_path}/{version}/enterpriseUser/deleteEnterpriseUser?{query}",
      "requestSchema": "schema.json",
      "responseSchema": "schema.json",
      "timeout": 0,
      "sendEmpty": false,
      "sendGetBody": false,
      "requestDatatype": "JSON",
      "responseDatatype": "JSON",
      "headers": {},
      "responseObjects": [
        {
          "type": "default",
          "key": "",
          "mockFile": "mockdatafiles/postEnterpriseUserdeleteEnterpriseUser-default.json"
        }
      ]
    },
    {
      "name": "postEnterpriseUsergetEnterpriseUser",
      "protocol": "REST",
      "method": "POST",
      "entitypath": "{base_path}/{version}/enterpriseUser/getEnterpriseUser?{query}",
      "requestSchema": "schema.json",
      "responseSchema": "schema.json",
      "timeout": 0,
      "sendEmpty": false,
      "sendGetBody": false,
      "requestDatatype": "JSON",
      "responseDatatype": "JSON",
      "headers": {},
      "responseObjects": [
        {
          "type": "default",
          "key": "",
          "mockFile": "mockdatafiles/postEnterpriseUsergetEnterpriseUser-default.json"
        }
      ]
    },
    {
      "name": "postEnterpriseUserupdateEnterpriseUser",
      "protocol": "REST",
      "method": "POST",
      "entitypath": "{base_path}/{version}/enterpriseUser/updateEnterpriseUser?{query}",
      "requestSchema": "schema.json",
      "responseSchema": "schema.json",
      "timeout": 0,
      "sendEmpty": false,
      "sendGetBody": false,
      "requestDatatype": "JSON",
      "responseDatatype": "JSON",
      "headers": {},
      "responseObjects": [
        {
          "type": "default",
          "key": "",
          "mockFile": "mockdatafiles/postEnterpriseUserupdateEnterpriseUser-default.json"
        }
      ]
    },
    {
      "name": "postMetricsgetEdgeAppLinkMetrics",
      "protocol": "REST",
      "method": "POST",
      "entitypath": "{base_path}/{version}/metrics/getEdgeAppLinkMetrics?{query}",
      "requestSchema": "schema.json",
      "responseSchema": "schema.json",
      "timeout": 0,
      "sendEmpty": false,
      "sendGetBody": false,
      "requestDatatype": "JSON",
      "responseDatatype": "JSON",
      "headers": {},
      "responseObjects": [
        {
          "type": "default",
          "key": "",
          "mockFile": "mockdatafiles/postMetricsgetEdgeAppLinkMetrics-default.json"
        }
      ]
    },
    {
      "name": "postMetricsgetEdgeAppLinkSeries",
      "protocol": "REST",
      "method": "POST",
      "entitypath": "{base_path}/{version}/metrics/getEdgeAppLinkSeries?{query}",
      "requestSchema": "schema.json",
      "responseSchema": "schema.json",
      "timeout": 0,
      "sendEmpty": false,
      "sendGetBody": false,
      "requestDatatype": "JSON",
      "responseDatatype": "JSON",
      "headers": {},
      "responseObjects": [
        {
          "type": "default",
          "key": "",
          "mockFile": "mockdatafiles/postMetricsgetEdgeAppLinkSeries-default.json"
        }
      ]
    },
    {
      "name": "postMetricsgetEdgeAppMetrics",
      "protocol": "REST",
      "method": "POST",
      "entitypath": "{base_path}/{version}/metrics/getEdgeAppMetrics?{query}",
      "requestSchema": "schema.json",
      "responseSchema": "schema.json",
      "timeout": 0,
      "sendEmpty": false,
      "sendGetBody": false,
      "requestDatatype": "JSON",
      "responseDatatype": "JSON",
      "headers": {},
      "responseObjects": [
        {
          "type": "default",
          "key": "",
          "mockFile": "mockdatafiles/postMetricsgetEdgeAppMetrics-default.json"
        }
      ]
    },
    {
      "name": "postMetricsgetEdgeAppSeries",
      "protocol": "REST",
      "method": "POST",
      "entitypath": "{base_path}/{version}/metrics/getEdgeAppSeries?{query}",
      "requestSchema": "schema.json",
      "responseSchema": "schema.json",
      "timeout": 0,
      "sendEmpty": false,
      "sendGetBody": false,
      "requestDatatype": "JSON",
      "responseDatatype": "JSON",
      "headers": {},
      "responseObjects": [
        {
          "type": "default",
          "key": "",
          "mockFile": "mockdatafiles/postMetricsgetEdgeAppSeries-default.json"
        }
      ]
    },
    {
      "name": "postMetricsgetEdgeCategoryMetrics",
      "protocol": "REST",
      "method": "POST",
      "entitypath": "{base_path}/{version}/metrics/getEdgeCategoryMetrics?{query}",
      "requestSchema": "schema.json",
      "responseSchema": "schema.json",
      "timeout": 0,
      "sendEmpty": false,
      "sendGetBody": false,
      "requestDatatype": "JSON",
      "responseDatatype": "JSON",
      "headers": {},
      "responseObjects": [
        {
          "type": "default",
          "key": "",
          "mockFile": "mockdatafiles/postMetricsgetEdgeCategoryMetrics-default.json"
        }
      ]
    },
    {
      "name": "postMetricsgetEdgeCategorySeries",
      "protocol": "REST",
      "method": "POST",
      "entitypath": "{base_path}/{version}/metrics/getEdgeCategorySeries?{query}",
      "requestSchema": "schema.json",
      "responseSchema": "schema.json",
      "timeout": 0,
      "sendEmpty": false,
      "sendGetBody": false,
      "requestDatatype": "JSON",
      "responseDatatype": "JSON",
      "headers": {},
      "responseObjects": [
        {
          "type": "default",
          "key": "",
          "mockFile": "mockdatafiles/postMetricsgetEdgeCategorySeries-default.json"
        }
      ]
    },
    {
      "name": "postMetricsgetEdgeDestMetrics",
      "protocol": "REST",
      "method": "POST",
      "entitypath": "{base_path}/{version}/metrics/getEdgeDestMetrics?{query}",
      "requestSchema": "schema.json",
      "responseSchema": "schema.json",
      "timeout": 0,
      "sendEmpty": false,
      "sendGetBody": false,
      "requestDatatype": "JSON",
      "responseDatatype": "JSON",
      "headers": {},
      "responseObjects": [
        {
          "type": "default",
          "key": "",
          "mockFile": "mockdatafiles/postMetricsgetEdgeDestMetrics-default.json"
        }
      ]
    },
    {
      "name": "postMetricsgetEdgeDestSeries",
      "protocol": "REST",
      "method": "POST",
      "entitypath": "{base_path}/{version}/metrics/getEdgeDestSeries?{query}",
      "requestSchema": "schema.json",
      "responseSchema": "schema.json",
      "timeout": 0,
      "sendEmpty": false,
      "sendGetBody": false,
      "requestDatatype": "JSON",
      "responseDatatype": "JSON",
      "headers": {},
      "responseObjects": [
        {
          "type": "default",
          "key": "",
          "mockFile": "mockdatafiles/postMetricsgetEdgeDestSeries-default.json"
        }
      ]
    },
    {
      "name": "postMetricsgetEdgeDeviceMetrics",
      "protocol": "REST",
      "method": "POST",
      "entitypath": "{base_path}/{version}/metrics/getEdgeDeviceMetrics?{query}",
      "requestSchema": "schema.json",
      "responseSchema": "schema.json",
      "timeout": 0,
      "sendEmpty": false,
      "sendGetBody": false,
      "requestDatatype": "JSON",
      "responseDatatype": "JSON",
      "headers": {},
      "responseObjects": [
        {
          "type": "default",
          "key": "",
          "mockFile": "mockdatafiles/postMetricsgetEdgeDeviceMetrics-default.json"
        }
      ]
    },
    {
      "name": "postMetricsgetEdgeDeviceSeries",
      "protocol": "REST",
      "method": "POST",
      "entitypath": "{base_path}/{version}/metrics/getEdgeDeviceSeries?{query}",
      "requestSchema": "schema.json",
      "responseSchema": "schema.json",
      "timeout": 0,
      "sendEmpty": false,
      "sendGetBody": false,
      "requestDatatype": "JSON",
      "responseDatatype": "JSON",
      "headers": {},
      "responseObjects": [
        {
          "type": "default",
          "key": "",
          "mockFile": "mockdatafiles/postMetricsgetEdgeDeviceSeries-default.json"
        }
      ]
    },
    {
      "name": "postMetricsgetEdgeLinkMetrics",
      "protocol": "REST",
      "method": "POST",
      "entitypath": "{base_path}/{version}/metrics/getEdgeLinkMetrics?{query}",
      "requestSchema": "schema.json",
      "responseSchema": "schema.json",
      "timeout": 0,
      "sendEmpty": false,
      "sendGetBody": false,
      "requestDatatype": "JSON",
      "responseDatatype": "JSON",
      "headers": {},
      "responseObjects": [
        {
          "type": "default",
          "key": "",
          "mockFile": "mockdatafiles/postMetricsgetEdgeLinkMetrics-default.json"
        }
      ]
    },
    {
      "name": "postMetricsgetEdgeLinkSeries",
      "protocol": "REST",
      "method": "POST",
      "entitypath": "{base_path}/{version}/metrics/getEdgeLinkSeries?{query}",
      "requestSchema": "schema.json",
      "responseSchema": "schema.json",
      "timeout": 0,
      "sendEmpty": false,
      "sendGetBody": false,
      "requestDatatype": "JSON",
      "responseDatatype": "JSON",
      "headers": {},
      "responseObjects": [
        {
          "type": "default",
          "key": "",
          "mockFile": "mockdatafiles/postMetricsgetEdgeLinkSeries-default.json"
        }
      ]
    },
    {
      "name": "postMetricsgetEdgeOsMetrics",
      "protocol": "REST",
      "method": "POST",
      "entitypath": "{base_path}/{version}/metrics/getEdgeOsMetrics?{query}",
      "requestSchema": "schema.json",
      "responseSchema": "schema.json",
      "timeout": 0,
      "sendEmpty": false,
      "sendGetBody": false,
      "requestDatatype": "JSON",
      "responseDatatype": "JSON",
      "headers": {},
      "responseObjects": [
        {
          "type": "default",
          "key": "",
          "mockFile": "mockdatafiles/postMetricsgetEdgeOsMetrics-default.json"
        }
      ]
    },
    {
      "name": "postMetricsgetEdgeOsSeries",
      "protocol": "REST",
      "method": "POST",
      "entitypath": "{base_path}/{version}/metrics/getEdgeOsSeries?{query}",
      "requestSchema": "schema.json",
      "responseSchema": "schema.json",
      "timeout": 0,
      "sendEmpty": false,
      "sendGetBody": false,
      "requestDatatype": "JSON",
      "responseDatatype": "JSON",
      "headers": {},
      "responseObjects": [
        {
          "type": "default",
          "key": "",
          "mockFile": "mockdatafiles/postMetricsgetEdgeOsSeries-default.json"
        }
      ]
    },
    {
      "name": "postMetricsgetEdgeSegmentMetrics",
      "protocol": "REST",
      "method": "POST",
      "entitypath": "{base_path}/{version}/metrics/getEdgeSegmentMetrics?{query}",
      "requestSchema": "schema.json",
      "responseSchema": "schema.json",
      "timeout": 0,
      "sendEmpty": false,
      "sendGetBody": false,
      "requestDatatype": "JSON",
      "responseDatatype": "JSON",
      "headers": {},
      "responseObjects": [
        {
          "type": "default",
          "key": "",
          "mockFile": "mockdatafiles/postMetricsgetEdgeSegmentMetrics-default.json"
        }
      ]
    },
    {
      "name": "postMetricsgetEdgeSegmentSeries",
      "protocol": "REST",
      "method": "POST",
      "entitypath": "{base_path}/{version}/metrics/getEdgeSegmentSeries?{query}",
      "requestSchema": "schema.json",
      "responseSchema": "schema.json",
      "timeout": 0,
      "sendEmpty": false,
      "sendGetBody": false,
      "requestDatatype": "JSON",
      "responseDatatype": "JSON",
      "headers": {},
      "responseObjects": [
        {
          "type": "default",
          "key": "",
          "mockFile": "mockdatafiles/postMetricsgetEdgeSegmentSeries-default.json"
        }
      ]
    },
    {
      "name": "postMonitoringgetAggregateEdgeLinkMetrics",
      "protocol": "REST",
      "method": "POST",
      "entitypath": "{base_path}/{version}/monitoring/getAggregateEdgeLinkMetrics?{query}",
      "requestSchema": "schema.json",
      "responseSchema": "schema.json",
      "timeout": 0,
      "sendEmpty": false,
      "sendGetBody": false,
      "requestDatatype": "JSON",
      "responseDatatype": "JSON",
      "headers": {},
      "responseObjects": [
        {
          "type": "default",
          "key": "",
          "mockFile": "mockdatafiles/postMonitoringgetAggregateEdgeLinkMetrics-default.json"
        }
      ]
    },
    {
      "name": "postMonitoringgetAggregateEnterpriseEvents",
      "protocol": "REST",
      "method": "POST",
      "entitypath": "{base_path}/{version}/monitoring/getAggregateEnterpriseEvents?{query}",
      "requestSchema": "schema.json",
      "responseSchema": "schema.json",
      "timeout": 0,
      "sendEmpty": false,
      "sendGetBody": false,
      "requestDatatype": "JSON",
      "responseDatatype": "JSON",
      "headers": {},
      "responseObjects": [
        {
          "type": "default",
          "key": "",
          "mockFile": "mockdatafiles/postMonitoringgetAggregateEnterpriseEvents-default.json"
        }
      ]
    },
    {
      "name": "postMonitoringgetAggregates",
      "protocol": "REST",
      "method": "POST",
      "entitypath": "{base_path}/{version}/monitoring/getAggregates?{query}",
      "requestSchema": "schema.json",
      "responseSchema": "schema.json",
      "timeout": 0,
      "sendEmpty": false,
      "sendGetBody": false,
      "requestDatatype": "JSON",
      "responseDatatype": "JSON",
      "headers": {},
      "responseObjects": [
        {
          "type": "default",
          "key": "",
          "mockFile": "mockdatafiles/postMonitoringgetAggregates-default.json"
        }
      ]
    },
    {
      "name": "postMonitoringgetEnterpriseBgpPeerStatus",
      "protocol": "REST",
      "method": "POST",
      "entitypath": "{base_path}/{version}/monitoring/getEnterpriseBgpPeerStatus?{query}",
      "requestSchema": "schema.json",
      "responseSchema": "schema.json",
      "timeout": 0,
      "sendEmpty": false,
      "sendGetBody": false,
      "requestDatatype": "JSON",
      "responseDatatype": "JSON",
      "headers": {},
      "responseObjects": [
        {
          "type": "default",
          "key": "",
          "mockFile": "mockdatafiles/postMonitoringgetEnterpriseBgpPeerStatus-default.json"
        }
      ]
    },
    {
      "name": "postMonitoringgetEnterpriseEdgeBgpPeerStatus",
      "protocol": "REST",
      "method": "POST",
      "entitypath": "{base_path}/{version}/monitoring/getEnterpriseEdgeBgpPeerStatus?{query}",
      "requestSchema": "schema.json",
      "responseSchema": "schema.json",
      "timeout": 0,
      "sendEmpty": false,
      "sendGetBody": false,
      "requestDatatype": "JSON",
      "responseDatatype": "JSON",
      "headers": {},
      "responseObjects": [
        {
          "type": "default",
          "key": "",
          "mockFile": "mockdatafiles/postMonitoringgetEnterpriseEdgeBgpPeerStatus-default.json"
        }
      ]
    },
    {
      "name": "postMonitoringgetEnterpriseEdgeLinkStatus",
      "protocol": "REST",
      "method": "POST",
      "entitypath": "{base_path}/{version}/monitoring/getEnterpriseEdgeLinkStatus?{query}",
      "requestSchema": "schema.json",
      "responseSchema": "schema.json",
      "timeout": 0,
      "sendEmpty": false,
      "sendGetBody": false,
      "requestDatatype": "JSON",
      "responseDatatype": "JSON",
      "headers": {},
      "responseObjects": [
        {
          "type": "default",
          "key": "",
          "mockFile": "mockdatafiles/postMonitoringgetEnterpriseEdgeLinkStatus-default.json"
        }
      ]
    },
    {
      "name": "postMonitoringgetEnterpriseEdgeNvsTunnelStatus",
      "protocol": "REST",
      "method": "POST",
      "entitypath": "{base_path}/{version}/monitoring/getEnterpriseEdgeNvsTunnelStatus?{query}",
      "requestSchema": "schema.json",
      "responseSchema": "schema.json",
      "timeout": 0,
      "sendEmpty": false,
      "sendGetBody": false,
      "requestDatatype": "JSON",
      "responseDatatype": "JSON",
      "headers": {},
      "responseObjects": [
        {
          "type": "default",
          "key": "",
          "mockFile": "mockdatafiles/postMonitoringgetEnterpriseEdgeNvsTunnelStatus-default.json"
        }
      ]
    },
    {
      "name": "postNetworkgetNetworkConfigurations",
      "protocol": "REST",
      "method": "POST",
      "entitypath": "{base_path}/{version}/network/getNetworkConfigurations?{query}",
      "requestSchema": "schema.json",
      "responseSchema": "schema.json",
      "timeout": 0,
      "sendEmpty": false,
      "sendGetBody": false,
      "requestDatatype": "JSON",
      "responseDatatype": "JSON",
      "headers": {},
      "responseObjects": [
        {
          "type": "default",
          "key": "",
          "mockFile": "mockdatafiles/postNetworkgetNetworkConfigurations-default.json"
        }
      ]
    },
    {
      "name": "postNetworkgetNetworkEnterprises",
      "protocol": "REST",
      "method": "POST",
      "entitypath": "{base_path}/{version}/network/getNetworkEnterprises?{query}",
      "requestSchema": "schema.json",
      "responseSchema": "schema.json",
      "timeout": 0,
      "sendEmpty": false,
      "sendGetBody": false,
      "requestDatatype": "JSON",
      "responseDatatype": "JSON",
      "headers": {},
      "responseObjects": [
        {
          "type": "default",
          "key": "",
          "mockFile": "mockdatafiles/postNetworkgetNetworkEnterprises-default.json"
        }
      ]
    },
    {
      "name": "postNetworkgetNetworkGatewayPools",
      "protocol": "REST",
      "method": "POST",
      "entitypath": "{base_path}/{version}/network/getNetworkGatewayPools?{query}",
      "requestSchema": "schema.json",
      "responseSchema": "schema.json",
      "timeout": 0,
      "sendEmpty": false,
      "sendGetBody": false,
      "requestDatatype": "JSON",
      "responseDatatype": "JSON",
      "headers": {},
      "responseObjects": [
        {
          "type": "default",
          "key": "",
          "mockFile": "mockdatafiles/postNetworkgetNetworkGatewayPools-default.json"
        }
      ]
    },
    {
      "name": "postNetworkgetNetworkOperatorUsers",
      "protocol": "REST",
      "method": "POST",
      "entitypath": "{base_path}/{version}/network/getNetworkOperatorUsers?{query}",
      "requestSchema": "schema.json",
      "responseSchema": "schema.json",
      "timeout": 0,
      "sendEmpty": false,
      "sendGetBody": false,
      "requestDatatype": "JSON",
      "responseDatatype": "JSON",
      "headers": {},
      "responseObjects": [
        {
          "type": "default",
          "key": "",
          "mockFile": "mockdatafiles/postNetworkgetNetworkOperatorUsers-default.json"
        }
      ]
    },
    {
      "name": "postOperatorUserdeleteOperatorUser",
      "protocol": "REST",
      "method": "POST",
      "entitypath": "{base_path}/{version}/operatorUser/deleteOperatorUser?{query}",
      "requestSchema": "schema.json",
      "responseSchema": "schema.json",
      "timeout": 0,
      "sendEmpty": false,
      "sendGetBody": false,
      "requestDatatype": "JSON",
      "responseDatatype": "JSON",
      "headers": {},
      "responseObjects": [
        {
          "type": "default",
          "key": "",
          "mockFile": "mockdatafiles/postOperatorUserdeleteOperatorUser-default.json"
        }
      ]
    },
    {
      "name": "postOperatorUsergetOperatorUser",
      "protocol": "REST",
      "method": "POST",
      "entitypath": "{base_path}/{version}/operatorUser/getOperatorUser?{query}",
      "requestSchema": "schema.json",
      "responseSchema": "schema.json",
      "timeout": 0,
      "sendEmpty": false,
      "sendGetBody": false,
      "requestDatatype": "JSON",
      "responseDatatype": "JSON",
      "headers": {},
      "responseObjects": [
        {
          "type": "default",
          "key": "",
          "mockFile": "mockdatafiles/postOperatorUsergetOperatorUser-default.json"
        }
      ]
    },
    {
      "name": "postOperatorUserinsertOperatorUser",
      "protocol": "REST",
      "method": "POST",
      "entitypath": "{base_path}/{version}/operatorUser/insertOperatorUser?{query}",
      "requestSchema": "schema.json",
      "responseSchema": "schema.json",
      "timeout": 0,
      "sendEmpty": false,
      "sendGetBody": false,
      "requestDatatype": "JSON",
      "responseDatatype": "JSON",
      "headers": {},
      "responseObjects": [
        {
          "type": "default",
          "key": "",
          "mockFile": "mockdatafiles/postOperatorUserinsertOperatorUser-default.json"
        }
      ]
    },
    {
      "name": "postOperatorUserupdateOperatorUser",
      "protocol": "REST",
      "method": "POST",
      "entitypath": "{base_path}/{version}/operatorUser/updateOperatorUser?{query}",
      "requestSchema": "schema.json",
      "responseSchema": "schema.json",
      "timeout": 0,
      "sendEmpty": false,
      "sendGetBody": false,
      "requestDatatype": "JSON",
      "responseDatatype": "JSON",
      "headers": {},
      "responseObjects": [
        {
          "type": "default",
          "key": "",
          "mockFile": "mockdatafiles/postOperatorUserupdateOperatorUser-default.json"
        }
      ]
    },
    {
      "name": "postRolecreateRoleCustomization",
      "protocol": "REST",
      "method": "POST",
      "entitypath": "{base_path}/{version}/role/createRoleCustomization?{query}",
      "requestSchema": "schema.json",
      "responseSchema": "schema.json",
      "timeout": 0,
      "sendEmpty": false,
      "sendGetBody": false,
      "requestDatatype": "JSON",
      "responseDatatype": "JSON",
      "headers": {},
      "responseObjects": [
        {
          "type": "default",
          "key": "",
          "mockFile": ""
        }
      ]
    },
    {
      "name": "postRoledeleteRoleCustomization",
      "protocol": "REST",
      "method": "POST",
      "entitypath": "{base_path}/{version}/role/deleteRoleCustomization?{query}",
      "requestSchema": "schema.json",
      "responseSchema": "schema.json",
      "timeout": 0,
      "sendEmpty": false,
      "sendGetBody": false,
      "requestDatatype": "JSON",
      "responseDatatype": "JSON",
      "headers": {},
      "responseObjects": [
        {
          "type": "default",
          "key": "",
          "mockFile": "mockdatafiles/postRoledeleteRoleCustomization-default.json"
        }
      ]
    },
    {
      "name": "postRolegetUserTypeRoles",
      "protocol": "REST",
      "method": "POST",
      "entitypath": "{base_path}/{version}/role/getUserTypeRoles?{query}",
      "requestSchema": "schema.json",
      "responseSchema": "schema.json",
      "timeout": 0,
      "sendEmpty": false,
      "sendGetBody": false,
      "requestDatatype": "JSON",
      "responseDatatype": "JSON",
      "headers": {},
      "responseObjects": [
        {
          "type": "default",
          "key": "",
          "mockFile": "mockdatafiles/postRolegetUserTypeRoles-default.json"
        }
      ]
    },
    {
      "name": "postVcoInventoryassociateEdge",
      "protocol": "REST",
      "method": "POST",
      "entitypath": "{base_path}/{version}/vcoInventory/associateEdge?{query}",
      "requestSchema": "schema.json",
      "responseSchema": "schema.json",
      "timeout": 0,
      "sendEmpty": false,
      "sendGetBody": false,
      "requestDatatype": "JSON",
      "responseDatatype": "JSON",
      "headers": {},
      "responseObjects": [
        {
          "type": "default",
          "key": "",
          "mockFile": "mockdatafiles/postVcoInventoryassociateEdge-default.json"
        }
      ]
    },
    {
      "name": "postVcoInventorygetInventoryItems",
      "protocol": "REST",
      "method": "POST",
      "entitypath": "{base_path}/{version}/vcoInventory/getInventoryItems?{query}",
      "requestSchema": "schema.json",
      "responseSchema": "schema.json",
      "timeout": 0,
      "sendEmpty": false,
      "sendGetBody": false,
      "requestDatatype": "JSON",
      "responseDatatype": "JSON",
      "headers": {},
      "responseObjects": [
        {
          "type": "default",
          "key": "",
          "mockFile": "mockdatafiles/postVcoInventorygetInventoryItems-default.json"
        }
      ]
    }
  ]
}