{
  "id": 8,
  "created": "string",
  "userType": "string",
  "username": "string",
  "domain": "string",
  "password": "string",
  "firstName": "string",
  "lastName": "string",
  "officePhone": "string",
  "mobilePhone": "string",
  "isNative": true,
  "isActive": false,
  "isLocked": true,
  "email": "string",
  "lastLogin": "string",
  "modified": "string",
  "roleId": 8,
  "roleName": "string",
  "enterpriseId": 5,
  "enterpriseProxyId": 3,
  "networkId": 5
}