[
  {
    "id": 10,
    "created": "string",
    "userType": "string",
    "username": "string",
    "domain": "string",
    "password": "string",
    "firstName": "string",
    "lastName": "string",
    "officePhone": "string",
    "mobilePhone": "string",
    "isNative": true,
    "isActive": true,
    "isLocked": true,
    "email": "string",
    "lastLogin": "string",
    "modified": "string",
    "roleId": 6,
    "roleName": "string",
    "enterpriseProxyId": 4,
    "networkId": 5
  },
  {
    "id": 6,
    "created": "string",
    "userType": "string",
    "username": "string",
    "domain": "string",
    "password": "string",
    "firstName": "string",
    "lastName": "string",
    "officePhone": "string",
    "mobilePhone": "string",
    "isNative": false,
    "isActive": true,
    "isLocked": false,
    "email": "string",
    "lastLogin": "string",
    "modified": "string",
    "roleId": 10,
    "roleName": "string",
    "enterpriseProxyId": 7,
    "networkId": 10
  },
  {
    "id": 2,
    "created": "string",
    "userType": "string",
    "username": "string",
    "domain": "string",
    "password": "string",
    "firstName": "string",
    "lastName": "string",
    "officePhone": "string",
    "mobilePhone": "string",
    "isNative": false,
    "isActive": true,
    "isLocked": false,
    "email": "string",
    "lastLogin": "string",
    "modified": "string",
    "roleId": 2,
    "roleName": "string",
    "enterpriseProxyId": 2,
    "networkId": 4
  },
  {
    "id": 4,
    "created": "string",
    "userType": "string",
    "username": "string",
    "domain": "string",
    "password": "string",
    "firstName": "string",
    "lastName": "string",
    "officePhone": "string",
    "mobilePhone": "string",
    "isNative": true,
    "isActive": true,
    "isLocked": true,
    "email": "string",
    "lastLogin": "string",
    "modified": "string",
    "roleId": 5,
    "roleName": "string",
    "enterpriseProxyId": 3,
    "networkId": 7
  }
]