[
  {
    "id": 4,
    "networkId": 10,
    "enterpriseProxyId": 5,
    "created": "string",
    "name": "string",
    "description": "string",
    "isDefault": false,
    "handOffType": "NONE",
    "modified": "string",
    "enterprises": [
      {
        "id": 6,
        "created": "string",
        "networkId": 3,
        "gatewayPoolId": 10,
        "alertsEnabled": true,
        "operatorAlertsEnabled": true,
        "endpointPkiMode": "CERTIFICATE_REQUIRED",
        "name": "string",
        "domain": "string",
        "prefix": "string",
        "logicalId": "string",
        "accountNumber": "string",
        "description": "string",
        "contactName": "string",
        "contactPhone": "string",
        "contactMobile": "string",
        "contactEmail": "string",
        "streetAddress": "string",
        "streetAddress2": "string",
        "city": "string",
        "state": "string",
        "postalCode": "string",
        "country": "string",
        "lat": 3,
        "lon": 10,
        "timezone": "string",
        "locale": "string",
        "modified": "string"
      },
      {
        "id": 6,
        "created": "string",
        "networkId": 3,
        "gatewayPoolId": 3,
        "alertsEnabled": false,
        "operatorAlertsEnabled": false,
        "endpointPkiMode": "CERTIFICATE_DISABLED",
        "name": "string",
        "domain": "string",
        "prefix": "string",
        "logicalId": "string",
        "accountNumber": "string",
        "description": "string",
        "contactName": "string",
        "contactPhone": "string",
        "contactMobile": "string",
        "contactEmail": "string",
        "streetAddress": "string",
        "streetAddress2": "string",
        "city": "string",
        "state": "string",
        "postalCode": "string",
        "country": "string",
        "lat": 6,
        "lon": 7,
        "timezone": "string",
        "locale": "string",
        "modified": "string"
      },
      {
        "id": 9,
        "created": "string",
        "networkId": 6,
        "gatewayPoolId": 1,
        "alertsEnabled": false,
        "operatorAlertsEnabled": true,
        "endpointPkiMode": "CERTIFICATE_DISABLED",
        "name": "string",
        "domain": "string",
        "prefix": "string",
        "logicalId": "string",
        "accountNumber": "string",
        "description": "string",
        "contactName": "string",
        "contactPhone": "string",
        "contactMobile": "string",
        "contactEmail": "string",
        "streetAddress": "string",
        "streetAddress2": "string",
        "city": "string",
        "state": "string",
        "postalCode": "string",
        "country": "string",
        "lat": 9,
        "lon": 10,
        "timezone": "string",
        "locale": "string",
        "modified": "string"
      },
      {
        "id": 1,
        "created": "string",
        "networkId": 4,
        "gatewayPoolId": 6,
        "alertsEnabled": false,
        "operatorAlertsEnabled": true,
        "endpointPkiMode": "CERTIFICATE_OPTIONAL",
        "name": "string",
        "domain": "string",
        "prefix": "string",
        "logicalId": "string",
        "accountNumber": "string",
        "description": "string",
        "contactName": "string",
        "contactPhone": "string",
        "contactMobile": "string",
        "contactEmail": "string",
        "streetAddress": "string",
        "streetAddress2": "string",
        "city": "string",
        "state": "string",
        "postalCode": "string",
        "country": "string",
        "lat": 8,
        "lon": 4,
        "timezone": "string",
        "locale": "string",
        "modified": "string"
      },
      {
        "id": 3,
        "created": "string",
        "networkId": 7,
        "gatewayPoolId": 4,
        "alertsEnabled": false,
        "operatorAlertsEnabled": false,
        "endpointPkiMode": "CERTIFICATE_DISABLED",
        "name": "string",
        "domain": "string",
        "prefix": "string",
        "logicalId": "string",
        "accountNumber": "string",
        "description": "string",
        "contactName": "string",
        "contactPhone": "string",
        "contactMobile": "string",
        "contactEmail": "string",
        "streetAddress": "string",
        "streetAddress2": "string",
        "city": "string",
        "state": "string",
        "postalCode": "string",
        "country": "string",
        "lat": 7,
        "lon": 5,
        "timezone": "string",
        "locale": "string",
        "modified": "string"
      },
      {
        "id": 2,
        "created": "string",
        "networkId": 5,
        "gatewayPoolId": 6,
        "alertsEnabled": true,
        "operatorAlertsEnabled": true,
        "endpointPkiMode": "CERTIFICATE_DISABLED",
        "name": "string",
        "domain": "string",
        "prefix": "string",
        "logicalId": "string",
        "accountNumber": "string",
        "description": "string",
        "contactName": "string",
        "contactPhone": "string",
        "contactMobile": "string",
        "contactEmail": "string",
        "streetAddress": "string",
        "streetAddress2": "string",
        "city": "string",
        "state": "string",
        "postalCode": "string",
        "country": "string",
        "lat": 7,
        "lon": 9,
        "timezone": "string",
        "locale": "string",
        "modified": "string"
      }
    ],
    "gateways": [
      {
        "gatewayPoolAssocId": 3,
        "poolName": "string",
        "id": 1,
        "created": "string",
        "networkId": 3,
        "enterpriseProxyId": 9,
        "siteId": 7,
        "activationKey": "string",
        "activationState": "string",
        "activationTime": "string",
        "softwareVersion": "string",
        "buildNumber": "string",
        "utilization": 6,
        "utilizationDetail": {
          "load": 3,
          "overall": 9,
          "cpu": 8,
          "memory": 1
        },
        "connectedEdges": 6,
        "connectedEdgeList": [
          {
            "vceid": "string"
          },
          {
            "vceid": "string"
          }
        ],
        "deviceId": "string",
        "logicalId": "string",
        "name": "string",
        "gatewayState": "string",
        "alertsEnabled": 7,
        "description": "string",
        "dnsName": "string",
        "isLoadBalanced": 8,
        "privateIpAddress": "string",
        "ipAddress": "string",
        "lastContact": "string",
        "systemUpSince": "string",
        "serviceUpSince": "string",
        "serviceState": "string",
        "endpointPkiMode": "string",
        "handOffDetail": {
          "type": "string",
          "subnets": [
            {
              "name": "string",
              "routeCost": 5,
              "cidrIp": "string",
              "cidrPrefix": 5,
              "encrypt": true,
              "handOffType": "VLAN"
            },
            {
              "name": "string",
              "routeCost": 1,
              "cidrIp": "string",
              "cidrPrefix": 3,
              "encrypt": false,
              "handOffType": "NAT"
            }
          ],
          "icmpProbe": {
            "enabled": false,
            "probeType": "string",
            "cTag": 8,
            "sTag": 2,
            "destinationIp": "string",
            "frequencySeconds": 7,
            "threshold": 2
          },
          "icmpResponder": {
            "enabled": false,
            "ipAddress": "string",
            "mode": "string"
          }
        },
        "ipsecGatewayDetail": {
          "strictHostCheck": false,
          "strictHostCheckDN": "string"
        },
        "modified": "string"
      },
      {
        "gatewayPoolAssocId": 3,
        "poolName": "string",
        "id": 6,
        "created": "string",
        "networkId": 7,
        "enterpriseProxyId": 1,
        "siteId": 8,
        "activationKey": "string",
        "activationState": "string",
        "activationTime": "string",
        "softwareVersion": "string",
        "buildNumber": "string",
        "utilization": 10,
        "utilizationDetail": {
          "load": 10,
          "overall": 9,
          "cpu": 6,
          "memory": 8
        },
        "connectedEdges": 8,
        "connectedEdgeList": [
          {
            "vceid": "string"
          }
        ],
        "deviceId": "string",
        "logicalId": "string",
        "name": "string",
        "gatewayState": "string",
        "alertsEnabled": 2,
        "description": "string",
        "dnsName": "string",
        "isLoadBalanced": 7,
        "privateIpAddress": "string",
        "ipAddress": "string",
        "lastContact": "string",
        "systemUpSince": "string",
        "serviceUpSince": "string",
        "serviceState": "string",
        "endpointPkiMode": "string",
        "handOffDetail": {
          "type": "string",
          "subnets": [
            {
              "name": "string",
              "routeCost": 8,
              "cidrIp": "string",
              "cidrPrefix": 2,
              "encrypt": true,
              "handOffType": "NAT"
            },
            {
              "name": "string",
              "routeCost": 7,
              "cidrIp": "string",
              "cidrPrefix": 1,
              "encrypt": false,
              "handOffType": "VLAN"
            },
            {
              "name": "string",
              "routeCost": 5,
              "cidrIp": "string",
              "cidrPrefix": 8,
              "encrypt": false,
              "handOffType": "VLAN"
            }
          ],
          "icmpProbe": {
            "enabled": true,
            "probeType": "string",
            "cTag": 4,
            "sTag": 5,
            "destinationIp": "string",
            "frequencySeconds": 2,
            "threshold": 9
          },
          "icmpResponder": {
            "enabled": true,
            "ipAddress": "string",
            "mode": "string"
          }
        },
        "ipsecGatewayDetail": {
          "strictHostCheck": false,
          "strictHostCheckDN": "string"
        },
        "modified": "string"
      },
      {
        "gatewayPoolAssocId": 8,
        "poolName": "string",
        "id": 2,
        "created": "string",
        "networkId": 8,
        "enterpriseProxyId": 5,
        "siteId": 5,
        "activationKey": "string",
        "activationState": "string",
        "activationTime": "string",
        "softwareVersion": "string",
        "buildNumber": "string",
        "utilization": 5,
        "utilizationDetail": {
          "load": 4,
          "overall": 7,
          "cpu": 6,
          "memory": 10
        },
        "connectedEdges": 9,
        "connectedEdgeList": [
          {
            "vceid": "string"
          },
          {
            "vceid": "string"
          },
          {
            "vceid": "string"
          }
        ],
        "deviceId": "string",
        "logicalId": "string",
        "name": "string",
        "gatewayState": "string",
        "alertsEnabled": 3,
        "description": "string",
        "dnsName": "string",
        "isLoadBalanced": 10,
        "privateIpAddress": "string",
        "ipAddress": "string",
        "lastContact": "string",
        "systemUpSince": "string",
        "serviceUpSince": "string",
        "serviceState": "string",
        "endpointPkiMode": "string",
        "handOffDetail": {
          "type": "string",
          "subnets": [
            {
              "name": "string",
              "routeCost": 9,
              "cidrIp": "string",
              "cidrPrefix": 9,
              "encrypt": true,
              "handOffType": "VLAN"
            },
            {
              "name": "string",
              "routeCost": 5,
              "cidrIp": "string",
              "cidrPrefix": 5,
              "encrypt": false,
              "handOffType": "VLAN"
            },
            {
              "name": "string",
              "routeCost": 10,
              "cidrIp": "string",
              "cidrPrefix": 1,
              "encrypt": false,
              "handOffType": "NAT"
            },
            {
              "name": "string",
              "routeCost": 8,
              "cidrIp": "string",
              "cidrPrefix": 4,
              "encrypt": false,
              "handOffType": "NAT"
            }
          ],
          "icmpProbe": {
            "enabled": false,
            "probeType": "string",
            "cTag": 1,
            "sTag": 2,
            "destinationIp": "string",
            "frequencySeconds": 10,
            "threshold": 3
          },
          "icmpResponder": {
            "enabled": true,
            "ipAddress": "string",
            "mode": "string"
          }
        },
        "ipsecGatewayDetail": {
          "strictHostCheck": false,
          "strictHostCheckDN": "string"
        },
        "modified": "string"
      },
      {
        "gatewayPoolAssocId": 1,
        "poolName": "string",
        "id": 10,
        "created": "string",
        "networkId": 5,
        "enterpriseProxyId": 4,
        "siteId": 2,
        "activationKey": "string",
        "activationState": "string",
        "activationTime": "string",
        "softwareVersion": "string",
        "buildNumber": "string",
        "utilization": 4,
        "utilizationDetail": {
          "load": 4,
          "overall": 3,
          "cpu": 10,
          "memory": 7
        },
        "connectedEdges": 8,
        "connectedEdgeList": [
          {
            "vceid": "string"
          }
        ],
        "deviceId": "string",
        "logicalId": "string",
        "name": "string",
        "gatewayState": "string",
        "alertsEnabled": 3,
        "description": "string",
        "dnsName": "string",
        "isLoadBalanced": 5,
        "privateIpAddress": "string",
        "ipAddress": "string",
        "lastContact": "string",
        "systemUpSince": "string",
        "serviceUpSince": "string",
        "serviceState": "string",
        "endpointPkiMode": "string",
        "handOffDetail": {
          "type": "string",
          "subnets": [
            {
              "name": "string",
              "routeCost": 9,
              "cidrIp": "string",
              "cidrPrefix": 5,
              "encrypt": false,
              "handOffType": "NAT"
            },
            {
              "name": "string",
              "routeCost": 4,
              "cidrIp": "string",
              "cidrPrefix": 3,
              "encrypt": false,
              "handOffType": "NAT"
            },
            {
              "name": "string",
              "routeCost": 8,
              "cidrIp": "string",
              "cidrPrefix": 7,
              "encrypt": false,
              "handOffType": "NAT"
            },
            {
              "name": "string",
              "routeCost": 4,
              "cidrIp": "string",
              "cidrPrefix": 2,
              "encrypt": false,
              "handOffType": "VLAN"
            },
            {
              "name": "string",
              "routeCost": 8,
              "cidrIp": "string",
              "cidrPrefix": 1,
              "encrypt": true,
              "handOffType": "VLAN"
            },
            {
              "name": "string",
              "routeCost": 1,
              "cidrIp": "string",
              "cidrPrefix": 3,
              "encrypt": true,
              "handOffType": "NAT"
            },
            {
              "name": "string",
              "routeCost": 9,
              "cidrIp": "string",
              "cidrPrefix": 2,
              "encrypt": false,
              "handOffType": "VLAN"
            },
            {
              "name": "string",
              "routeCost": 3,
              "cidrIp": "string",
              "cidrPrefix": 5,
              "encrypt": false,
              "handOffType": "NAT"
            },
            {
              "name": "string",
              "routeCost": 2,
              "cidrIp": "string",
              "cidrPrefix": 3,
              "encrypt": false,
              "handOffType": "VLAN"
            },
            {
              "name": "string",
              "routeCost": 6,
              "cidrIp": "string",
              "cidrPrefix": 8,
              "encrypt": true,
              "handOffType": "NAT"
            }
          ],
          "icmpProbe": {
            "enabled": false,
            "probeType": "string",
            "cTag": 2,
            "sTag": 10,
            "destinationIp": "string",
            "frequencySeconds": 2,
            "threshold": 2
          },
          "icmpResponder": {
            "enabled": false,
            "ipAddress": "string",
            "mode": "string"
          }
        },
        "ipsecGatewayDetail": {
          "strictHostCheck": false,
          "strictHostCheckDN": "string"
        },
        "modified": "string"
      },
      {
        "gatewayPoolAssocId": 9,
        "poolName": "string",
        "id": 8,
        "created": "string",
        "networkId": 5,
        "enterpriseProxyId": 2,
        "siteId": 9,
        "activationKey": "string",
        "activationState": "string",
        "activationTime": "string",
        "softwareVersion": "string",
        "buildNumber": "string",
        "utilization": 8,
        "utilizationDetail": {
          "load": 2,
          "overall": 8,
          "cpu": 7,
          "memory": 4
        },
        "connectedEdges": 6,
        "connectedEdgeList": [
          {
            "vceid": "string"
          },
          {
            "vceid": "string"
          },
          {
            "vceid": "string"
          }
        ],
        "deviceId": "string",
        "logicalId": "string",
        "name": "string",
        "gatewayState": "string",
        "alertsEnabled": 4,
        "description": "string",
        "dnsName": "string",
        "isLoadBalanced": 5,
        "privateIpAddress": "string",
        "ipAddress": "string",
        "lastContact": "string",
        "systemUpSince": "string",
        "serviceUpSince": "string",
        "serviceState": "string",
        "endpointPkiMode": "string",
        "handOffDetail": {
          "type": "string",
          "subnets": [
            {
              "name": "string",
              "routeCost": 7,
              "cidrIp": "string",
              "cidrPrefix": 2,
              "encrypt": true,
              "handOffType": "NAT"
            },
            {
              "name": "string",
              "routeCost": 1,
              "cidrIp": "string",
              "cidrPrefix": 6,
              "encrypt": true,
              "handOffType": "VLAN"
            },
            {
              "name": "string",
              "routeCost": 6,
              "cidrIp": "string",
              "cidrPrefix": 5,
              "encrypt": true,
              "handOffType": "NAT"
            },
            {
              "name": "string",
              "routeCost": 9,
              "cidrIp": "string",
              "cidrPrefix": 2,
              "encrypt": true,
              "handOffType": "NAT"
            },
            {
              "name": "string",
              "routeCost": 1,
              "cidrIp": "string",
              "cidrPrefix": 9,
              "encrypt": true,
              "handOffType": "VLAN"
            }
          ],
          "icmpProbe": {
            "enabled": false,
            "probeType": "string",
            "cTag": 6,
            "sTag": 7,
            "destinationIp": "string",
            "frequencySeconds": 2,
            "threshold": 7
          },
          "icmpResponder": {
            "enabled": true,
            "ipAddress": "string",
            "mode": "string"
          }
        },
        "ipsecGatewayDetail": {
          "strictHostCheck": true,
          "strictHostCheckDN": "string"
        },
        "modified": "string"
      }
    ]
  },
  {
    "id": 4,
    "networkId": 5,
    "enterpriseProxyId": 9,
    "created": "string",
    "name": "string",
    "description": "string",
    "isDefault": false,
    "handOffType": "ALLOW",
    "modified": "string",
    "enterprises": [
      {
        "id": 1,
        "created": "string",
        "networkId": 3,
        "gatewayPoolId": 2,
        "alertsEnabled": false,
        "operatorAlertsEnabled": true,
        "endpointPkiMode": "CERTIFICATE_REQUIRED",
        "name": "string",
        "domain": "string",
        "prefix": "string",
        "logicalId": "string",
        "accountNumber": "string",
        "description": "string",
        "contactName": "string",
        "contactPhone": "string",
        "contactMobile": "string",
        "contactEmail": "string",
        "streetAddress": "string",
        "streetAddress2": "string",
        "city": "string",
        "state": "string",
        "postalCode": "string",
        "country": "string",
        "lat": 6,
        "lon": 10,
        "timezone": "string",
        "locale": "string",
        "modified": "string"
      },
      {
        "id": 5,
        "created": "string",
        "networkId": 2,
        "gatewayPoolId": 9,
        "alertsEnabled": false,
        "operatorAlertsEnabled": true,
        "endpointPkiMode": "CERTIFICATE_DISABLED",
        "name": "string",
        "domain": "string",
        "prefix": "string",
        "logicalId": "string",
        "accountNumber": "string",
        "description": "string",
        "contactName": "string",
        "contactPhone": "string",
        "contactMobile": "string",
        "contactEmail": "string",
        "streetAddress": "string",
        "streetAddress2": "string",
        "city": "string",
        "state": "string",
        "postalCode": "string",
        "country": "string",
        "lat": 7,
        "lon": 5,
        "timezone": "string",
        "locale": "string",
        "modified": "string"
      },
      {
        "id": 9,
        "created": "string",
        "networkId": 10,
        "gatewayPoolId": 4,
        "alertsEnabled": true,
        "operatorAlertsEnabled": true,
        "endpointPkiMode": "CERTIFICATE_DISABLED",
        "name": "string",
        "domain": "string",
        "prefix": "string",
        "logicalId": "string",
        "accountNumber": "string",
        "description": "string",
        "contactName": "string",
        "contactPhone": "string",
        "contactMobile": "string",
        "contactEmail": "string",
        "streetAddress": "string",
        "streetAddress2": "string",
        "city": "string",
        "state": "string",
        "postalCode": "string",
        "country": "string",
        "lat": 10,
        "lon": 6,
        "timezone": "string",
        "locale": "string",
        "modified": "string"
      },
      {
        "id": 9,
        "created": "string",
        "networkId": 5,
        "gatewayPoolId": 9,
        "alertsEnabled": false,
        "operatorAlertsEnabled": true,
        "endpointPkiMode": "CERTIFICATE_DISABLED",
        "name": "string",
        "domain": "string",
        "prefix": "string",
        "logicalId": "string",
        "accountNumber": "string",
        "description": "string",
        "contactName": "string",
        "contactPhone": "string",
        "contactMobile": "string",
        "contactEmail": "string",
        "streetAddress": "string",
        "streetAddress2": "string",
        "city": "string",
        "state": "string",
        "postalCode": "string",
        "country": "string",
        "lat": 9,
        "lon": 3,
        "timezone": "string",
        "locale": "string",
        "modified": "string"
      }
    ],
    "gateways": [
      {
        "gatewayPoolAssocId": 3,
        "poolName": "string",
        "id": 9,
        "created": "string",
        "networkId": 4,
        "enterpriseProxyId": 6,
        "siteId": 7,
        "activationKey": "string",
        "activationState": "string",
        "activationTime": "string",
        "softwareVersion": "string",
        "buildNumber": "string",
        "utilization": 6,
        "utilizationDetail": {
          "load": 7,
          "overall": 5,
          "cpu": 6,
          "memory": 4
        },
        "connectedEdges": 1,
        "connectedEdgeList": [
          {
            "vceid": "string"
          },
          {
            "vceid": "string"
          },
          {
            "vceid": "string"
          },
          {
            "vceid": "string"
          },
          {
            "vceid": "string"
          },
          {
            "vceid": "string"
          },
          {
            "vceid": "string"
          },
          {
            "vceid": "string"
          },
          {
            "vceid": "string"
          }
        ],
        "deviceId": "string",
        "logicalId": "string",
        "name": "string",
        "gatewayState": "string",
        "alertsEnabled": 1,
        "description": "string",
        "dnsName": "string",
        "isLoadBalanced": 10,
        "privateIpAddress": "string",
        "ipAddress": "string",
        "lastContact": "string",
        "systemUpSince": "string",
        "serviceUpSince": "string",
        "serviceState": "string",
        "endpointPkiMode": "string",
        "handOffDetail": {
          "type": "string",
          "subnets": [
            {
              "name": "string",
              "routeCost": 7,
              "cidrIp": "string",
              "cidrPrefix": 4,
              "encrypt": true,
              "handOffType": "NAT"
            },
            {
              "name": "string",
              "routeCost": 8,
              "cidrIp": "string",
              "cidrPrefix": 5,
              "encrypt": true,
              "handOffType": "NAT"
            },
            {
              "name": "string",
              "routeCost": 6,
              "cidrIp": "string",
              "cidrPrefix": 3,
              "encrypt": true,
              "handOffType": "VLAN"
            },
            {
              "name": "string",
              "routeCost": 6,
              "cidrIp": "string",
              "cidrPrefix": 10,
              "encrypt": true,
              "handOffType": "NAT"
            },
            {
              "name": "string",
              "routeCost": 3,
              "cidrIp": "string",
              "cidrPrefix": 4,
              "encrypt": false,
              "handOffType": "VLAN"
            }
          ],
          "icmpProbe": {
            "enabled": true,
            "probeType": "string",
            "cTag": 2,
            "sTag": 4,
            "destinationIp": "string",
            "frequencySeconds": 5,
            "threshold": 1
          },
          "icmpResponder": {
            "enabled": true,
            "ipAddress": "string",
            "mode": "string"
          }
        },
        "ipsecGatewayDetail": {
          "strictHostCheck": true,
          "strictHostCheckDN": "string"
        },
        "modified": "string"
      },
      {
        "gatewayPoolAssocId": 4,
        "poolName": "string",
        "id": 5,
        "created": "string",
        "networkId": 3,
        "enterpriseProxyId": 5,
        "siteId": 6,
        "activationKey": "string",
        "activationState": "string",
        "activationTime": "string",
        "softwareVersion": "string",
        "buildNumber": "string",
        "utilization": 2,
        "utilizationDetail": {
          "load": 1,
          "overall": 7,
          "cpu": 5,
          "memory": 8
        },
        "connectedEdges": 1,
        "connectedEdgeList": [
          {
            "vceid": "string"
          },
          {
            "vceid": "string"
          },
          {
            "vceid": "string"
          },
          {
            "vceid": "string"
          },
          {
            "vceid": "string"
          },
          {
            "vceid": "string"
          },
          {
            "vceid": "string"
          },
          {
            "vceid": "string"
          },
          {
            "vceid": "string"
          }
        ],
        "deviceId": "string",
        "logicalId": "string",
        "name": "string",
        "gatewayState": "string",
        "alertsEnabled": 4,
        "description": "string",
        "dnsName": "string",
        "isLoadBalanced": 4,
        "privateIpAddress": "string",
        "ipAddress": "string",
        "lastContact": "string",
        "systemUpSince": "string",
        "serviceUpSince": "string",
        "serviceState": "string",
        "endpointPkiMode": "string",
        "handOffDetail": {
          "type": "string",
          "subnets": [
            {
              "name": "string",
              "routeCost": 6,
              "cidrIp": "string",
              "cidrPrefix": 3,
              "encrypt": false,
              "handOffType": "NAT"
            },
            {
              "name": "string",
              "routeCost": 7,
              "cidrIp": "string",
              "cidrPrefix": 10,
              "encrypt": false,
              "handOffType": "VLAN"
            },
            {
              "name": "string",
              "routeCost": 6,
              "cidrIp": "string",
              "cidrPrefix": 7,
              "encrypt": true,
              "handOffType": "NAT"
            },
            {
              "name": "string",
              "routeCost": 1,
              "cidrIp": "string",
              "cidrPrefix": 2,
              "encrypt": false,
              "handOffType": "NAT"
            },
            {
              "name": "string",
              "routeCost": 7,
              "cidrIp": "string",
              "cidrPrefix": 2,
              "encrypt": true,
              "handOffType": "NAT"
            },
            {
              "name": "string",
              "routeCost": 10,
              "cidrIp": "string",
              "cidrPrefix": 8,
              "encrypt": false,
              "handOffType": "NAT"
            },
            {
              "name": "string",
              "routeCost": 2,
              "cidrIp": "string",
              "cidrPrefix": 5,
              "encrypt": true,
              "handOffType": "VLAN"
            },
            {
              "name": "string",
              "routeCost": 4,
              "cidrIp": "string",
              "cidrPrefix": 9,
              "encrypt": false,
              "handOffType": "NAT"
            }
          ],
          "icmpProbe": {
            "enabled": true,
            "probeType": "string",
            "cTag": 10,
            "sTag": 3,
            "destinationIp": "string",
            "frequencySeconds": 6,
            "threshold": 1
          },
          "icmpResponder": {
            "enabled": false,
            "ipAddress": "string",
            "mode": "string"
          }
        },
        "ipsecGatewayDetail": {
          "strictHostCheck": false,
          "strictHostCheckDN": "string"
        },
        "modified": "string"
      },
      {
        "gatewayPoolAssocId": 8,
        "poolName": "string",
        "id": 3,
        "created": "string",
        "networkId": 9,
        "enterpriseProxyId": 8,
        "siteId": 9,
        "activationKey": "string",
        "activationState": "string",
        "activationTime": "string",
        "softwareVersion": "string",
        "buildNumber": "string",
        "utilization": 3,
        "utilizationDetail": {
          "load": 5,
          "overall": 9,
          "cpu": 5,
          "memory": 9
        },
        "connectedEdges": 5,
        "connectedEdgeList": [
          {
            "vceid": "string"
          },
          {
            "vceid": "string"
          },
          {
            "vceid": "string"
          },
          {
            "vceid": "string"
          },
          {
            "vceid": "string"
          },
          {
            "vceid": "string"
          }
        ],
        "deviceId": "string",
        "logicalId": "string",
        "name": "string",
        "gatewayState": "string",
        "alertsEnabled": 10,
        "description": "string",
        "dnsName": "string",
        "isLoadBalanced": 10,
        "privateIpAddress": "string",
        "ipAddress": "string",
        "lastContact": "string",
        "systemUpSince": "string",
        "serviceUpSince": "string",
        "serviceState": "string",
        "endpointPkiMode": "string",
        "handOffDetail": {
          "type": "string",
          "subnets": [
            {
              "name": "string",
              "routeCost": 1,
              "cidrIp": "string",
              "cidrPrefix": 4,
              "encrypt": true,
              "handOffType": "VLAN"
            },
            {
              "name": "string",
              "routeCost": 4,
              "cidrIp": "string",
              "cidrPrefix": 4,
              "encrypt": false,
              "handOffType": "NAT"
            },
            {
              "name": "string",
              "routeCost": 5,
              "cidrIp": "string",
              "cidrPrefix": 1,
              "encrypt": true,
              "handOffType": "NAT"
            },
            {
              "name": "string",
              "routeCost": 10,
              "cidrIp": "string",
              "cidrPrefix": 10,
              "encrypt": true,
              "handOffType": "NAT"
            }
          ],
          "icmpProbe": {
            "enabled": false,
            "probeType": "string",
            "cTag": 5,
            "sTag": 10,
            "destinationIp": "string",
            "frequencySeconds": 3,
            "threshold": 5
          },
          "icmpResponder": {
            "enabled": true,
            "ipAddress": "string",
            "mode": "string"
          }
        },
        "ipsecGatewayDetail": {
          "strictHostCheck": true,
          "strictHostCheckDN": "string"
        },
        "modified": "string"
      },
      {
        "gatewayPoolAssocId": 7,
        "poolName": "string",
        "id": 9,
        "created": "string",
        "networkId": 10,
        "enterpriseProxyId": 2,
        "siteId": 10,
        "activationKey": "string",
        "activationState": "string",
        "activationTime": "string",
        "softwareVersion": "string",
        "buildNumber": "string",
        "utilization": 10,
        "utilizationDetail": {
          "load": 8,
          "overall": 7,
          "cpu": 6,
          "memory": 2
        },
        "connectedEdges": 6,
        "connectedEdgeList": [
          {
            "vceid": "string"
          },
          {
            "vceid": "string"
          }
        ],
        "deviceId": "string",
        "logicalId": "string",
        "name": "string",
        "gatewayState": "string",
        "alertsEnabled": 7,
        "description": "string",
        "dnsName": "string",
        "isLoadBalanced": 9,
        "privateIpAddress": "string",
        "ipAddress": "string",
        "lastContact": "string",
        "systemUpSince": "string",
        "serviceUpSince": "string",
        "serviceState": "string",
        "endpointPkiMode": "string",
        "handOffDetail": {
          "type": "string",
          "subnets": [
            {
              "name": "string",
              "routeCost": 1,
              "cidrIp": "string",
              "cidrPrefix": 8,
              "encrypt": false,
              "handOffType": "NAT"
            },
            {
              "name": "string",
              "routeCost": 6,
              "cidrIp": "string",
              "cidrPrefix": 8,
              "encrypt": false,
              "handOffType": "VLAN"
            },
            {
              "name": "string",
              "routeCost": 10,
              "cidrIp": "string",
              "cidrPrefix": 4,
              "encrypt": true,
              "handOffType": "NAT"
            },
            {
              "name": "string",
              "routeCost": 7,
              "cidrIp": "string",
              "cidrPrefix": 8,
              "encrypt": true,
              "handOffType": "NAT"
            },
            {
              "name": "string",
              "routeCost": 8,
              "cidrIp": "string",
              "cidrPrefix": 4,
              "encrypt": true,
              "handOffType": "NAT"
            },
            {
              "name": "string",
              "routeCost": 7,
              "cidrIp": "string",
              "cidrPrefix": 9,
              "encrypt": false,
              "handOffType": "NAT"
            },
            {
              "name": "string",
              "routeCost": 2,
              "cidrIp": "string",
              "cidrPrefix": 1,
              "encrypt": true,
              "handOffType": "VLAN"
            },
            {
              "name": "string",
              "routeCost": 2,
              "cidrIp": "string",
              "cidrPrefix": 7,
              "encrypt": true,
              "handOffType": "VLAN"
            }
          ],
          "icmpProbe": {
            "enabled": true,
            "probeType": "string",
            "cTag": 10,
            "sTag": 1,
            "destinationIp": "string",
            "frequencySeconds": 6,
            "threshold": 7
          },
          "icmpResponder": {
            "enabled": true,
            "ipAddress": "string",
            "mode": "string"
          }
        },
        "ipsecGatewayDetail": {
          "strictHostCheck": false,
          "strictHostCheckDN": "string"
        },
        "modified": "string"
      },
      {
        "gatewayPoolAssocId": 7,
        "poolName": "string",
        "id": 3,
        "created": "string",
        "networkId": 8,
        "enterpriseProxyId": 10,
        "siteId": 6,
        "activationKey": "string",
        "activationState": "string",
        "activationTime": "string",
        "softwareVersion": "string",
        "buildNumber": "string",
        "utilization": 7,
        "utilizationDetail": {
          "load": 1,
          "overall": 7,
          "cpu": 3,
          "memory": 7
        },
        "connectedEdges": 6,
        "connectedEdgeList": [
          {
            "vceid": "string"
          },
          {
            "vceid": "string"
          },
          {
            "vceid": "string"
          },
          {
            "vceid": "string"
          },
          {
            "vceid": "string"
          },
          {
            "vceid": "string"
          },
          {
            "vceid": "string"
          },
          {
            "vceid": "string"
          },
          {
            "vceid": "string"
          }
        ],
        "deviceId": "string",
        "logicalId": "string",
        "name": "string",
        "gatewayState": "string",
        "alertsEnabled": 4,
        "description": "string",
        "dnsName": "string",
        "isLoadBalanced": 2,
        "privateIpAddress": "string",
        "ipAddress": "string",
        "lastContact": "string",
        "systemUpSince": "string",
        "serviceUpSince": "string",
        "serviceState": "string",
        "endpointPkiMode": "string",
        "handOffDetail": {
          "type": "string",
          "subnets": [
            {
              "name": "string",
              "routeCost": 4,
              "cidrIp": "string",
              "cidrPrefix": 5,
              "encrypt": true,
              "handOffType": "NAT"
            },
            {
              "name": "string",
              "routeCost": 2,
              "cidrIp": "string",
              "cidrPrefix": 8,
              "encrypt": true,
              "handOffType": "NAT"
            }
          ],
          "icmpProbe": {
            "enabled": true,
            "probeType": "string",
            "cTag": 8,
            "sTag": 8,
            "destinationIp": "string",
            "frequencySeconds": 1,
            "threshold": 6
          },
          "icmpResponder": {
            "enabled": true,
            "ipAddress": "string",
            "mode": "string"
          }
        },
        "ipsecGatewayDetail": {
          "strictHostCheck": true,
          "strictHostCheckDN": "string"
        },
        "modified": "string"
      },
      {
        "gatewayPoolAssocId": 1,
        "poolName": "string",
        "id": 5,
        "created": "string",
        "networkId": 10,
        "enterpriseProxyId": 8,
        "siteId": 8,
        "activationKey": "string",
        "activationState": "string",
        "activationTime": "string",
        "softwareVersion": "string",
        "buildNumber": "string",
        "utilization": 4,
        "utilizationDetail": {
          "load": 2,
          "overall": 3,
          "cpu": 1,
          "memory": 4
        },
        "connectedEdges": 9,
        "connectedEdgeList": [
          {
            "vceid": "string"
          },
          {
            "vceid": "string"
          },
          {
            "vceid": "string"
          },
          {
            "vceid": "string"
          },
          {
            "vceid": "string"
          },
          {
            "vceid": "string"
          },
          {
            "vceid": "string"
          },
          {
            "vceid": "string"
          },
          {
            "vceid": "string"
          },
          {
            "vceid": "string"
          }
        ],
        "deviceId": "string",
        "logicalId": "string",
        "name": "string",
        "gatewayState": "string",
        "alertsEnabled": 6,
        "description": "string",
        "dnsName": "string",
        "isLoadBalanced": 2,
        "privateIpAddress": "string",
        "ipAddress": "string",
        "lastContact": "string",
        "systemUpSince": "string",
        "serviceUpSince": "string",
        "serviceState": "string",
        "endpointPkiMode": "string",
        "handOffDetail": {
          "type": "string",
          "subnets": [
            {
              "name": "string",
              "routeCost": 6,
              "cidrIp": "string",
              "cidrPrefix": 6,
              "encrypt": true,
              "handOffType": "VLAN"
            },
            {
              "name": "string",
              "routeCost": 4,
              "cidrIp": "string",
              "cidrPrefix": 2,
              "encrypt": false,
              "handOffType": "VLAN"
            },
            {
              "name": "string",
              "routeCost": 8,
              "cidrIp": "string",
              "cidrPrefix": 9,
              "encrypt": false,
              "handOffType": "NAT"
            },
            {
              "name": "string",
              "routeCost": 7,
              "cidrIp": "string",
              "cidrPrefix": 6,
              "encrypt": false,
              "handOffType": "VLAN"
            },
            {
              "name": "string",
              "routeCost": 8,
              "cidrIp": "string",
              "cidrPrefix": 8,
              "encrypt": false,
              "handOffType": "NAT"
            },
            {
              "name": "string",
              "routeCost": 1,
              "cidrIp": "string",
              "cidrPrefix": 1,
              "encrypt": true,
              "handOffType": "VLAN"
            },
            {
              "name": "string",
              "routeCost": 9,
              "cidrIp": "string",
              "cidrPrefix": 9,
              "encrypt": false,
              "handOffType": "VLAN"
            },
            {
              "name": "string",
              "routeCost": 2,
              "cidrIp": "string",
              "cidrPrefix": 3,
              "encrypt": false,
              "handOffType": "NAT"
            },
            {
              "name": "string",
              "routeCost": 1,
              "cidrIp": "string",
              "cidrPrefix": 6,
              "encrypt": false,
              "handOffType": "NAT"
            }
          ],
          "icmpProbe": {
            "enabled": false,
            "probeType": "string",
            "cTag": 8,
            "sTag": 10,
            "destinationIp": "string",
            "frequencySeconds": 4,
            "threshold": 9
          },
          "icmpResponder": {
            "enabled": true,
            "ipAddress": "string",
            "mode": "string"
          }
        },
        "ipsecGatewayDetail": {
          "strictHostCheck": false,
          "strictHostCheckDN": "string"
        },
        "modified": "string"
      },
      {
        "gatewayPoolAssocId": 6,
        "poolName": "string",
        "id": 4,
        "created": "string",
        "networkId": 8,
        "enterpriseProxyId": 3,
        "siteId": 1,
        "activationKey": "string",
        "activationState": "string",
        "activationTime": "string",
        "softwareVersion": "string",
        "buildNumber": "string",
        "utilization": 7,
        "utilizationDetail": {
          "load": 3,
          "overall": 9,
          "cpu": 7,
          "memory": 4
        },
        "connectedEdges": 9,
        "connectedEdgeList": [
          {
            "vceid": "string"
          }
        ],
        "deviceId": "string",
        "logicalId": "string",
        "name": "string",
        "gatewayState": "string",
        "alertsEnabled": 7,
        "description": "string",
        "dnsName": "string",
        "isLoadBalanced": 3,
        "privateIpAddress": "string",
        "ipAddress": "string",
        "lastContact": "string",
        "systemUpSince": "string",
        "serviceUpSince": "string",
        "serviceState": "string",
        "endpointPkiMode": "string",
        "handOffDetail": {
          "type": "string",
          "subnets": [
            {
              "name": "string",
              "routeCost": 4,
              "cidrIp": "string",
              "cidrPrefix": 10,
              "encrypt": false,
              "handOffType": "NAT"
            }
          ],
          "icmpProbe": {
            "enabled": true,
            "probeType": "string",
            "cTag": 9,
            "sTag": 3,
            "destinationIp": "string",
            "frequencySeconds": 7,
            "threshold": 6
          },
          "icmpResponder": {
            "enabled": true,
            "ipAddress": "string",
            "mode": "string"
          }
        },
        "ipsecGatewayDetail": {
          "strictHostCheck": true,
          "strictHostCheckDN": "string"
        },
        "modified": "string"
      },
      {
        "gatewayPoolAssocId": 3,
        "poolName": "string",
        "id": 9,
        "created": "string",
        "networkId": 4,
        "enterpriseProxyId": 3,
        "siteId": 5,
        "activationKey": "string",
        "activationState": "string",
        "activationTime": "string",
        "softwareVersion": "string",
        "buildNumber": "string",
        "utilization": 10,
        "utilizationDetail": {
          "load": 8,
          "overall": 8,
          "cpu": 2,
          "memory": 5
        },
        "connectedEdges": 4,
        "connectedEdgeList": [
          {
            "vceid": "string"
          },
          {
            "vceid": "string"
          },
          {
            "vceid": "string"
          },
          {
            "vceid": "string"
          },
          {
            "vceid": "string"
          },
          {
            "vceid": "string"
          },
          {
            "vceid": "string"
          },
          {
            "vceid": "string"
          },
          {
            "vceid": "string"
          },
          {
            "vceid": "string"
          }
        ],
        "deviceId": "string",
        "logicalId": "string",
        "name": "string",
        "gatewayState": "string",
        "alertsEnabled": 1,
        "description": "string",
        "dnsName": "string",
        "isLoadBalanced": 10,
        "privateIpAddress": "string",
        "ipAddress": "string",
        "lastContact": "string",
        "systemUpSince": "string",
        "serviceUpSince": "string",
        "serviceState": "string",
        "endpointPkiMode": "string",
        "handOffDetail": {
          "type": "string",
          "subnets": [
            {
              "name": "string",
              "routeCost": 6,
              "cidrIp": "string",
              "cidrPrefix": 5,
              "encrypt": false,
              "handOffType": "NAT"
            }
          ],
          "icmpProbe": {
            "enabled": false,
            "probeType": "string",
            "cTag": 10,
            "sTag": 9,
            "destinationIp": "string",
            "frequencySeconds": 2,
            "threshold": 8
          },
          "icmpResponder": {
            "enabled": false,
            "ipAddress": "string",
            "mode": "string"
          }
        },
        "ipsecGatewayDetail": {
          "strictHostCheck": false,
          "strictHostCheckDN": "string"
        },
        "modified": "string"
      },
      {
        "gatewayPoolAssocId": 4,
        "poolName": "string",
        "id": 8,
        "created": "string",
        "networkId": 6,
        "enterpriseProxyId": 6,
        "siteId": 8,
        "activationKey": "string",
        "activationState": "string",
        "activationTime": "string",
        "softwareVersion": "string",
        "buildNumber": "string",
        "utilization": 5,
        "utilizationDetail": {
          "load": 7,
          "overall": 8,
          "cpu": 8,
          "memory": 6
        },
        "connectedEdges": 10,
        "connectedEdgeList": [
          {
            "vceid": "string"
          },
          {
            "vceid": "string"
          },
          {
            "vceid": "string"
          },
          {
            "vceid": "string"
          },
          {
            "vceid": "string"
          },
          {
            "vceid": "string"
          },
          {
            "vceid": "string"
          },
          {
            "vceid": "string"
          },
          {
            "vceid": "string"
          }
        ],
        "deviceId": "string",
        "logicalId": "string",
        "name": "string",
        "gatewayState": "string",
        "alertsEnabled": 4,
        "description": "string",
        "dnsName": "string",
        "isLoadBalanced": 10,
        "privateIpAddress": "string",
        "ipAddress": "string",
        "lastContact": "string",
        "systemUpSince": "string",
        "serviceUpSince": "string",
        "serviceState": "string",
        "endpointPkiMode": "string",
        "handOffDetail": {
          "type": "string",
          "subnets": [
            {
              "name": "string",
              "routeCost": 6,
              "cidrIp": "string",
              "cidrPrefix": 10,
              "encrypt": false,
              "handOffType": "NAT"
            },
            {
              "name": "string",
              "routeCost": 1,
              "cidrIp": "string",
              "cidrPrefix": 9,
              "encrypt": false,
              "handOffType": "NAT"
            },
            {
              "name": "string",
              "routeCost": 2,
              "cidrIp": "string",
              "cidrPrefix": 2,
              "encrypt": false,
              "handOffType": "VLAN"
            },
            {
              "name": "string",
              "routeCost": 1,
              "cidrIp": "string",
              "cidrPrefix": 1,
              "encrypt": false,
              "handOffType": "VLAN"
            },
            {
              "name": "string",
              "routeCost": 8,
              "cidrIp": "string",
              "cidrPrefix": 2,
              "encrypt": false,
              "handOffType": "NAT"
            },
            {
              "name": "string",
              "routeCost": 1,
              "cidrIp": "string",
              "cidrPrefix": 5,
              "encrypt": false,
              "handOffType": "VLAN"
            },
            {
              "name": "string",
              "routeCost": 1,
              "cidrIp": "string",
              "cidrPrefix": 1,
              "encrypt": true,
              "handOffType": "VLAN"
            },
            {
              "name": "string",
              "routeCost": 7,
              "cidrIp": "string",
              "cidrPrefix": 9,
              "encrypt": true,
              "handOffType": "VLAN"
            }
          ],
          "icmpProbe": {
            "enabled": true,
            "probeType": "string",
            "cTag": 10,
            "sTag": 10,
            "destinationIp": "string",
            "frequencySeconds": 7,
            "threshold": 5
          },
          "icmpResponder": {
            "enabled": true,
            "ipAddress": "string",
            "mode": "string"
          }
        },
        "ipsecGatewayDetail": {
          "strictHostCheck": false,
          "strictHostCheckDN": "string"
        },
        "modified": "string"
      },
      {
        "gatewayPoolAssocId": 9,
        "poolName": "string",
        "id": 3,
        "created": "string",
        "networkId": 5,
        "enterpriseProxyId": 10,
        "siteId": 7,
        "activationKey": "string",
        "activationState": "string",
        "activationTime": "string",
        "softwareVersion": "string",
        "buildNumber": "string",
        "utilization": 8,
        "utilizationDetail": {
          "load": 6,
          "overall": 4,
          "cpu": 10,
          "memory": 6
        },
        "connectedEdges": 5,
        "connectedEdgeList": [
          {
            "vceid": "string"
          }
        ],
        "deviceId": "string",
        "logicalId": "string",
        "name": "string",
        "gatewayState": "string",
        "alertsEnabled": 4,
        "description": "string",
        "dnsName": "string",
        "isLoadBalanced": 2,
        "privateIpAddress": "string",
        "ipAddress": "string",
        "lastContact": "string",
        "systemUpSince": "string",
        "serviceUpSince": "string",
        "serviceState": "string",
        "endpointPkiMode": "string",
        "handOffDetail": {
          "type": "string",
          "subnets": [
            {
              "name": "string",
              "routeCost": 6,
              "cidrIp": "string",
              "cidrPrefix": 10,
              "encrypt": true,
              "handOffType": "VLAN"
            }
          ],
          "icmpProbe": {
            "enabled": false,
            "probeType": "string",
            "cTag": 7,
            "sTag": 8,
            "destinationIp": "string",
            "frequencySeconds": 1,
            "threshold": 6
          },
          "icmpResponder": {
            "enabled": true,
            "ipAddress": "string",
            "mode": "string"
          }
        },
        "ipsecGatewayDetail": {
          "strictHostCheck": true,
          "strictHostCheckDN": "string"
        },
        "modified": "string"
      }
    ]
  }
]