[
  {
    "node_id": "node-254de7b540fa3d3b",
    "status": "connected",
    "ssh_launch": 1488984973,
    "ssh_connect": 1488984973,
    "hostname": "scm.example.cc",
    "proxyport": 4053,
    "serial": "string",
    "ssh_help": "string",
    "http_help": "string"
  },
  {
    "node_id": "node-254de7b540fa3d3b",
    "status": "connected",
    "ssh_launch": 1488984973,
    "ssh_connect": 1488984973,
    "hostname": "scm.example.cc",
    "proxyport": 4053,
    "serial": "string",
    "ssh_help": "string",
    "http_help": "string"
  },
  {
    "node_id": "node-254de7b540fa3d3b",
    "status": "connected",
    "ssh_launch": 1488984973,
    "ssh_connect": 1488984973,
    "hostname": "scm.example.cc",
    "proxyport": 4053,
    "serial": "string",
    "ssh_help": "string",
    "http_help": "string"
  }
]