{
  "items": [
    {
      "name": "string",
      "id": "string",
      "org": "string",
      "ospfnet": "string",
      "site": "string",
      "segments": [
        "string",
        "string",
        "string",
        "string",
        "string",
        "string"
      ],
      "uplinks": [
        "string",
        "string",
        "string"
      ],
      "type": "string",
      "backbone": false,
      "area_id": "string",
      "password": "string",
      "auth_method": false,
      "md5_key_id": 7,
      "hello_interval": 9,
      "dead_interval": 6,
      "priority": 4,
      "cost": 9
    },
    {
      "name": "string",
      "id": "string",
      "org": "string",
      "ospfnet": "string",
      "site": "string",
      "segments": [
        "string",
        "string",
        "string"
      ],
      "uplinks": [
        "string",
        "string",
        "string"
      ],
      "type": "string",
      "backbone": true,
      "area_id": "string",
      "password": "string",
      "auth_method": false,
      "md5_key_id": 10,
      "hello_interval": 7,
      "dead_interval": 1,
      "priority": 3,
      "cost": 6
    }
  ]
}