{
  "items": [
    {
      "id": "string",
      "org": "string",
      "site": "string",
      "zone": "string",
      "ssid": "string",
      "inactive": false,
      "dynzone": false,
      "portal": "string",
      "hide_ssid": true,
      "band": "string"
    },
    {
      "id": "string",
      "org": "string",
      "site": "string",
      "zone": "string",
      "ssid": "string",
      "inactive": true,
      "dynzone": true,
      "portal": "string",
      "hide_ssid": false,
      "band": "string"
    },
    {
      "id": "string",
      "org": "string",
      "site": "string",
      "zone": "string",
      "ssid": "string",
      "inactive": true,
      "dynzone": false,
      "portal": "string",
      "hide_ssid": true,
      "band": "string"
    }
  ]
}