{
  "items": [
    {
      "vmac": "string",
      "secret": "string",
      "id": "string",
      "devices": [
        "string",
        "string",
        "string",
        "string",
        "string",
        "string",
        "string"
      ],
      "org": "string",
      "user": "string",
      "client_id": "string"
    },
    {
      "vmac": "string",
      "secret": "string",
      "id": "string",
      "devices": [
        "string",
        "string",
        "string",
        "string",
        "string"
      ],
      "org": "string",
      "user": "string",
      "client_id": "string"
    },
    {
      "vmac": "string",
      "secret": "string",
      "id": "string",
      "devices": [
        "string",
        "string",
        "string",
        "string",
        "string",
        "string",
        "string"
      ],
      "org": "string",
      "user": "string",
      "client_id": "string"
    },
    {
      "vmac": "string",
      "secret": "string",
      "id": "string",
      "devices": [
        "string",
        "string",
        "string",
        "string",
        "string",
        "string"
      ],
      "org": "string",
      "user": "string",
      "client_id": "string"
    },
    {
      "vmac": "string",
      "secret": "string",
      "id": "string",
      "devices": [
        "string",
        "string"
      ],
      "org": "string",
      "user": "string",
      "client_id": "string"
    },
    {
      "vmac": "string",
      "secret": "string",
      "id": "string",
      "devices": [
        "string"
      ],
      "org": "string",
      "user": "string",
      "client_id": "string"
    },
    {
      "vmac": "string",
      "secret": "string",
      "id": "string",
      "devices": [
        "string",
        "string",
        "string",
        "string",
        "string",
        "string",
        "string",
        "string",
        "string",
        "string"
      ],
      "org": "string",
      "user": "string",
      "client_id": "string"
    },
    {
      "vmac": "string",
      "secret": "string",
      "id": "string",
      "devices": [
        "string",
        "string",
        "string",
        "string",
        "string",
        "string",
        "string",
        "string",
        "string"
      ],
      "org": "string",
      "user": "string",
      "client_id": "string"
    },
    {
      "vmac": "string",
      "secret": "string",
      "id": "string",
      "devices": [
        "string",
        "string",
        "string",
        "string",
        "string",
        "string",
        "string",
        "string",
        "string"
      ],
      "org": "string",
      "user": "string",
      "client_id": "string"
    }
  ]
}