{
  "actions": [
    {
      "name": "getCefilters",
      "protocol": "REST",
      "method": "GET",
      "entitypath": "{base_path}/{version}/cefilters?{query}",
      "requestSchema": "schema.json",
      "responseSchema": "schema.json",
      "timeout": 0,
      "sendEmpty": false,
      "sendGetBody": false,
      "requestDatatype": "JSON",
      "responseDatatype": "JSON",
      "headers": {},
      "responseObjects": [
        {
          "type": "default",
          "key": "",
          "mockFile": "mockdatafiles/getCefilters-default.json"
        }
      ]
    },
    {
      "name": "getCefiltersCefilterid",
      "protocol": "REST",
      "method": "GET",
      "entitypath": "{base_path}/{version}/cefilters/{pathv1}?{query}",
      "requestSchema": "schema.json",
      "responseSchema": "schema.json",
      "timeout": 0,
      "sendEmpty": false,
      "sendGetBody": false,
      "requestDatatype": "JSON",
      "responseDatatype": "JSON",
      "headers": {},
      "responseObjects": [
        {
          "type": "default",
          "key": "",
          "mockFile": "mockdatafiles/getCefiltersCefilterid-default.json"
        }
      ]
    },
    {
      "name": "putCefiltersCefilterid",
      "protocol": "REST",
      "method": "PUT",
      "entitypath": "{base_path}/{version}/cefilters/{pathv1}?{query}",
      "requestSchema": "schema.json",
      "responseSchema": "schema.json",
      "timeout": 0,
      "sendEmpty": false,
      "sendGetBody": false,
      "requestDatatype": "JSON",
      "responseDatatype": "JSON",
      "headers": {},
      "responseObjects": [
        {
          "type": "default",
          "key": "",
          "mockFile": "mockdatafiles/putCefiltersCefilterid-default.json"
        }
      ]
    },
    {
      "name": "deleteCefiltersCefilterid",
      "protocol": "REST",
      "method": "DELETE",
      "entitypath": "{base_path}/{version}/cefilters/{pathv1}?{query}",
      "requestSchema": "schema.json",
      "responseSchema": "schema.json",
      "timeout": 0,
      "sendEmpty": false,
      "sendGetBody": false,
      "requestDatatype": "JSON",
      "responseDatatype": "JSON",
      "headers": {},
      "responseObjects": [
        {
          "type": "default",
          "key": "",
          "mockFile": ""
        }
      ]
    },
    {
      "name": "getOrgOrgidCefilters",
      "protocol": "REST",
      "method": "GET",
      "entitypath": "{base_path}/{version}/org/{pathv1}/cefilters?{query}",
      "requestSchema": "schema.json",
      "responseSchema": "schema.json",
      "timeout": 0,
      "sendEmpty": false,
      "sendGetBody": false,
      "requestDatatype": "JSON",
      "responseDatatype": "JSON",
      "headers": {},
      "responseObjects": [
        {
          "type": "default",
          "key": "",
          "mockFile": "mockdatafiles/getOrgOrgidCefilters-default.json"
        }
      ]
    },
    {
      "name": "postOrgOrgidCefilters",
      "protocol": "REST",
      "method": "POST",
      "entitypath": "{base_path}/{version}/org/{pathv1}/cefilters?{query}",
      "requestSchema": "schema.json",
      "responseSchema": "schema.json",
      "timeout": 0,
      "sendEmpty": false,
      "sendGetBody": false,
      "requestDatatype": "JSON",
      "responseDatatype": "JSON",
      "headers": {},
      "responseObjects": [
        {
          "type": "default",
          "key": "",
          "mockFile": "mockdatafiles/postOrgOrgidCefilters-default.json"
        }
      ]
    }
  ]
}