{
  "id": "string",
  "org": "string",
  "uplinks": [
    "string",
    "string",
    "string",
    "string",
    "string",
    "string",
    "string",
    "string",
    "string"
  ],
  "nets": [
    "string",
    "string",
    "string"
  ],
  "name": "string",
  "longname": "string",
  "uid": "string",
  "internet": true,
  "sitelink": false,
  "pingcheck_ips": "string",
  "dcuplink": [
    "string",
    "string",
    "string",
    "string",
    "string"
  ],
  "breakout": true,
  "breakout_sites": [
    "string",
    "string",
    "string",
    "string",
    "string"
  ],
  "xfer_networks": "string"
}