{
  "id": "string",
  "org": "string",
  "name": "string",
  "site": "string",
  "category": "string",
  "match_type": "string",
  "action_type": "string",
  "prefixes": [
    "string",
    "string",
    "string",
    "string",
    "string"
  ],
  "block_route": "string",
  "set_type": "string",
  "metric_type": "string",
  "metric_value": 5
}