{
  "items": [
    {
      "name": "string",
      "zone": "string",
      "site": "string",
      "nodenetcfgs": [
        "string",
        "string",
        "string",
        "string",
        "string",
        "string",
        "string",
        "string"
      ],
      "dhcps_range_start": "string",
      "dhcps_range_end": "string",
      "dhcps_leasetime": 2,
      "dhcps_options": "string",
      "devices": [
        "string",
        "string",
        "string",
        "string"
      ],
      "primary": "string",
      "netv6": "string",
      "gwv6": "string",
      "netv4": "string",
      "gwv4": "string",
      "org": "string",
      "ra": false,
      "wans": [
        "string",
        "string",
        "string",
        "string",
        "string",
        "string",
        "string",
        "string",
        "string"
      ],
      "routes": [
        "string",
        "string",
        "string",
        "string"
      ],
      "id": "string",
      "nets": [
        "string",
        "string",
        "string",
        "string",
        "string",
        "string",
        "string",
        "string",
        "string"
      ],
      "breakout_preference": [
        "string",
        "string",
        "string",
        "string",
        "string",
        "string",
        "string",
        "string"
      ],
      "breakout_sitelink_site": "string",
      "gw_noauto": false
    },
    {
      "name": "string",
      "zone": "string",
      "site": "string",
      "nodenetcfgs": [
        "string",
        "string",
        "string",
        "string"
      ],
      "dhcps_range_start": "string",
      "dhcps_range_end": "string",
      "dhcps_leasetime": 2,
      "dhcps_options": "string",
      "devices": [
        "string",
        "string",
        "string",
        "string",
        "string",
        "string"
      ],
      "primary": "string",
      "netv6": "string",
      "gwv6": "string",
      "netv4": "string",
      "gwv4": "string",
      "org": "string",
      "ra": true,
      "wans": [
        "string"
      ],
      "routes": [
        "string",
        "string",
        "string",
        "string"
      ],
      "id": "string",
      "nets": [
        "string",
        "string",
        "string",
        "string",
        "string",
        "string",
        "string"
      ],
      "breakout_preference": [
        "string",
        "string",
        "string",
        "string",
        "string",
        "string",
        "string"
      ],
      "breakout_sitelink_site": "string",
      "gw_noauto": false
    },
    {
      "name": "string",
      "zone": "string",
      "site": "string",
      "nodenetcfgs": [
        "string",
        "string",
        "string",
        "string",
        "string"
      ],
      "dhcps_range_start": "string",
      "dhcps_range_end": "string",
      "dhcps_leasetime": 7,
      "dhcps_options": "string",
      "devices": [
        "string",
        "string",
        "string",
        "string",
        "string",
        "string",
        "string"
      ],
      "primary": "string",
      "netv6": "string",
      "gwv6": "string",
      "netv4": "string",
      "gwv4": "string",
      "org": "string",
      "ra": true,
      "wans": [
        "string",
        "string",
        "string",
        "string",
        "string",
        "string",
        "string",
        "string",
        "string"
      ],
      "routes": [
        "string",
        "string",
        "string",
        "string",
        "string",
        "string",
        "string",
        "string"
      ],
      "id": "string",
      "nets": [
        "string"
      ],
      "breakout_preference": [
        "string",
        "string",
        "string",
        "string"
      ],
      "breakout_sitelink_site": "string",
      "gw_noauto": true
    },
    {
      "name": "string",
      "zone": "string",
      "site": "string",
      "nodenetcfgs": [
        "string",
        "string",
        "string",
        "string",
        "string",
        "string",
        "string"
      ],
      "dhcps_range_start": "string",
      "dhcps_range_end": "string",
      "dhcps_leasetime": 7,
      "dhcps_options": "string",
      "devices": [
        "string",
        "string",
        "string",
        "string",
        "string",
        "string",
        "string",
        "string",
        "string"
      ],
      "primary": "string",
      "netv6": "string",
      "gwv6": "string",
      "netv4": "string",
      "gwv4": "string",
      "org": "string",
      "ra": false,
      "wans": [
        "string",
        "string",
        "string"
      ],
      "routes": [
        "string",
        "string"
      ],
      "id": "string",
      "nets": [
        "string",
        "string",
        "string",
        "string",
        "string",
        "string",
        "string",
        "string",
        "string"
      ],
      "breakout_preference": [
        "string",
        "string",
        "string",
        "string",
        "string",
        "string",
        "string",
        "string",
        "string"
      ],
      "breakout_sitelink_site": "string",
      "gw_noauto": false
    },
    {
      "name": "string",
      "zone": "string",
      "site": "string",
      "nodenetcfgs": [
        "string",
        "string",
        "string",
        "string",
        "string",
        "string",
        "string",
        "string",
        "string",
        "string"
      ],
      "dhcps_range_start": "string",
      "dhcps_range_end": "string",
      "dhcps_leasetime": 10,
      "dhcps_options": "string",
      "devices": [
        "string",
        "string",
        "string"
      ],
      "primary": "string",
      "netv6": "string",
      "gwv6": "string",
      "netv4": "string",
      "gwv4": "string",
      "org": "string",
      "ra": false,
      "wans": [
        "string",
        "string",
        "string"
      ],
      "routes": [
        "string",
        "string",
        "string"
      ],
      "id": "string",
      "nets": [
        "string",
        "string",
        "string",
        "string"
      ],
      "breakout_preference": [
        "string",
        "string"
      ],
      "breakout_sitelink_site": "string",
      "gw_noauto": true
    },
    {
      "name": "string",
      "zone": "string",
      "site": "string",
      "nodenetcfgs": [
        "string",
        "string",
        "string",
        "string",
        "string",
        "string"
      ],
      "dhcps_range_start": "string",
      "dhcps_range_end": "string",
      "dhcps_leasetime": 9,
      "dhcps_options": "string",
      "devices": [
        "string",
        "string",
        "string",
        "string",
        "string",
        "string",
        "string"
      ],
      "primary": "string",
      "netv6": "string",
      "gwv6": "string",
      "netv4": "string",
      "gwv4": "string",
      "org": "string",
      "ra": false,
      "wans": [
        "string",
        "string",
        "string",
        "string",
        "string",
        "string",
        "string"
      ],
      "routes": [
        "string",
        "string"
      ],
      "id": "string",
      "nets": [
        "string",
        "string"
      ],
      "breakout_preference": [
        "string",
        "string",
        "string",
        "string"
      ],
      "breakout_sitelink_site": "string",
      "gw_noauto": true
    }
  ]
}