{
  "items": [
    {
      "id": "string",
      "name": "HQ",
      "org": "string",
      "longname": "string",
      "uplinks": [
        "string",
        "string",
        "string",
        "string",
        "string",
        "string",
        "string",
        "string",
        "string"
      ],
      "networks": [
        "string",
        "string",
        "string",
        "string",
        "string",
        "string",
        "string",
        "string"
      ],
      "street_address": "Examplecorp, Root Road 14, 12345 Adminten",
      "city": "New York",
      "country": "DE",
      "timezone": "Europe/Berlin",
      "size": 4,
      "uid": 6
    },
    {
      "id": "string",
      "name": "HQ",
      "org": "string",
      "longname": "string",
      "uplinks": [
        "string",
        "string",
        "string",
        "string",
        "string",
        "string",
        "string",
        "string",
        "string",
        "string"
      ],
      "networks": [
        "string",
        "string",
        "string"
      ],
      "street_address": "Examplecorp, Root Road 14, 12345 Adminten",
      "city": "New York",
      "country": "DE",
      "timezone": "Europe/Berlin",
      "size": 10,
      "uid": 10
    },
    {
      "id": "string",
      "name": "HQ",
      "org": "string",
      "longname": "string",
      "uplinks": [
        "string",
        "string",
        "string"
      ],
      "networks": [
        "string",
        "string"
      ],
      "street_address": "Examplecorp, Root Road 14, 12345 Adminten",
      "city": "New York",
      "country": "DE",
      "timezone": "Europe/Berlin",
      "size": 8,
      "uid": 3
    }
  ]
}