{
  "actions": [
    {
      "name": "getOrgOrgidCloudAccountAccountIdCloudConnectSubnets",
      "protocol": "REST",
      "method": "GET",
      "entitypath": "{base_path}/{version}/org/{pathv1}/cloud-account/{pathv2}/cloud-connect/subnets?{query}",
      "requestSchema": "schema.json",
      "responseSchema": "schema.json",
      "timeout": 0,
      "sendEmpty": false,
      "sendGetBody": false,
      "requestDatatype": "JSON",
      "responseDatatype": "JSON",
      "headers": {},
      "responseObjects": [
        {
          "type": "default",
          "key": "",
          "mockFile": "mockdatafiles/getOrgOrgidCloudAccountAccountIdCloudConnectSubnets-default.json"
        }
      ]
    },
    {
      "name": "postOrgOrgidCloudAccountAccountIdCloudConnectSubnetSubnetId",
      "protocol": "REST",
      "method": "POST",
      "entitypath": "{base_path}/{version}/org/{pathv1}/cloud-account/{pathv2}/cloud-connect/subnet/{pathv3}?{query}",
      "requestSchema": "schema.json",
      "responseSchema": "schema.json",
      "timeout": 0,
      "sendEmpty": false,
      "sendGetBody": false,
      "requestDatatype": "JSON",
      "responseDatatype": "JSON",
      "headers": {},
      "responseObjects": [
        {
          "type": "default",
          "key": "",
          "mockFile": ""
        }
      ]
    },
    {
      "name": "deleteOrgOrgidCloudAccountAccountIdCloudConnectSubnetSubnetId",
      "protocol": "REST",
      "method": "DELETE",
      "entitypath": "{base_path}/{version}/org/{pathv1}/cloud-account/{pathv2}/cloud-connect/subnet/{pathv3}?{query}",
      "requestSchema": "schema.json",
      "responseSchema": "schema.json",
      "timeout": 0,
      "sendEmpty": false,
      "sendGetBody": false,
      "requestDatatype": "JSON",
      "responseDatatype": "JSON",
      "headers": {},
      "responseObjects": [
        {
          "type": "default",
          "key": "",
          "mockFile": ""
        }
      ]
    },
    {
      "name": "postOrgOrgidCloudAccountAccountIdCloudConnectVpcVpcId",
      "protocol": "REST",
      "method": "POST",
      "entitypath": "{base_path}/{version}/org/{pathv1}/cloud-account/{pathv2}/cloud-connect/vpc/{pathv3}?{query}",
      "requestSchema": "schema.json",
      "responseSchema": "schema.json",
      "timeout": 0,
      "sendEmpty": false,
      "sendGetBody": false,
      "requestDatatype": "JSON",
      "responseDatatype": "JSON",
      "headers": {},
      "responseObjects": [
        {
          "type": "default",
          "key": "",
          "mockFile": ""
        }
      ]
    },
    {
      "name": "deleteOrgOrgidCloudAccountAccountIdCloudConnectVpcVpcId",
      "protocol": "REST",
      "method": "DELETE",
      "entitypath": "{base_path}/{version}/org/{pathv1}/cloud-account/{pathv2}/cloud-connect/vpc/{pathv3}?{query}",
      "requestSchema": "schema.json",
      "responseSchema": "schema.json",
      "timeout": 0,
      "sendEmpty": false,
      "sendGetBody": false,
      "requestDatatype": "JSON",
      "responseDatatype": "JSON",
      "headers": {},
      "responseObjects": [
        {
          "type": "default",
          "key": "",
          "mockFile": ""
        }
      ]
    },
    {
      "name": "postOrgOrgidCloudAccountAccountIdCloudConnectVnetVnetId",
      "protocol": "REST",
      "method": "POST",
      "entitypath": "{base_path}/{version}/org/{pathv1}/cloud-account/{pathv2}/cloud-connect/vnet/{pathv3}?{query}",
      "requestSchema": "schema.json",
      "responseSchema": "schema.json",
      "timeout": 0,
      "sendEmpty": false,
      "sendGetBody": false,
      "requestDatatype": "JSON",
      "responseDatatype": "JSON",
      "headers": {},
      "responseObjects": [
        {
          "type": "default",
          "key": "",
          "mockFile": ""
        }
      ]
    },
    {
      "name": "deleteOrgOrgidCloudAccountAccountIdCloudConnectVnetVnetId",
      "protocol": "REST",
      "method": "DELETE",
      "entitypath": "{base_path}/{version}/org/{pathv1}/cloud-account/{pathv2}/cloud-connect/vnet/{pathv3}?{query}",
      "requestSchema": "schema.json",
      "responseSchema": "schema.json",
      "timeout": 0,
      "sendEmpty": false,
      "sendGetBody": false,
      "requestDatatype": "JSON",
      "responseDatatype": "JSON",
      "headers": {},
      "responseObjects": [
        {
          "type": "default",
          "key": "",
          "mockFile": ""
        }
      ]
    }
  ]
}