{
  "name": "SiteName-wifi-plan",
  "id": "string",
  "profile": "string",
  "org": "string",
  "site": "string",
  "meter_xh": 1,
  "meter_w": 6,
  "image_height": 2,
  "image_zoom_scale": 4,
  "image_translation": "string",
  "image_ext": "string",
  "meter_h": 10,
  "meter_y": 10,
  "meter_xw": 4,
  "location": "string",
  "meter_x": 7,
  "image_width": 1,
  "scale": 5,
  "nodes": "string"
}