{
  "items": [
    {
      "id": "string",
      "name": "string",
      "appid": "string",
      "desc": "string",
      "appgrps": [
        "string",
        "string",
        "string",
        "string",
        "string"
      ],
      "devgrp": "string",
      "org": "string",
      "dnats": [
        "string",
        "string",
        "string",
        "string",
        "string",
        "string",
        "string",
        "string",
        "string",
        "string"
      ],
      "type": "string",
      "internal": true,
      "ipport": "string",
      "httphost": "'facebook.*'\n 'cnn.com'\n 'ibm.*'",
      "device": "string",
      "segments": [
        "string"
      ],
      "device_proto": "string",
      "device_ports": "string",
      "uid": "string"
    },
    {
      "id": "string",
      "name": "string",
      "appid": "string",
      "desc": "string",
      "appgrps": [
        "string",
        "string",
        "string",
        "string"
      ],
      "devgrp": "string",
      "org": "string",
      "dnats": [
        "string",
        "string"
      ],
      "type": "string",
      "internal": false,
      "ipport": "string",
      "httphost": "'facebook.*'\n 'cnn.com'\n 'ibm.*'",
      "device": "string",
      "segments": [
        "string",
        "string",
        "string",
        "string",
        "string",
        "string",
        "string",
        "string",
        "string"
      ],
      "device_proto": "string",
      "device_ports": "string",
      "uid": "string"
    },
    {
      "id": "string",
      "name": "string",
      "appid": "string",
      "desc": "string",
      "appgrps": [
        "string",
        "string"
      ],
      "devgrp": "string",
      "org": "string",
      "dnats": [
        "string"
      ],
      "type": "string",
      "internal": true,
      "ipport": "string",
      "httphost": "'facebook.*'\n 'cnn.com'\n 'ibm.*'",
      "device": "string",
      "segments": [
        "string",
        "string",
        "string",
        "string",
        "string"
      ],
      "device_proto": "string",
      "device_ports": "string",
      "uid": "string"
    },
    {
      "id": "string",
      "name": "string",
      "appid": "string",
      "desc": "string",
      "appgrps": [
        "string",
        "string",
        "string"
      ],
      "devgrp": "string",
      "org": "string",
      "dnats": [
        "string"
      ],
      "type": "string",
      "internal": false,
      "ipport": "string",
      "httphost": "'facebook.*'\n 'cnn.com'\n 'ibm.*'",
      "device": "string",
      "segments": [
        "string",
        "string",
        "string",
        "string",
        "string",
        "string",
        "string",
        "string"
      ],
      "device_proto": "string",
      "device_ports": "string",
      "uid": "string"
    },
    {
      "id": "string",
      "name": "string",
      "appid": "string",
      "desc": "string",
      "appgrps": [
        "string",
        "string"
      ],
      "devgrp": "string",
      "org": "string",
      "dnats": [
        "string",
        "string",
        "string",
        "string",
        "string",
        "string",
        "string",
        "string"
      ],
      "type": "string",
      "internal": true,
      "ipport": "string",
      "httphost": "'facebook.*'\n 'cnn.com'\n 'ibm.*'",
      "device": "string",
      "segments": [
        "string",
        "string",
        "string",
        "string",
        "string",
        "string",
        "string",
        "string",
        "string"
      ],
      "device_proto": "string",
      "device_ports": "string",
      "uid": "string"
    },
    {
      "id": "string",
      "name": "string",
      "appid": "string",
      "desc": "string",
      "appgrps": [
        "string",
        "string",
        "string",
        "string",
        "string",
        "string",
        "string",
        "string",
        "string"
      ],
      "devgrp": "string",
      "org": "string",
      "dnats": [
        "string",
        "string",
        "string",
        "string",
        "string",
        "string",
        "string"
      ],
      "type": "string",
      "internal": true,
      "ipport": "string",
      "httphost": "'facebook.*'\n 'cnn.com'\n 'ibm.*'",
      "device": "string",
      "segments": [
        "string",
        "string",
        "string",
        "string",
        "string",
        "string",
        "string",
        "string",
        "string"
      ],
      "device_proto": "string",
      "device_ports": "string",
      "uid": "string"
    },
    {
      "id": "string",
      "name": "string",
      "appid": "string",
      "desc": "string",
      "appgrps": [
        "string",
        "string"
      ],
      "devgrp": "string",
      "org": "string",
      "dnats": [
        "string",
        "string",
        "string",
        "string"
      ],
      "type": "string",
      "internal": false,
      "ipport": "string",
      "httphost": "'facebook.*'\n 'cnn.com'\n 'ibm.*'",
      "device": "string",
      "segments": [
        "string",
        "string",
        "string",
        "string",
        "string",
        "string"
      ],
      "device_proto": "string",
      "device_ports": "string",
      "uid": "string"
    },
    {
      "id": "string",
      "name": "string",
      "appid": "string",
      "desc": "string",
      "appgrps": [
        "string",
        "string",
        "string",
        "string",
        "string",
        "string",
        "string"
      ],
      "devgrp": "string",
      "org": "string",
      "dnats": [
        "string",
        "string",
        "string",
        "string",
        "string"
      ],
      "type": "string",
      "internal": false,
      "ipport": "string",
      "httphost": "'facebook.*'\n 'cnn.com'\n 'ibm.*'",
      "device": "string",
      "segments": [
        "string"
      ],
      "device_proto": "string",
      "device_ports": "string",
      "uid": "string"
    },
    {
      "id": "string",
      "name": "string",
      "appid": "string",
      "desc": "string",
      "appgrps": [
        "string",
        "string",
        "string",
        "string"
      ],
      "devgrp": "string",
      "org": "string",
      "dnats": [
        "string",
        "string",
        "string",
        "string",
        "string",
        "string"
      ],
      "type": "string",
      "internal": true,
      "ipport": "string",
      "httphost": "'facebook.*'\n 'cnn.com'\n 'ibm.*'",
      "device": "string",
      "segments": [
        "string",
        "string",
        "string",
        "string",
        "string",
        "string",
        "string"
      ],
      "device_proto": "string",
      "device_ports": "string",
      "uid": "string"
    }
  ]
}