{
  "id": "string",
  "port_id": "string",
  "node": "string",
  "tag": "string",
  "type": "string",
  "speeds": "string",
  "speed": "string",
  "patchlabel": "string",
  "zone": "string",
  "uplink": "string",
  "portal": "string",
  "mac": "string",
  "virtual_mac": "string",
  "switch_id": "string",
  "autotrunk": true,
  "bridge_with": "string",
  "ifname": "string",
  "dcinterface": "string",
  "auto": false,
  "autocfg": false,
  "tagged": false,
  "segment": "string",
  "vsh_aux_enabled": true,
  "vsh_primary_enabled": false,
  "cluster_enabled": false,
  "data_enabled": true,
  "mgmt_enabled": true,
  "mgmt_config_type": "string",
  "mgmt_ipv4": "string",
  "mgmt_gw_ipv4": "string",
  "mgmt_ipv6": "string",
  "mgmt_gw_ipv6": "string",
  "mgmt_dns_ipv4": "string",
  "poe_disabled": true,
  "capab_multizone": false,
  "capab_vsh_aux": false,
  "capab_mgmt": false,
  "capab_lan": false,
  "capab_poe": false,
  "capab_uplink": true,
  "capab_cluster": true,
  "ha_mirrored_uplink": false
}