{
  "$id": "schema.json",
  "type": "object",
  "schema": "http://json-schema.org/draft-07/schema#",
  "translate": true,
  "dynamicfields": true,
  "properties": {
    "ph_request_type": {
      "type": "string",
      "description": "type of request (internal to adapter)",
      "default": "getShprimaryShprimaryid",
      "enum": [
        "getShprimaryShprimaryid",
        "putShprimaryShprimaryid"
      ],
      "external_name": "ph_request_type"
    },
    "shPrimaryIpv4": {
      "type": "string",
      "description": "IPv4 address of the SteelHead&#39;s primary interface with mask.",
      "parse": false,
      "encode": false,
      "encrypt": {
        "type": "AES",
        "key": ""
      },
      "external_name": "sh_primary_ipv4"
    },
    "shPrimaryGwv4": {
      "type": "string",
      "description": "IPv4 address of the SteelHead&#39;s primary interface&#39;s gateway.",
      "parse": false,
      "encode": false,
      "encrypt": {
        "type": "AES",
        "key": ""
      },
      "external_name": "sh_primary_gwv4"
    }
  },
  "definitions": {}
}