{
  "items": [
    {
      "id": "uplink-Uplink-8c22c3e3d80f11e1",
      "site": "site-HQ-2564a86cdcee8b32",
      "wan": "wan-Internet-b47d7c36130a5ccf",
      "org": "org-example-8a882293bfddffaf",
      "qos_bw_up": 6,
      "qos_up": 8,
      "static_ip_v4": "string",
      "static_gw_v4": "string",
      "static_ip_v6": "string",
      "static_gw_v6": "string",
      "uin": 8,
      "uid": 6,
      "node": "string",
      "name": "string",
      "qos_bw_down": 10,
      "qos_down": 9,
      "port": "string",
      "vlan": 4,
      "type": "string",
      "backup": false,
      "sitelink_ipsel": "string",
      "sitelink_custom_ip": "string",
      "sitelink_prio": 6,
      "bgp_advertised_routes": "[1.2.3.4,5.7.8.9]",
      "bgp_learned_routes": "[1.2.3.4,5.7.8.9]",
      "bgp_enable": 8,
      "bgp_router_id": "1.2.3.4",
      "bgp_local_as": "string",
      "bgp_neigh_name": "BGP_NEIGHBOUR",
      "bgp_neigh_remote_as": 9,
      "bgp_neigh_ipv4": "1.2.3.4",
      "bgp_neigh_password": "PASSWORD",
      "bgp_neigh_keepalive_time": "60",
      "bgp_neigh_hold_time": "180",
      "mtu": 9,
      "qos_inbound": "string",
      "qos_inbound_Bandwidth": "string",
      "qos_inbound_units": "string",
      "qos_outbound": "string",
      "qos_outbound_Bandwidth": "string",
      "qos_outbound_units": "string",
      "auto_negotiation": true,
      "link_speed": 3,
      "PPP-reconnect": "string"
    },
    {
      "id": "uplink-Uplink-8c22c3e3d80f11e1",
      "site": "site-HQ-2564a86cdcee8b32",
      "wan": "wan-Internet-b47d7c36130a5ccf",
      "org": "org-example-8a882293bfddffaf",
      "qos_bw_up": 6,
      "qos_up": 2,
      "static_ip_v4": "string",
      "static_gw_v4": "string",
      "static_ip_v6": "string",
      "static_gw_v6": "string",
      "uin": 6,
      "uid": 10,
      "node": "string",
      "name": "string",
      "qos_bw_down": 7,
      "qos_down": 7,
      "port": "string",
      "vlan": 10,
      "type": "string",
      "backup": false,
      "sitelink_ipsel": "string",
      "sitelink_custom_ip": "string",
      "sitelink_prio": 7,
      "bgp_advertised_routes": "[1.2.3.4,5.7.8.9]",
      "bgp_learned_routes": "[1.2.3.4,5.7.8.9]",
      "bgp_enable": 7,
      "bgp_router_id": "1.2.3.4",
      "bgp_local_as": "string",
      "bgp_neigh_name": "BGP_NEIGHBOUR",
      "bgp_neigh_remote_as": 7,
      "bgp_neigh_ipv4": "1.2.3.4",
      "bgp_neigh_password": "PASSWORD",
      "bgp_neigh_keepalive_time": "60",
      "bgp_neigh_hold_time": "180",
      "mtu": 5,
      "qos_inbound": "string",
      "qos_inbound_Bandwidth": "string",
      "qos_inbound_units": "string",
      "qos_outbound": "string",
      "qos_outbound_Bandwidth": "string",
      "qos_outbound_units": "string",
      "auto_negotiation": true,
      "link_speed": 4,
      "PPP-reconnect": "string"
    },
    {
      "id": "uplink-Uplink-8c22c3e3d80f11e1",
      "site": "site-HQ-2564a86cdcee8b32",
      "wan": "wan-Internet-b47d7c36130a5ccf",
      "org": "org-example-8a882293bfddffaf",
      "qos_bw_up": 1,
      "qos_up": 5,
      "static_ip_v4": "string",
      "static_gw_v4": "string",
      "static_ip_v6": "string",
      "static_gw_v6": "string",
      "uin": 4,
      "uid": 3,
      "node": "string",
      "name": "string",
      "qos_bw_down": 4,
      "qos_down": 4,
      "port": "string",
      "vlan": 6,
      "type": "string",
      "backup": true,
      "sitelink_ipsel": "string",
      "sitelink_custom_ip": "string",
      "sitelink_prio": 9,
      "bgp_advertised_routes": "[1.2.3.4,5.7.8.9]",
      "bgp_learned_routes": "[1.2.3.4,5.7.8.9]",
      "bgp_enable": 8,
      "bgp_router_id": "1.2.3.4",
      "bgp_local_as": "string",
      "bgp_neigh_name": "BGP_NEIGHBOUR",
      "bgp_neigh_remote_as": 6,
      "bgp_neigh_ipv4": "1.2.3.4",
      "bgp_neigh_password": "PASSWORD",
      "bgp_neigh_keepalive_time": "60",
      "bgp_neigh_hold_time": "180",
      "mtu": 9,
      "qos_inbound": "string",
      "qos_inbound_Bandwidth": "string",
      "qos_inbound_units": "string",
      "qos_outbound": "string",
      "qos_outbound_Bandwidth": "string",
      "qos_outbound_units": "string",
      "auto_negotiation": false,
      "link_speed": 6,
      "PPP-reconnect": "string"
    },
    {
      "id": "uplink-Uplink-8c22c3e3d80f11e1",
      "site": "site-HQ-2564a86cdcee8b32",
      "wan": "wan-Internet-b47d7c36130a5ccf",
      "org": "org-example-8a882293bfddffaf",
      "qos_bw_up": 2,
      "qos_up": 5,
      "static_ip_v4": "string",
      "static_gw_v4": "string",
      "static_ip_v6": "string",
      "static_gw_v6": "string",
      "uin": 8,
      "uid": 9,
      "node": "string",
      "name": "string",
      "qos_bw_down": 4,
      "qos_down": 4,
      "port": "string",
      "vlan": 5,
      "type": "string",
      "backup": false,
      "sitelink_ipsel": "string",
      "sitelink_custom_ip": "string",
      "sitelink_prio": 4,
      "bgp_advertised_routes": "[1.2.3.4,5.7.8.9]",
      "bgp_learned_routes": "[1.2.3.4,5.7.8.9]",
      "bgp_enable": 9,
      "bgp_router_id": "1.2.3.4",
      "bgp_local_as": "string",
      "bgp_neigh_name": "BGP_NEIGHBOUR",
      "bgp_neigh_remote_as": 6,
      "bgp_neigh_ipv4": "1.2.3.4",
      "bgp_neigh_password": "PASSWORD",
      "bgp_neigh_keepalive_time": "60",
      "bgp_neigh_hold_time": "180",
      "mtu": 8,
      "qos_inbound": "string",
      "qos_inbound_Bandwidth": "string",
      "qos_inbound_units": "string",
      "qos_outbound": "string",
      "qos_outbound_Bandwidth": "string",
      "qos_outbound_units": "string",
      "auto_negotiation": true,
      "link_speed": 3,
      "PPP-reconnect": "string"
    },
    {
      "id": "uplink-Uplink-8c22c3e3d80f11e1",
      "site": "site-HQ-2564a86cdcee8b32",
      "wan": "wan-Internet-b47d7c36130a5ccf",
      "org": "org-example-8a882293bfddffaf",
      "qos_bw_up": 9,
      "qos_up": 8,
      "static_ip_v4": "string",
      "static_gw_v4": "string",
      "static_ip_v6": "string",
      "static_gw_v6": "string",
      "uin": 5,
      "uid": 9,
      "node": "string",
      "name": "string",
      "qos_bw_down": 8,
      "qos_down": 4,
      "port": "string",
      "vlan": 1,
      "type": "string",
      "backup": false,
      "sitelink_ipsel": "string",
      "sitelink_custom_ip": "string",
      "sitelink_prio": 7,
      "bgp_advertised_routes": "[1.2.3.4,5.7.8.9]",
      "bgp_learned_routes": "[1.2.3.4,5.7.8.9]",
      "bgp_enable": 1,
      "bgp_router_id": "1.2.3.4",
      "bgp_local_as": "string",
      "bgp_neigh_name": "BGP_NEIGHBOUR",
      "bgp_neigh_remote_as": 9,
      "bgp_neigh_ipv4": "1.2.3.4",
      "bgp_neigh_password": "PASSWORD",
      "bgp_neigh_keepalive_time": "60",
      "bgp_neigh_hold_time": "180",
      "mtu": 4,
      "qos_inbound": "string",
      "qos_inbound_Bandwidth": "string",
      "qos_inbound_units": "string",
      "qos_outbound": "string",
      "qos_outbound_Bandwidth": "string",
      "qos_outbound_units": "string",
      "auto_negotiation": false,
      "link_speed": 8,
      "PPP-reconnect": "string"
    },
    {
      "id": "uplink-Uplink-8c22c3e3d80f11e1",
      "site": "site-HQ-2564a86cdcee8b32",
      "wan": "wan-Internet-b47d7c36130a5ccf",
      "org": "org-example-8a882293bfddffaf",
      "qos_bw_up": 6,
      "qos_up": 10,
      "static_ip_v4": "string",
      "static_gw_v4": "string",
      "static_ip_v6": "string",
      "static_gw_v6": "string",
      "uin": 3,
      "uid": 5,
      "node": "string",
      "name": "string",
      "qos_bw_down": 7,
      "qos_down": 10,
      "port": "string",
      "vlan": 6,
      "type": "string",
      "backup": true,
      "sitelink_ipsel": "string",
      "sitelink_custom_ip": "string",
      "sitelink_prio": 3,
      "bgp_advertised_routes": "[1.2.3.4,5.7.8.9]",
      "bgp_learned_routes": "[1.2.3.4,5.7.8.9]",
      "bgp_enable": 3,
      "bgp_router_id": "1.2.3.4",
      "bgp_local_as": "string",
      "bgp_neigh_name": "BGP_NEIGHBOUR",
      "bgp_neigh_remote_as": 1,
      "bgp_neigh_ipv4": "1.2.3.4",
      "bgp_neigh_password": "PASSWORD",
      "bgp_neigh_keepalive_time": "60",
      "bgp_neigh_hold_time": "180",
      "mtu": 9,
      "qos_inbound": "string",
      "qos_inbound_Bandwidth": "string",
      "qos_inbound_units": "string",
      "qos_outbound": "string",
      "qos_outbound_Bandwidth": "string",
      "qos_outbound_units": "string",
      "auto_negotiation": true,
      "link_speed": 3,
      "PPP-reconnect": "string"
    }
  ]
}