{
  "items": [
    {
      "summary": false,
      "prefix": "string",
      "id": "string",
      "ceexportpolicy": "string",
      "ceimportpolicy": "string",
      "org": "string",
      "cefilter": "string"
    },
    {
      "summary": true,
      "prefix": "string",
      "id": "string",
      "ceexportpolicy": "string",
      "ceimportpolicy": "string",
      "org": "string",
      "cefilter": "string"
    },
    {
      "summary": false,
      "prefix": "string",
      "id": "string",
      "ceexportpolicy": "string",
      "ceimportpolicy": "string",
      "org": "string",
      "cefilter": "string"
    }
  ]
}