{
  "items": [
    {
      "id": "string",
      "name": "ExamplePortal",
      "inactivity_timeout": "string",
      "mobile": "string",
      "email": "string",
      "social": "string",
      "tos": "string",
      "tos_show": "string",
      "voucher_tmpl": "string",
      "text_greeting": "string",
      "voucher_msg_tmpl": "string",
      "title": "string",
      "type": "string",
      "voucher_pass": "string"
    },
    {
      "id": "string",
      "name": "ExamplePortal",
      "inactivity_timeout": "string",
      "mobile": "string",
      "email": "string",
      "social": "string",
      "tos": "string",
      "tos_show": "string",
      "voucher_tmpl": "string",
      "text_greeting": "string",
      "voucher_msg_tmpl": "string",
      "title": "string",
      "type": "string",
      "voucher_pass": "string"
    }
  ]
}