{
  "actions": [
    {
      "name": "getWans",
      "protocol": "REST",
      "method": "GET",
      "entitypath": "{base_path}/{version}/wans?{query}",
      "requestSchema": "schema.json",
      "responseSchema": "schema.json",
      "timeout": 0,
      "sendEmpty": false,
      "sendGetBody": false,
      "requestDatatype": "JSON",
      "responseDatatype": "JSON",
      "headers": {},
      "responseObjects": [
        {
          "type": "default",
          "key": "",
          "mockFile": "mockdatafiles/getWans-default.json"
        }
      ]
    },
    {
      "name": "getOrgOrgidWans",
      "protocol": "REST",
      "method": "GET",
      "entitypath": "{base_path}/{version}/org/{pathv1}/wans?{query}",
      "requestSchema": "schema.json",
      "responseSchema": "schema.json",
      "timeout": 0,
      "sendEmpty": false,
      "sendGetBody": false,
      "requestDatatype": "JSON",
      "responseDatatype": "JSON",
      "headers": {},
      "responseObjects": [
        {
          "type": "default",
          "key": "",
          "mockFile": "mockdatafiles/getOrgOrgidWans-default.json"
        }
      ]
    },
    {
      "name": "postOrgOrgidWans",
      "protocol": "REST",
      "method": "POST",
      "entitypath": "{base_path}/{version}/org/{pathv1}/wans?{query}",
      "requestSchema": "schema.json",
      "responseSchema": "schema.json",
      "timeout": 0,
      "sendEmpty": false,
      "sendGetBody": false,
      "requestDatatype": "JSON",
      "responseDatatype": "JSON",
      "headers": {},
      "responseObjects": [
        {
          "type": "default",
          "key": "",
          "mockFile": "mockdatafiles/postOrgOrgidWans-default.json"
        }
      ]
    },
    {
      "name": "getWanWanid",
      "protocol": "REST",
      "method": "GET",
      "entitypath": "{base_path}/{version}/wan/{pathv1}?{query}",
      "requestSchema": "schema.json",
      "responseSchema": "schema.json",
      "timeout": 0,
      "sendEmpty": false,
      "sendGetBody": false,
      "requestDatatype": "JSON",
      "responseDatatype": "JSON",
      "headers": {},
      "responseObjects": [
        {
          "type": "default",
          "key": "",
          "mockFile": "mockdatafiles/getWanWanid-default.json"
        }
      ]
    },
    {
      "name": "putWanWanid",
      "protocol": "REST",
      "method": "PUT",
      "entitypath": "{base_path}/{version}/wan/{pathv1}?{query}",
      "requestSchema": "schema.json",
      "responseSchema": "schema.json",
      "timeout": 0,
      "sendEmpty": false,
      "sendGetBody": false,
      "requestDatatype": "JSON",
      "responseDatatype": "JSON",
      "headers": {},
      "responseObjects": [
        {
          "type": "default",
          "key": "",
          "mockFile": "mockdatafiles/putWanWanid-default.json"
        }
      ]
    },
    {
      "name": "deleteWanWanid",
      "protocol": "REST",
      "method": "DELETE",
      "entitypath": "{base_path}/{version}/wan/{pathv1}?{query}",
      "requestSchema": "schema.json",
      "responseSchema": "schema.json",
      "timeout": 0,
      "sendEmpty": false,
      "sendGetBody": false,
      "requestDatatype": "JSON",
      "responseDatatype": "JSON",
      "headers": {},
      "responseObjects": [
        {
          "type": "default",
          "key": "",
          "mockFile": ""
        }
      ]
    }
  ]
}