{
  "id": "string",
  "cepolicy": "string",
  "wan_prefixes": [
    "string",
    "string",
    "string"
  ],
  "exportrules": [
    "string",
    "string",
    "string",
    "string"
  ],
  "redistribute": false
}