{
  "items": [
    {
      "id": "string",
      "name": "string",
      "org": "string",
      "users": [
        "string",
        "string"
      ],
      "active": true,
      "devices": [
        "string",
        "string",
        "string",
        "string",
        "string",
        "string",
        "string",
        "string"
      ],
      "zones": [
        "string",
        "string",
        "string",
        "string",
        "string",
        "string",
        "string",
        "string"
      ],
      "apps": [
        "string",
        "string",
        "string",
        "string"
      ],
      "sapps": "string",
      "srctype": "all",
      "source_zones": [
        "string",
        "string",
        "string"
      ],
      "dsttype": "string",
      "tags": "string",
      "allow": true,
      "usergrps": [
        "string",
        "string",
        "string",
        "string",
        "string",
        "string",
        "string",
        "string",
        "string",
        "string"
      ],
      "devgrps": [
        "string",
        "string",
        "string",
        "string",
        "string",
        "string",
        "string"
      ],
      "appgrps": [
        "string",
        "string",
        "string",
        "string",
        "string",
        "string",
        "string",
        "string",
        "string"
      ]
    },
    {
      "id": "string",
      "name": "string",
      "org": "string",
      "users": [
        "string",
        "string",
        "string"
      ],
      "active": true,
      "devices": [
        "string",
        "string",
        "string",
        "string",
        "string",
        "string",
        "string",
        "string"
      ],
      "zones": [
        "string",
        "string",
        "string",
        "string",
        "string"
      ],
      "apps": [
        "string",
        "string",
        "string",
        "string",
        "string"
      ],
      "sapps": "string",
      "srctype": "all",
      "source_zones": [
        "string",
        "string",
        "string",
        "string",
        "string",
        "string"
      ],
      "dsttype": "string",
      "tags": "string",
      "allow": false,
      "usergrps": [
        "string"
      ],
      "devgrps": [
        "string",
        "string",
        "string",
        "string"
      ],
      "appgrps": [
        "string",
        "string",
        "string",
        "string",
        "string",
        "string",
        "string"
      ]
    },
    {
      "id": "string",
      "name": "string",
      "org": "string",
      "users": [
        "string",
        "string",
        "string",
        "string",
        "string",
        "string",
        "string",
        "string"
      ],
      "active": true,
      "devices": [
        "string",
        "string",
        "string",
        "string",
        "string",
        "string",
        "string",
        "string",
        "string"
      ],
      "zones": [
        "string",
        "string",
        "string",
        "string",
        "string",
        "string",
        "string",
        "string"
      ],
      "apps": [
        "string",
        "string"
      ],
      "sapps": "string",
      "srctype": "all",
      "source_zones": [
        "string",
        "string",
        "string"
      ],
      "dsttype": "string",
      "tags": "string",
      "allow": true,
      "usergrps": [
        "string"
      ],
      "devgrps": [
        "string",
        "string",
        "string",
        "string",
        "string",
        "string",
        "string"
      ],
      "appgrps": [
        "string",
        "string",
        "string",
        "string",
        "string",
        "string",
        "string",
        "string",
        "string"
      ]
    },
    {
      "id": "string",
      "name": "string",
      "org": "string",
      "users": [
        "string",
        "string",
        "string",
        "string",
        "string",
        "string"
      ],
      "active": true,
      "devices": [
        "string",
        "string",
        "string",
        "string",
        "string",
        "string",
        "string",
        "string",
        "string"
      ],
      "zones": [
        "string",
        "string",
        "string"
      ],
      "apps": [
        "string",
        "string",
        "string",
        "string",
        "string",
        "string",
        "string"
      ],
      "sapps": "string",
      "srctype": "all",
      "source_zones": [
        "string"
      ],
      "dsttype": "string",
      "tags": "string",
      "allow": false,
      "usergrps": [
        "string",
        "string",
        "string",
        "string",
        "string",
        "string",
        "string"
      ],
      "devgrps": [
        "string",
        "string",
        "string",
        "string",
        "string"
      ],
      "appgrps": [
        "string",
        "string",
        "string",
        "string",
        "string"
      ]
    },
    {
      "id": "string",
      "name": "string",
      "org": "string",
      "users": [
        "string",
        "string",
        "string",
        "string",
        "string",
        "string",
        "string",
        "string",
        "string",
        "string"
      ],
      "active": true,
      "devices": [
        "string",
        "string",
        "string",
        "string"
      ],
      "zones": [
        "string",
        "string",
        "string",
        "string",
        "string",
        "string",
        "string",
        "string",
        "string",
        "string"
      ],
      "apps": [
        "string",
        "string",
        "string",
        "string",
        "string",
        "string",
        "string",
        "string",
        "string",
        "string"
      ],
      "sapps": "string",
      "srctype": "all",
      "source_zones": [
        "string",
        "string",
        "string",
        "string"
      ],
      "dsttype": "string",
      "tags": "string",
      "allow": false,
      "usergrps": [
        "string",
        "string",
        "string",
        "string",
        "string"
      ],
      "devgrps": [
        "string",
        "string",
        "string"
      ],
      "appgrps": [
        "string",
        "string",
        "string",
        "string",
        "string",
        "string",
        "string",
        "string",
        "string",
        "string"
      ]
    },
    {
      "id": "string",
      "name": "string",
      "org": "string",
      "users": [
        "string",
        "string",
        "string",
        "string",
        "string"
      ],
      "active": true,
      "devices": [
        "string"
      ],
      "zones": [
        "string",
        "string",
        "string",
        "string",
        "string",
        "string",
        "string",
        "string",
        "string",
        "string"
      ],
      "apps": [
        "string",
        "string",
        "string",
        "string",
        "string",
        "string",
        "string",
        "string"
      ],
      "sapps": "string",
      "srctype": "all",
      "source_zones": [
        "string",
        "string",
        "string",
        "string",
        "string",
        "string"
      ],
      "dsttype": "string",
      "tags": "string",
      "allow": false,
      "usergrps": [
        "string",
        "string",
        "string",
        "string",
        "string",
        "string"
      ],
      "devgrps": [
        "string",
        "string",
        "string",
        "string",
        "string",
        "string",
        "string"
      ],
      "appgrps": [
        "string",
        "string"
      ]
    },
    {
      "id": "string",
      "name": "string",
      "org": "string",
      "users": [
        "string",
        "string",
        "string",
        "string",
        "string",
        "string",
        "string",
        "string",
        "string"
      ],
      "active": false,
      "devices": [
        "string",
        "string",
        "string",
        "string",
        "string",
        "string",
        "string",
        "string",
        "string",
        "string"
      ],
      "zones": [
        "string",
        "string",
        "string",
        "string",
        "string",
        "string",
        "string",
        "string"
      ],
      "apps": [
        "string",
        "string",
        "string",
        "string",
        "string",
        "string"
      ],
      "sapps": "string",
      "srctype": "all",
      "source_zones": [
        "string",
        "string",
        "string",
        "string",
        "string",
        "string"
      ],
      "dsttype": "string",
      "tags": "string",
      "allow": true,
      "usergrps": [
        "string"
      ],
      "devgrps": [
        "string",
        "string",
        "string",
        "string",
        "string",
        "string"
      ],
      "appgrps": [
        "string",
        "string"
      ]
    },
    {
      "id": "string",
      "name": "string",
      "org": "string",
      "users": [
        "string",
        "string",
        "string",
        "string"
      ],
      "active": false,
      "devices": [
        "string",
        "string",
        "string"
      ],
      "zones": [
        "string",
        "string",
        "string",
        "string",
        "string"
      ],
      "apps": [
        "string",
        "string",
        "string",
        "string",
        "string",
        "string",
        "string",
        "string",
        "string",
        "string"
      ],
      "sapps": "string",
      "srctype": "all",
      "source_zones": [
        "string",
        "string",
        "string",
        "string",
        "string",
        "string",
        "string",
        "string"
      ],
      "dsttype": "string",
      "tags": "string",
      "allow": false,
      "usergrps": [
        "string",
        "string",
        "string",
        "string",
        "string",
        "string",
        "string",
        "string"
      ],
      "devgrps": [
        "string",
        "string",
        "string",
        "string",
        "string",
        "string",
        "string"
      ],
      "appgrps": [
        "string",
        "string",
        "string",
        "string",
        "string"
      ]
    },
    {
      "id": "string",
      "name": "string",
      "org": "string",
      "users": [
        "string",
        "string",
        "string",
        "string",
        "string"
      ],
      "active": true,
      "devices": [
        "string",
        "string",
        "string",
        "string",
        "string",
        "string",
        "string",
        "string",
        "string",
        "string"
      ],
      "zones": [
        "string",
        "string",
        "string",
        "string",
        "string",
        "string",
        "string",
        "string",
        "string"
      ],
      "apps": [
        "string",
        "string",
        "string"
      ],
      "sapps": "string",
      "srctype": "all",
      "source_zones": [
        "string",
        "string"
      ],
      "dsttype": "string",
      "tags": "string",
      "allow": true,
      "usergrps": [
        "string",
        "string",
        "string"
      ],
      "devgrps": [
        "string",
        "string",
        "string",
        "string",
        "string",
        "string",
        "string",
        "string"
      ],
      "appgrps": [
        "string",
        "string",
        "string"
      ]
    }
  ]
}