{
  "response": {
    "data": {
      "adminState": "UP",
      "appId": "string",
      "customAttributes": [
        {
          "attributeName": "string",
          "attributeValue": "string"
        },
        {
          "attributeName": "string",
          "attributeValue": "string"
        }
      ],
      "customAttributesTemplateId": "string",
      "externalIds": [
        {
          "context": "NODE",
          "id": "string",
          "location": [
            "string",
            "string",
            "string",
            "string",
            "string",
            "string"
          ]
        },
        {
          "context": "NFM_P",
          "id": "string",
          "location": [
            "string",
            "string",
            "string",
            "string",
            "string",
            "string",
            "string"
          ]
        },
        {
          "context": "NODE",
          "id": "string",
          "location": [
            "string",
            "string",
            "string",
            "string",
            "string",
            "string",
            "string",
            "string",
            "string",
            "string"
          ]
        },
        {
          "context": "NSP",
          "id": "string",
          "location": [
            "string",
            "string",
            "string",
            "string",
            "string",
            "string",
            "string",
            "string"
          ]
        },
        {
          "context": "NSP",
          "id": "string",
          "location": [
            "string",
            "string",
            "string",
            "string",
            "string",
            "string"
          ]
        },
        {
          "context": "NSP",
          "id": "string",
          "location": [
            "string",
            "string",
            "string",
            "string",
            "string"
          ]
        },
        {
          "context": "NFM_P",
          "id": "string",
          "location": [
            "string"
          ]
        },
        {
          "context": "MDM",
          "id": "string",
          "location": [
            "string",
            "string",
            "string",
            "string",
            "string"
          ]
        },
        {
          "context": "NSP",
          "id": "string",
          "location": [
            "string",
            "string",
            "string"
          ]
        }
      ],
      "id": "string",
      "neDeploymentState": "UNKNOWN",
      "operationalState": "UP"
    },
    "endRow": 5,
    "startRow": 10,
    "status": 3,
    "totalRows": 3
  }
}