{
  "response": {
    "data": {
      "appId": "string",
      "customAttributes": [
        {
          "attributeName": "string",
          "attributeValue": "string"
        }
      ],
      "id": "string",
      "name": "string",
      "objectDescription": "string"
    },
    "endRow": 8,
    "startRow": 6,
    "status": 4,
    "totalRows": 7
  }
}