{
  "response": {
    "data": [
      {
        "networkId": "string",
        "nodeData": {
          "nspNode": {}
        }
      },
      {
        "networkId": "string",
        "nodeData": {
          "nspNode": {}
        }
      },
      {
        "networkId": "string",
        "nodeData": {
          "nspNode": {}
        }
      },
      {
        "networkId": "string",
        "nodeData": {
          "nspNode": {}
        }
      },
      {
        "networkId": "string",
        "nodeData": {
          "nspNode": {}
        }
      },
      {
        "networkId": "string",
        "nodeData": {
          "nspNode": {}
        }
      },
      {
        "networkId": "string",
        "nodeData": {
          "nspNode": {}
        }
      }
    ],
    "endRow": 3,
    "startRow": 9,
    "status": 8,
    "totalRows": 9
  }
}