{
  "response": {
    "data": {
      "actualEndState": "Deployed",
      "adminState": "UP",
      "appId": "string",
      "bidirectional": "ASYMMETRIC_LOOSE",
      "bw": 8,
      "customAttributes": [
        {
          "attributeName": "string",
          "attributeValue": "string"
        },
        {
          "attributeName": "string",
          "attributeValue": "string"
        },
        {
          "attributeName": "string",
          "attributeValue": "string"
        },
        {
          "attributeName": "string",
          "attributeValue": "string"
        }
      ],
      "customAttributesTemplateId": "string",
      "customerId": 9,
      "description": "string",
      "endpointExtensions": [
        {
          "connectedInner": 6,
          "connectedOuter": 2,
          "connectedPortId": "string",
          "customAttributes": [
            {},
            {},
            {},
            {},
            {},
            {},
            {}
          ],
          "nniPort": {},
          "uniPort": {}
        },
        {
          "connectedInner": 4,
          "connectedOuter": 2,
          "connectedPortId": "string",
          "customAttributes": [
            {},
            {},
            {},
            {},
            {}
          ],
          "nniPort": {},
          "uniPort": {}
        },
        {
          "connectedInner": 8,
          "connectedOuter": 2,
          "connectedPortId": "string",
          "customAttributes": [
            {},
            {},
            {},
            {},
            {},
            {},
            {},
            {},
            {},
            {}
          ],
          "nniPort": {},
          "uniPort": {}
        },
        {
          "connectedInner": 4,
          "connectedOuter": 10,
          "connectedPortId": "string",
          "customAttributes": [
            {},
            {},
            {},
            {},
            {},
            {}
          ],
          "nniPort": {},
          "uniPort": {}
        },
        {
          "connectedInner": 5,
          "connectedOuter": 10,
          "connectedPortId": "string",
          "customAttributes": [
            {},
            {},
            {},
            {}
          ],
          "nniPort": {},
          "uniPort": {}
        }
      ],
      "endpoints": [
        {
          "actualEndState": "Saved",
          "adminState": "MAINTENANCE",
          "appId": "string",
          "customAttributes": [
            {},
            {},
            {},
            {},
            {}
          ],
          "customAttributesTemplateId": "string",
          "description": "string",
          "externalIds": [
            {},
            {},
            {}
          ],
          "id": "string",
          "name": "string",
          "neDeploymentState": "NA",
          "neId": "string",
          "neName": "string",
          "operationalState": "UP",
          "portAdminState": "DOWN",
          "portId": "string",
          "portName": "string",
          "portOperationalState": "UNKNOWN",
          "portSpeed": 7,
          "serviceId": "string"
        },
        {
          "actualEndState": "Deployed",
          "adminState": "MAINTENANCE",
          "appId": "string",
          "customAttributes": [
            {},
            {},
            {}
          ],
          "customAttributesTemplateId": "string",
          "description": "string",
          "externalIds": [
            {},
            {},
            {},
            {},
            {},
            {}
          ],
          "id": "string",
          "name": "string",
          "neDeploymentState": "PENDING",
          "neId": "string",
          "neName": "string",
          "operationalState": "PARTIALLY_DOWN",
          "portAdminState": "MAINTENANCE",
          "portId": "string",
          "portName": "string",
          "portOperationalState": "TRANSITION",
          "portSpeed": 10,
          "serviceId": "string"
        },
        {
          "actualEndState": "Saved",
          "adminState": "DOWN",
          "appId": "string",
          "customAttributes": [
            {},
            {},
            {},
            {},
            {},
            {},
            {}
          ],
          "customAttributesTemplateId": "string",
          "description": "string",
          "externalIds": [
            {},
            {},
            {},
            {},
            {},
            {}
          ],
          "id": "string",
          "name": "string",
          "neDeploymentState": "PENDING",
          "neId": "string",
          "neName": "string",
          "operationalState": "DOWN",
          "portAdminState": "UP",
          "portId": "string",
          "portName": "string",
          "portOperationalState": "UP",
          "portSpeed": 7,
          "serviceId": "string"
        },
        {
          "actualEndState": "Deployed",
          "adminState": "MAINTENANCE",
          "appId": "string",
          "customAttributes": [
            {}
          ],
          "customAttributesTemplateId": "string",
          "description": "string",
          "externalIds": [
            {},
            {},
            {},
            {},
            {},
            {},
            {},
            {},
            {}
          ],
          "id": "string",
          "name": "string",
          "neDeploymentState": "PENDING",
          "neId": "string",
          "neName": "string",
          "operationalState": "DOWN",
          "portAdminState": "UP",
          "portId": "string",
          "portName": "string",
          "portOperationalState": "PARTIALLY_DOWN",
          "portSpeed": 10,
          "serviceId": "string"
        },
        {
          "actualEndState": "Deployed",
          "adminState": "DOWN",
          "appId": "string",
          "customAttributes": [
            {},
            {},
            {},
            {},
            {},
            {},
            {},
            {},
            {},
            {}
          ],
          "customAttributesTemplateId": "string",
          "description": "string",
          "externalIds": [
            {},
            {},
            {},
            {},
            {},
            {},
            {},
            {},
            {},
            {}
          ],
          "id": "string",
          "name": "string",
          "neDeploymentState": "NA",
          "neId": "string",
          "neName": "string",
          "operationalState": "UNKNOWN",
          "portAdminState": "UP",
          "portId": "string",
          "portName": "string",
          "portOperationalState": "UNKNOWN",
          "portSpeed": 10,
          "serviceId": "string"
        },
        {
          "actualEndState": "Deployed",
          "adminState": "MAINTENANCE",
          "appId": "string",
          "customAttributes": [
            {},
            {},
            {},
            {},
            {},
            {},
            {},
            {},
            {}
          ],
          "customAttributesTemplateId": "string",
          "description": "string",
          "externalIds": [
            {},
            {},
            {},
            {},
            {},
            {},
            {},
            {},
            {},
            {}
          ],
          "id": "string",
          "name": "string",
          "neDeploymentState": "NA",
          "neId": "string",
          "neName": "string",
          "operationalState": "UNKNOWN",
          "portAdminState": "DOWN",
          "portId": "string",
          "portName": "string",
          "portOperationalState": "UNKNOWN",
          "portSpeed": 1,
          "serviceId": "string"
        },
        {
          "actualEndState": "Saved",
          "adminState": "DOWN",
          "appId": "string",
          "customAttributes": [
            {}
          ],
          "customAttributesTemplateId": "string",
          "description": "string",
          "externalIds": [
            {},
            {},
            {},
            {},
            {},
            {},
            {},
            {},
            {}
          ],
          "id": "string",
          "name": "string",
          "neDeploymentState": "FAILED",
          "neId": "string",
          "neName": "string",
          "operationalState": "DOWN",
          "portAdminState": "DOWN",
          "portId": "string",
          "portName": "string",
          "portOperationalState": "DEGRADED",
          "portSpeed": 7,
          "serviceId": "string"
        },
        {
          "actualEndState": "Saved",
          "adminState": "DOWN",
          "appId": "string",
          "customAttributes": [
            {},
            {},
            {},
            {}
          ],
          "customAttributesTemplateId": "string",
          "description": "string",
          "externalIds": [
            {},
            {},
            {},
            {},
            {},
            {},
            {},
            {}
          ],
          "id": "string",
          "name": "string",
          "neDeploymentState": "NA",
          "neId": "string",
          "neName": "string",
          "operationalState": "DEGRADED",
          "portAdminState": "DOWN",
          "portId": "string",
          "portName": "string",
          "portOperationalState": "TRANSITION",
          "portSpeed": 2,
          "serviceId": "string"
        },
        {
          "actualEndState": "Saved",
          "adminState": "UP",
          "appId": "string",
          "customAttributes": [
            {},
            {},
            {},
            {},
            {},
            {},
            {}
          ],
          "customAttributesTemplateId": "string",
          "description": "string",
          "externalIds": [
            {},
            {},
            {},
            {},
            {}
          ],
          "id": "string",
          "name": "string",
          "neDeploymentState": "PENDING",
          "neId": "string",
          "neName": "string",
          "operationalState": "DEGRADED",
          "portAdminState": "MAINTENANCE",
          "portId": "string",
          "portName": "string",
          "portOperationalState": "DEGRADED",
          "portSpeed": 3,
          "serviceId": "string"
        },
        {
          "actualEndState": "Deployed",
          "adminState": "UP",
          "appId": "string",
          "customAttributes": [
            {},
            {}
          ],
          "customAttributesTemplateId": "string",
          "description": "string",
          "externalIds": [
            {},
            {}
          ],
          "id": "string",
          "name": "string",
          "neDeploymentState": "FAILED",
          "neId": "string",
          "neName": "string",
          "operationalState": "PARTIALLY_DOWN",
          "portAdminState": "DOWN",
          "portId": "string",
          "portName": "string",
          "portOperationalState": "PARTIALLY_DOWN",
          "portSpeed": 10,
          "serviceId": "string"
        }
      ],
      "externalIds": [
        {
          "context": "NFM_P",
          "id": "string",
          "location": [
            "string",
            "string",
            "string",
            "string"
          ]
        },
        {
          "context": "NODE",
          "id": "string",
          "location": [
            "string",
            "string",
            "string",
            "string",
            "string",
            "string",
            "string"
          ]
        }
      ],
      "groupId": "string",
      "id": "string",
      "lifeCycle": {
        "phase": "Activation",
        "reason": "string",
        "state": "Planned"
      },
      "maxCost": 9,
      "maxHops": 5,
      "maxLatency": 4,
      "name": "string",
      "neDeploymentState": "UNKNOWN",
      "nodeServiceId": 8,
      "objective": "LATENCY",
      "operationalState": "PARTIALLY_DOWN",
      "pathProfileId": "string",
      "requestedEndState": "Deployed",
      "reverseBW": 6,
      "serviceType": "CLINE",
      "templateId": "string",
      "tunnelSelectionId": "string"
    },
    "endRow": 3,
    "startRow": 6,
    "status": 10,
    "totalRows": 7
  }
}