{
  "response": {
    "data": [
      {
        "appId": "string",
        "id": "string",
        "maxAssignedForRd": 6,
        "maxAssignedForRt": 9,
        "maxAssignedForRtExtranet": 3,
        "minAssignedForRd": 6,
        "minAssignedForRt": 1,
        "minAssignedForRtExtranet": 8,
        "name": "string",
        "networkASForRd": true,
        "networkASForRt": true,
        "networkASForRtExtranet": true,
        "objectDescription": "string",
        "policyType": "RD_AND_RT",
        "rdAS": 10,
        "rdType": 2,
        "rtAS": 8,
        "rtExtranetAS": 4,
        "rtExtranetType": 2,
        "rtType": 6
      },
      {
        "appId": "string",
        "id": "string",
        "maxAssignedForRd": 1,
        "maxAssignedForRt": 8,
        "maxAssignedForRtExtranet": 5,
        "minAssignedForRd": 9,
        "minAssignedForRt": 2,
        "minAssignedForRtExtranet": 1,
        "name": "string",
        "networkASForRd": false,
        "networkASForRt": true,
        "networkASForRtExtranet": false,
        "objectDescription": "string",
        "policyType": "RD_AND_RT",
        "rdAS": 3,
        "rdType": 10,
        "rtAS": 3,
        "rtExtranetAS": 9,
        "rtExtranetType": 5,
        "rtType": 8
      },
      {
        "appId": "string",
        "id": "string",
        "maxAssignedForRd": 2,
        "maxAssignedForRt": 3,
        "maxAssignedForRtExtranet": 2,
        "minAssignedForRd": 1,
        "minAssignedForRt": 3,
        "minAssignedForRtExtranet": 7,
        "name": "string",
        "networkASForRd": false,
        "networkASForRt": false,
        "networkASForRtExtranet": false,
        "objectDescription": "string",
        "policyType": "RD_AND_RT",
        "rdAS": 9,
        "rdType": 3,
        "rtAS": 8,
        "rtExtranetAS": 4,
        "rtExtranetType": 10,
        "rtType": 8
      },
      {
        "appId": "string",
        "id": "string",
        "maxAssignedForRd": 8,
        "maxAssignedForRt": 4,
        "maxAssignedForRtExtranet": 8,
        "minAssignedForRd": 6,
        "minAssignedForRt": 2,
        "minAssignedForRtExtranet": 10,
        "name": "string",
        "networkASForRd": false,
        "networkASForRt": false,
        "networkASForRtExtranet": true,
        "objectDescription": "string",
        "policyType": "RD_AND_RT",
        "rdAS": 10,
        "rdType": 10,
        "rtAS": 1,
        "rtExtranetAS": 5,
        "rtExtranetType": 8,
        "rtType": 6
      },
      {
        "appId": "string",
        "id": "string",
        "maxAssignedForRd": 10,
        "maxAssignedForRt": 1,
        "maxAssignedForRtExtranet": 10,
        "minAssignedForRd": 2,
        "minAssignedForRt": 10,
        "minAssignedForRtExtranet": 10,
        "name": "string",
        "networkASForRd": true,
        "networkASForRt": false,
        "networkASForRtExtranet": false,
        "objectDescription": "string",
        "policyType": "RT_EXTRANET_ONLY",
        "rdAS": 7,
        "rdType": 7,
        "rtAS": 5,
        "rtExtranetAS": 5,
        "rtExtranetType": 6,
        "rtType": 3
      },
      {
        "appId": "string",
        "id": "string",
        "maxAssignedForRd": 1,
        "maxAssignedForRt": 8,
        "maxAssignedForRtExtranet": 8,
        "minAssignedForRd": 5,
        "minAssignedForRt": 8,
        "minAssignedForRtExtranet": 3,
        "name": "string",
        "networkASForRd": false,
        "networkASForRt": false,
        "networkASForRtExtranet": true,
        "objectDescription": "string",
        "policyType": "RT_EXTRANET_ONLY",
        "rdAS": 7,
        "rdType": 7,
        "rtAS": 7,
        "rtExtranetAS": 7,
        "rtExtranetType": 6,
        "rtType": 9
      },
      {
        "appId": "string",
        "id": "string",
        "maxAssignedForRd": 7,
        "maxAssignedForRt": 5,
        "maxAssignedForRtExtranet": 7,
        "minAssignedForRd": 2,
        "minAssignedForRt": 8,
        "minAssignedForRtExtranet": 8,
        "name": "string",
        "networkASForRd": true,
        "networkASForRt": false,
        "networkASForRtExtranet": false,
        "objectDescription": "string",
        "policyType": "RD_ONLY",
        "rdAS": 7,
        "rdType": 7,
        "rtAS": 6,
        "rtExtranetAS": 9,
        "rtExtranetType": 7,
        "rtType": 1
      },
      {
        "appId": "string",
        "id": "string",
        "maxAssignedForRd": 6,
        "maxAssignedForRt": 7,
        "maxAssignedForRtExtranet": 6,
        "minAssignedForRd": 7,
        "minAssignedForRt": 3,
        "minAssignedForRtExtranet": 9,
        "name": "string",
        "networkASForRd": true,
        "networkASForRt": false,
        "networkASForRtExtranet": true,
        "objectDescription": "string",
        "policyType": "RT_EXTRANET_ONLY",
        "rdAS": 1,
        "rdType": 7,
        "rtAS": 3,
        "rtExtranetAS": 3,
        "rtExtranetType": 8,
        "rtType": 2
      },
      {
        "appId": "string",
        "id": "string",
        "maxAssignedForRd": 4,
        "maxAssignedForRt": 9,
        "maxAssignedForRtExtranet": 5,
        "minAssignedForRd": 10,
        "minAssignedForRt": 4,
        "minAssignedForRtExtranet": 9,
        "name": "string",
        "networkASForRd": true,
        "networkASForRt": true,
        "networkASForRtExtranet": false,
        "objectDescription": "string",
        "policyType": "RD_ONLY",
        "rdAS": 9,
        "rdType": 3,
        "rtAS": 10,
        "rtExtranetAS": 3,
        "rtExtranetType": 3,
        "rtType": 3
      },
      {
        "appId": "string",
        "id": "string",
        "maxAssignedForRd": 4,
        "maxAssignedForRt": 8,
        "maxAssignedForRtExtranet": 5,
        "minAssignedForRd": 9,
        "minAssignedForRt": 4,
        "minAssignedForRtExtranet": 4,
        "name": "string",
        "networkASForRd": false,
        "networkASForRt": false,
        "networkASForRtExtranet": false,
        "objectDescription": "string",
        "policyType": "RT_ONLY",
        "rdAS": 3,
        "rdType": 5,
        "rtAS": 10,
        "rtExtranetAS": 6,
        "rtExtranetType": 4,
        "rtType": 6
      }
    ],
    "endRow": 9,
    "startRow": 3,
    "status": 4,
    "totalRows": 10
  }
}