{
  "response": {
    "data": {
      "appId": "string",
      "customAttributes": [
        {
          "attributeName": "string",
          "attributeValue": "string"
        },
        {
          "attributeName": "string",
          "attributeValue": "string"
        },
        {
          "attributeName": "string",
          "attributeValue": "string"
        },
        {
          "attributeName": "string",
          "attributeValue": "string"
        },
        {
          "attributeName": "string",
          "attributeValue": "string"
        },
        {
          "attributeName": "string",
          "attributeValue": "string"
        }
      ],
      "id": "string",
      "name": "string",
      "objectDescription": "string"
    },
    "endRow": 6,
    "startRow": 1,
    "status": 7,
    "totalRows": 3
  }
}