{
  "response": {
    "data": {
      "adminState": "UP",
      "appId": "string",
      "bidirectional": "ASYMMETRIC_LOOSE",
      "cemUseRtpHeader": true,
      "customerId": 5,
      "id": "string",
      "maxCost": 7,
      "maxHops": 8,
      "maxLatency": 7,
      "mediationProfileId": "string",
      "meta": [
        "string",
        "string",
        "string",
        "string",
        "string"
      ],
      "monitorBandwidth": true,
      "mtu": 10,
      "name": "string",
      "objectDescription": "string",
      "objective": "DISTANCE",
      "portFilter": [
        {
          "condition1": {
            "operator": "string",
            "value": "string"
          },
          "condition2": {
            "operator": "string",
            "value": "string"
          },
          "connector": "string",
          "groupNum": 3,
          "name": "string",
          "operator": "string"
        },
        {
          "condition1": {
            "operator": "string",
            "value": "string"
          },
          "condition2": {
            "operator": "string",
            "value": "string"
          },
          "connector": "string",
          "groupNum": 9,
          "name": "string",
          "operator": "string"
        },
        {
          "condition1": {
            "operator": "string",
            "value": "string"
          },
          "condition2": {
            "operator": "string",
            "value": "string"
          },
          "connector": "string",
          "groupNum": 7,
          "name": "string",
          "operator": "string"
        },
        {
          "condition1": {
            "operator": "string",
            "value": "string"
          },
          "condition2": {
            "operator": "string",
            "value": "string"
          },
          "connector": "string",
          "groupNum": 9,
          "name": "string",
          "operator": "string"
        },
        {
          "condition1": {
            "operator": "string",
            "value": "string"
          },
          "condition2": {
            "operator": "string",
            "value": "string"
          },
          "connector": "string",
          "groupNum": 2,
          "name": "string",
          "operator": "string"
        },
        {
          "condition1": {
            "operator": "string",
            "value": "string"
          },
          "condition2": {
            "operator": "string",
            "value": "string"
          },
          "connector": "string",
          "groupNum": 1,
          "name": "string",
          "operator": "string"
        },
        {
          "condition1": {
            "operator": "string",
            "value": "string"
          },
          "condition2": {
            "operator": "string",
            "value": "string"
          },
          "connector": "string",
          "groupNum": 3,
          "name": "string",
          "operator": "string"
        },
        {
          "condition1": {
            "operator": "string",
            "value": "string"
          },
          "condition2": {
            "operator": "string",
            "value": "string"
          },
          "connector": "string",
          "groupNum": 2,
          "name": "string",
          "operator": "string"
        }
      ],
      "qosId": "string",
      "qosName": "string",
      "tunnelSelectionId": "string",
      "vcType": "SATOP_T1",
      "workflowProfileId": "string",
      "workflowValidate": "string"
    },
    "endRow": 2,
    "startRow": 9,
    "status": 8,
    "totalRows": 5
  }
}