{
  "response": {
    "data": {
      "actualEndState": "Saved",
      "adminState": "UP",
      "appId": "string",
      "bidirectional": "SYMMETRIC_LOOSE",
      "bw": 6,
      "customAttributes": [
        {
          "attributeName": "string",
          "attributeValue": "string"
        },
        {
          "attributeName": "string",
          "attributeValue": "string"
        }
      ],
      "customAttributesTemplateId": "string",
      "customerId": 2,
      "description": "string",
      "endpointExtensions": [
        {
          "connectedInner": 2,
          "connectedOuter": 10,
          "connectedPortId": "string",
          "customAttributes": [
            {},
            {}
          ],
          "nniPort": {},
          "uniPort": {}
        },
        {
          "connectedInner": 9,
          "connectedOuter": 9,
          "connectedPortId": "string",
          "customAttributes": [
            {},
            {},
            {},
            {},
            {},
            {},
            {}
          ],
          "nniPort": {},
          "uniPort": {}
        },
        {
          "connectedInner": 5,
          "connectedOuter": 3,
          "connectedPortId": "string",
          "customAttributes": [
            {}
          ],
          "nniPort": {},
          "uniPort": {}
        },
        {
          "connectedInner": 7,
          "connectedOuter": 4,
          "connectedPortId": "string",
          "customAttributes": [
            {},
            {},
            {},
            {}
          ],
          "nniPort": {},
          "uniPort": {}
        },
        {
          "connectedInner": 10,
          "connectedOuter": 1,
          "connectedPortId": "string",
          "customAttributes": [
            {},
            {},
            {},
            {}
          ],
          "nniPort": {},
          "uniPort": {}
        },
        {
          "connectedInner": 7,
          "connectedOuter": 7,
          "connectedPortId": "string",
          "customAttributes": [
            {},
            {}
          ],
          "nniPort": {},
          "uniPort": {}
        },
        {
          "connectedInner": 1,
          "connectedOuter": 3,
          "connectedPortId": "string",
          "customAttributes": [
            {},
            {},
            {}
          ],
          "nniPort": {},
          "uniPort": {}
        },
        {
          "connectedInner": 2,
          "connectedOuter": 5,
          "connectedPortId": "string",
          "customAttributes": [
            {}
          ],
          "nniPort": {},
          "uniPort": {}
        },
        {
          "connectedInner": 3,
          "connectedOuter": 7,
          "connectedPortId": "string",
          "customAttributes": [
            {},
            {},
            {},
            {},
            {},
            {},
            {},
            {},
            {},
            {}
          ],
          "nniPort": {},
          "uniPort": {}
        }
      ],
      "endpoints": [
        {
          "actualEndState": "Saved",
          "adminState": "DOWN",
          "appId": "string",
          "customAttributes": [
            {},
            {}
          ],
          "customAttributesTemplateId": "string",
          "description": "string",
          "externalIds": [
            {},
            {},
            {},
            {},
            {},
            {},
            {},
            {},
            {}
          ],
          "id": "string",
          "name": "string",
          "neDeploymentState": "DEPLOYED",
          "neId": "string",
          "neName": "string",
          "operationalState": "PARTIALLY_DOWN",
          "portAdminState": "MAINTENANCE",
          "portId": "string",
          "portName": "string",
          "portOperationalState": "DEGRADED",
          "portSpeed": 9,
          "serviceId": "string"
        },
        {
          "actualEndState": "Saved",
          "adminState": "UP",
          "appId": "string",
          "customAttributes": [
            {},
            {},
            {},
            {}
          ],
          "customAttributesTemplateId": "string",
          "description": "string",
          "externalIds": [
            {},
            {},
            {}
          ],
          "id": "string",
          "name": "string",
          "neDeploymentState": "DEPLOYED",
          "neId": "string",
          "neName": "string",
          "operationalState": "PARTIALLY_DOWN",
          "portAdminState": "DOWN",
          "portId": "string",
          "portName": "string",
          "portOperationalState": "UNKNOWN",
          "portSpeed": 4,
          "serviceId": "string"
        },
        {
          "actualEndState": "Deployed",
          "adminState": "MAINTENANCE",
          "appId": "string",
          "customAttributes": [
            {},
            {},
            {},
            {}
          ],
          "customAttributesTemplateId": "string",
          "description": "string",
          "externalIds": [
            {},
            {},
            {},
            {}
          ],
          "id": "string",
          "name": "string",
          "neDeploymentState": "PENDING",
          "neId": "string",
          "neName": "string",
          "operationalState": "DEGRADED",
          "portAdminState": "MAINTENANCE",
          "portId": "string",
          "portName": "string",
          "portOperationalState": "UP",
          "portSpeed": 1,
          "serviceId": "string"
        },
        {
          "actualEndState": "Saved",
          "adminState": "MAINTENANCE",
          "appId": "string",
          "customAttributes": [
            {},
            {},
            {},
            {},
            {},
            {},
            {}
          ],
          "customAttributesTemplateId": "string",
          "description": "string",
          "externalIds": [
            {},
            {},
            {}
          ],
          "id": "string",
          "name": "string",
          "neDeploymentState": "FAILED",
          "neId": "string",
          "neName": "string",
          "operationalState": "UP",
          "portAdminState": "MAINTENANCE",
          "portId": "string",
          "portName": "string",
          "portOperationalState": "UP",
          "portSpeed": 9,
          "serviceId": "string"
        },
        {
          "actualEndState": "Saved",
          "adminState": "DOWN",
          "appId": "string",
          "customAttributes": [
            {},
            {},
            {},
            {},
            {}
          ],
          "customAttributesTemplateId": "string",
          "description": "string",
          "externalIds": [
            {}
          ],
          "id": "string",
          "name": "string",
          "neDeploymentState": "NA",
          "neId": "string",
          "neName": "string",
          "operationalState": "DOWN",
          "portAdminState": "DOWN",
          "portId": "string",
          "portName": "string",
          "portOperationalState": "UP",
          "portSpeed": 3,
          "serviceId": "string"
        },
        {
          "actualEndState": "Saved",
          "adminState": "DOWN",
          "appId": "string",
          "customAttributes": [
            {},
            {},
            {},
            {},
            {},
            {},
            {}
          ],
          "customAttributesTemplateId": "string",
          "description": "string",
          "externalIds": [
            {}
          ],
          "id": "string",
          "name": "string",
          "neDeploymentState": "FAILED",
          "neId": "string",
          "neName": "string",
          "operationalState": "DOWN",
          "portAdminState": "UP",
          "portId": "string",
          "portName": "string",
          "portOperationalState": "TRANSITION",
          "portSpeed": 5,
          "serviceId": "string"
        }
      ],
      "externalIds": [
        {
          "context": "NSP",
          "id": "string",
          "location": [
            "string",
            "string"
          ]
        },
        {
          "context": "MDM",
          "id": "string",
          "location": [
            "string",
            "string",
            "string",
            "string",
            "string",
            "string",
            "string"
          ]
        },
        {
          "context": "NODE",
          "id": "string",
          "location": [
            "string"
          ]
        },
        {
          "context": "NSP",
          "id": "string",
          "location": [
            "string",
            "string",
            "string",
            "string",
            "string",
            "string",
            "string",
            "string",
            "string"
          ]
        },
        {
          "context": "NFM_T",
          "id": "string",
          "location": [
            "string",
            "string",
            "string"
          ]
        },
        {
          "context": "NSP",
          "id": "string",
          "location": [
            "string"
          ]
        },
        {
          "context": "MDM",
          "id": "string",
          "location": [
            "string"
          ]
        },
        {
          "context": "MDM",
          "id": "string",
          "location": [
            "string",
            "string",
            "string",
            "string",
            "string",
            "string",
            "string",
            "string",
            "string"
          ]
        },
        {
          "context": "MDM",
          "id": "string",
          "location": [
            "string",
            "string",
            "string",
            "string",
            "string",
            "string"
          ]
        }
      ],
      "groupId": "string",
      "id": "string",
      "lifeCycle": {
        "phase": "Activation",
        "reason": "string",
        "state": "RoutedAndSaved"
      },
      "maxCost": 2,
      "maxHops": 7,
      "maxLatency": 5,
      "name": "string",
      "neDeploymentState": "PENDING",
      "nodeServiceId": 7,
      "objective": "STAR_WEIGHT",
      "operationalState": "UP",
      "pathProfileId": "string",
      "requestedEndState": "Deployed",
      "reverseBW": 1,
      "serviceType": "L3_VPN",
      "templateId": "string",
      "tunnelSelectionId": "string"
    },
    "endRow": 5,
    "startRow": 2,
    "status": 8,
    "totalRows": 9
  }
}