{
  "response": {
    "data": [
      {
        "actualEndState": "Saved",
        "adminState": "UP",
        "appId": "string",
        "bidirectional": "ANY_REVERSE_ROUTE",
        "bw": 3,
        "customAttributes": [
          {
            "attributeName": "string",
            "attributeValue": "string"
          }
        ],
        "customAttributesTemplateId": "string",
        "customerId": 10,
        "description": "string",
        "endpointExtensions": [
          {
            "connectedInner": 6,
            "connectedOuter": 4,
            "connectedPortId": "string",
            "customAttributes": [
              {},
              {},
              {},
              {},
              {},
              {}
            ],
            "nniPort": {},
            "uniPort": {}
          },
          {
            "connectedInner": 5,
            "connectedOuter": 1,
            "connectedPortId": "string",
            "customAttributes": [
              {},
              {}
            ],
            "nniPort": {},
            "uniPort": {}
          },
          {
            "connectedInner": 9,
            "connectedOuter": 3,
            "connectedPortId": "string",
            "customAttributes": [
              {},
              {},
              {},
              {},
              {},
              {}
            ],
            "nniPort": {},
            "uniPort": {}
          },
          {
            "connectedInner": 4,
            "connectedOuter": 2,
            "connectedPortId": "string",
            "customAttributes": [
              {}
            ],
            "nniPort": {},
            "uniPort": {}
          },
          {
            "connectedInner": 3,
            "connectedOuter": 5,
            "connectedPortId": "string",
            "customAttributes": [
              {}
            ],
            "nniPort": {},
            "uniPort": {}
          }
        ],
        "endpoints": [
          {
            "actualEndState": "Saved",
            "adminState": "MAINTENANCE",
            "appId": "string",
            "customAttributes": [
              {},
              {},
              {},
              {},
              {},
              {}
            ],
            "customAttributesTemplateId": "string",
            "description": "string",
            "externalIds": [
              {},
              {},
              {},
              {},
              {},
              {},
              {}
            ],
            "id": "string",
            "name": "string",
            "neDeploymentState": "NA",
            "neId": "string",
            "neName": "string",
            "operationalState": "UNKNOWN",
            "portAdminState": "MAINTENANCE",
            "portId": "string",
            "portName": "string",
            "portOperationalState": "UNKNOWN",
            "portSpeed": 2,
            "serviceId": "string"
          },
          {
            "actualEndState": "Deployed",
            "adminState": "DOWN",
            "appId": "string",
            "customAttributes": [
              {},
              {},
              {},
              {},
              {},
              {},
              {},
              {}
            ],
            "customAttributesTemplateId": "string",
            "description": "string",
            "externalIds": [
              {},
              {}
            ],
            "id": "string",
            "name": "string",
            "neDeploymentState": "UNKNOWN",
            "neId": "string",
            "neName": "string",
            "operationalState": "DEGRADED",
            "portAdminState": "MAINTENANCE",
            "portId": "string",
            "portName": "string",
            "portOperationalState": "DEGRADED",
            "portSpeed": 7,
            "serviceId": "string"
          },
          {
            "actualEndState": "Deployed",
            "adminState": "DOWN",
            "appId": "string",
            "customAttributes": [
              {},
              {},
              {}
            ],
            "customAttributesTemplateId": "string",
            "description": "string",
            "externalIds": [
              {},
              {},
              {},
              {},
              {},
              {},
              {},
              {},
              {},
              {}
            ],
            "id": "string",
            "name": "string",
            "neDeploymentState": "FAILED",
            "neId": "string",
            "neName": "string",
            "operationalState": "TRANSITION",
            "portAdminState": "UP",
            "portId": "string",
            "portName": "string",
            "portOperationalState": "UNKNOWN",
            "portSpeed": 10,
            "serviceId": "string"
          }
        ],
        "externalIds": [
          {
            "context": "NODE",
            "id": "string",
            "location": [
              "string",
              "string",
              "string",
              "string",
              "string",
              "string",
              "string",
              "string",
              "string",
              "string"
            ]
          },
          {
            "context": "NFM_P",
            "id": "string",
            "location": [
              "string"
            ]
          },
          {
            "context": "NSP",
            "id": "string",
            "location": [
              "string",
              "string",
              "string",
              "string",
              "string",
              "string"
            ]
          },
          {
            "context": "MDM",
            "id": "string",
            "location": [
              "string",
              "string",
              "string",
              "string",
              "string",
              "string"
            ]
          }
        ],
        "groupId": "string",
        "id": "string",
        "lifeCycle": {
          "phase": "Activation",
          "reason": "string",
          "state": "WaitingForDeployment"
        },
        "maxCost": 3,
        "maxHops": 6,
        "maxLatency": 7,
        "name": "string",
        "neDeploymentState": "FAILED",
        "nodeServiceId": 8,
        "objective": "LATENCY",
        "operationalState": "UP",
        "pathProfileId": "string",
        "requestedEndState": "Deployed",
        "reverseBW": 10,
        "serviceType": "L2_EXTENSION_NNI",
        "templateId": "string",
        "tunnelSelectionId": "string"
      },
      {
        "actualEndState": "Deployed",
        "adminState": "UP",
        "appId": "string",
        "bidirectional": "SYMMETRIC_STRICT",
        "bw": 6,
        "customAttributes": [
          {
            "attributeName": "string",
            "attributeValue": "string"
          },
          {
            "attributeName": "string",
            "attributeValue": "string"
          }
        ],
        "customAttributesTemplateId": "string",
        "customerId": 7,
        "description": "string",
        "endpointExtensions": [
          {
            "connectedInner": 8,
            "connectedOuter": 7,
            "connectedPortId": "string",
            "customAttributes": [
              {},
              {},
              {},
              {}
            ],
            "nniPort": {},
            "uniPort": {}
          },
          {
            "connectedInner": 3,
            "connectedOuter": 2,
            "connectedPortId": "string",
            "customAttributes": [
              {}
            ],
            "nniPort": {},
            "uniPort": {}
          },
          {
            "connectedInner": 3,
            "connectedOuter": 7,
            "connectedPortId": "string",
            "customAttributes": [
              {},
              {},
              {},
              {},
              {}
            ],
            "nniPort": {},
            "uniPort": {}
          },
          {
            "connectedInner": 10,
            "connectedOuter": 7,
            "connectedPortId": "string",
            "customAttributes": [
              {},
              {},
              {},
              {},
              {},
              {},
              {},
              {},
              {}
            ],
            "nniPort": {},
            "uniPort": {}
          },
          {
            "connectedInner": 9,
            "connectedOuter": 7,
            "connectedPortId": "string",
            "customAttributes": [
              {},
              {},
              {}
            ],
            "nniPort": {},
            "uniPort": {}
          },
          {
            "connectedInner": 5,
            "connectedOuter": 10,
            "connectedPortId": "string",
            "customAttributes": [
              {},
              {},
              {}
            ],
            "nniPort": {},
            "uniPort": {}
          },
          {
            "connectedInner": 3,
            "connectedOuter": 7,
            "connectedPortId": "string",
            "customAttributes": [
              {},
              {},
              {},
              {},
              {},
              {},
              {},
              {},
              {}
            ],
            "nniPort": {},
            "uniPort": {}
          }
        ],
        "endpoints": [
          {
            "actualEndState": "Saved",
            "adminState": "UP",
            "appId": "string",
            "customAttributes": [
              {}
            ],
            "customAttributesTemplateId": "string",
            "description": "string",
            "externalIds": [
              {},
              {},
              {},
              {}
            ],
            "id": "string",
            "name": "string",
            "neDeploymentState": "NA",
            "neId": "string",
            "neName": "string",
            "operationalState": "UNKNOWN",
            "portAdminState": "UP",
            "portId": "string",
            "portName": "string",
            "portOperationalState": "PARTIALLY_DOWN",
            "portSpeed": 8,
            "serviceId": "string"
          },
          {
            "actualEndState": "Saved",
            "adminState": "UP",
            "appId": "string",
            "customAttributes": [
              {},
              {},
              {},
              {},
              {},
              {},
              {},
              {},
              {},
              {}
            ],
            "customAttributesTemplateId": "string",
            "description": "string",
            "externalIds": [
              {},
              {},
              {}
            ],
            "id": "string",
            "name": "string",
            "neDeploymentState": "PENDING",
            "neId": "string",
            "neName": "string",
            "operationalState": "DEGRADED",
            "portAdminState": "MAINTENANCE",
            "portId": "string",
            "portName": "string",
            "portOperationalState": "DOWN",
            "portSpeed": 4,
            "serviceId": "string"
          },
          {
            "actualEndState": "Saved",
            "adminState": "MAINTENANCE",
            "appId": "string",
            "customAttributes": [
              {},
              {},
              {},
              {}
            ],
            "customAttributesTemplateId": "string",
            "description": "string",
            "externalIds": [
              {},
              {},
              {},
              {},
              {},
              {},
              {},
              {}
            ],
            "id": "string",
            "name": "string",
            "neDeploymentState": "FAILED",
            "neId": "string",
            "neName": "string",
            "operationalState": "UP",
            "portAdminState": "UP",
            "portId": "string",
            "portName": "string",
            "portOperationalState": "TRANSITION",
            "portSpeed": 6,
            "serviceId": "string"
          }
        ],
        "externalIds": [
          {
            "context": "MDM",
            "id": "string",
            "location": [
              "string",
              "string",
              "string",
              "string",
              "string",
              "string",
              "string"
            ]
          }
        ],
        "groupId": "string",
        "id": "string",
        "lifeCycle": {
          "phase": "Planning",
          "reason": "string",
          "state": "WaitingForDeployment"
        },
        "maxCost": 3,
        "maxHops": 3,
        "maxLatency": 6,
        "name": "string",
        "neDeploymentState": "DEPLOYED",
        "nodeServiceId": 8,
        "objective": "COST",
        "operationalState": "UNKNOWN",
        "pathProfileId": "string",
        "requestedEndState": "Deployed",
        "reverseBW": 6,
        "serviceType": "ODU",
        "templateId": "string",
        "tunnelSelectionId": "string"
      },
      {
        "actualEndState": "Deployed",
        "adminState": "DOWN",
        "appId": "string",
        "bidirectional": "SYMMETRIC_LOOSE",
        "bw": 1,
        "customAttributes": [
          {
            "attributeName": "string",
            "attributeValue": "string"
          },
          {
            "attributeName": "string",
            "attributeValue": "string"
          },
          {
            "attributeName": "string",
            "attributeValue": "string"
          },
          {
            "attributeName": "string",
            "attributeValue": "string"
          },
          {
            "attributeName": "string",
            "attributeValue": "string"
          },
          {
            "attributeName": "string",
            "attributeValue": "string"
          },
          {
            "attributeName": "string",
            "attributeValue": "string"
          },
          {
            "attributeName": "string",
            "attributeValue": "string"
          }
        ],
        "customAttributesTemplateId": "string",
        "customerId": 7,
        "description": "string",
        "endpointExtensions": [
          {
            "connectedInner": 5,
            "connectedOuter": 7,
            "connectedPortId": "string",
            "customAttributes": [
              {}
            ],
            "nniPort": {},
            "uniPort": {}
          },
          {
            "connectedInner": 10,
            "connectedOuter": 4,
            "connectedPortId": "string",
            "customAttributes": [
              {},
              {},
              {},
              {},
              {},
              {},
              {},
              {},
              {},
              {}
            ],
            "nniPort": {},
            "uniPort": {}
          },
          {
            "connectedInner": 3,
            "connectedOuter": 7,
            "connectedPortId": "string",
            "customAttributes": [
              {},
              {},
              {},
              {},
              {},
              {},
              {},
              {},
              {},
              {}
            ],
            "nniPort": {},
            "uniPort": {}
          }
        ],
        "endpoints": [
          {
            "actualEndState": "Deployed",
            "adminState": "MAINTENANCE",
            "appId": "string",
            "customAttributes": [
              {}
            ],
            "customAttributesTemplateId": "string",
            "description": "string",
            "externalIds": [
              {},
              {},
              {},
              {},
              {},
              {},
              {},
              {},
              {},
              {}
            ],
            "id": "string",
            "name": "string",
            "neDeploymentState": "NA",
            "neId": "string",
            "neName": "string",
            "operationalState": "DEGRADED",
            "portAdminState": "UP",
            "portId": "string",
            "portName": "string",
            "portOperationalState": "DOWN",
            "portSpeed": 2,
            "serviceId": "string"
          },
          {
            "actualEndState": "Deployed",
            "adminState": "UP",
            "appId": "string",
            "customAttributes": [
              {},
              {},
              {},
              {},
              {},
              {},
              {}
            ],
            "customAttributesTemplateId": "string",
            "description": "string",
            "externalIds": [
              {},
              {},
              {}
            ],
            "id": "string",
            "name": "string",
            "neDeploymentState": "PENDING",
            "neId": "string",
            "neName": "string",
            "operationalState": "DOWN",
            "portAdminState": "MAINTENANCE",
            "portId": "string",
            "portName": "string",
            "portOperationalState": "UP",
            "portSpeed": 8,
            "serviceId": "string"
          }
        ],
        "externalIds": [
          {
            "context": "NODE",
            "id": "string",
            "location": [
              "string",
              "string",
              "string",
              "string",
              "string",
              "string",
              "string"
            ]
          },
          {
            "context": "NSP",
            "id": "string",
            "location": [
              "string",
              "string",
              "string"
            ]
          },
          {
            "context": "NODE",
            "id": "string",
            "location": [
              "string",
              "string",
              "string",
              "string",
              "string",
              "string",
              "string",
              "string",
              "string",
              "string"
            ]
          },
          {
            "context": "NSP",
            "id": "string",
            "location": [
              "string",
              "string",
              "string"
            ]
          },
          {
            "context": "NODE",
            "id": "string",
            "location": [
              "string",
              "string",
              "string",
              "string",
              "string",
              "string",
              "string"
            ]
          },
          {
            "context": "MDM",
            "id": "string",
            "location": [
              "string",
              "string",
              "string",
              "string"
            ]
          },
          {
            "context": "NFM_P",
            "id": "string",
            "location": [
              "string",
              "string",
              "string",
              "string",
              "string",
              "string",
              "string"
            ]
          },
          {
            "context": "NSP",
            "id": "string",
            "location": [
              "string",
              "string",
              "string",
              "string",
              "string",
              "string",
              "string",
              "string",
              "string",
              "string"
            ]
          },
          {
            "context": "NFM_P",
            "id": "string",
            "location": [
              "string",
              "string",
              "string",
              "string",
              "string",
              "string",
              "string",
              "string",
              "string"
            ]
          }
        ],
        "groupId": "string",
        "id": "string",
        "lifeCycle": {
          "phase": "Creation",
          "reason": "string",
          "state": "WaitingForDeployment"
        },
        "maxCost": 10,
        "maxHops": 5,
        "maxLatency": 5,
        "name": "string",
        "neDeploymentState": "UNKNOWN",
        "nodeServiceId": 6,
        "objective": "DISTANCE",
        "operationalState": "DOWN",
        "pathProfileId": "string",
        "requestedEndState": "Saved",
        "reverseBW": 10,
        "serviceType": "PHYSICAL_LINK",
        "templateId": "string",
        "tunnelSelectionId": "string"
      },
      {
        "actualEndState": "Saved",
        "adminState": "DOWN",
        "appId": "string",
        "bidirectional": "SYMMETRIC_LOOSE",
        "bw": 3,
        "customAttributes": [
          {
            "attributeName": "string",
            "attributeValue": "string"
          },
          {
            "attributeName": "string",
            "attributeValue": "string"
          },
          {
            "attributeName": "string",
            "attributeValue": "string"
          },
          {
            "attributeName": "string",
            "attributeValue": "string"
          },
          {
            "attributeName": "string",
            "attributeValue": "string"
          },
          {
            "attributeName": "string",
            "attributeValue": "string"
          },
          {
            "attributeName": "string",
            "attributeValue": "string"
          },
          {
            "attributeName": "string",
            "attributeValue": "string"
          }
        ],
        "customAttributesTemplateId": "string",
        "customerId": 5,
        "description": "string",
        "endpointExtensions": [
          {
            "connectedInner": 2,
            "connectedOuter": 3,
            "connectedPortId": "string",
            "customAttributes": [
              {},
              {},
              {},
              {},
              {},
              {},
              {}
            ],
            "nniPort": {},
            "uniPort": {}
          }
        ],
        "endpoints": [
          {
            "actualEndState": "Deployed",
            "adminState": "UP",
            "appId": "string",
            "customAttributes": [
              {},
              {},
              {},
              {},
              {},
              {}
            ],
            "customAttributesTemplateId": "string",
            "description": "string",
            "externalIds": [
              {},
              {},
              {},
              {},
              {},
              {},
              {}
            ],
            "id": "string",
            "name": "string",
            "neDeploymentState": "FAILED",
            "neId": "string",
            "neName": "string",
            "operationalState": "UP",
            "portAdminState": "MAINTENANCE",
            "portId": "string",
            "portName": "string",
            "portOperationalState": "PARTIALLY_DOWN",
            "portSpeed": 4,
            "serviceId": "string"
          },
          {
            "actualEndState": "Deployed",
            "adminState": "UP",
            "appId": "string",
            "customAttributes": [
              {},
              {},
              {},
              {},
              {},
              {},
              {},
              {},
              {}
            ],
            "customAttributesTemplateId": "string",
            "description": "string",
            "externalIds": [
              {},
              {},
              {},
              {},
              {},
              {},
              {}
            ],
            "id": "string",
            "name": "string",
            "neDeploymentState": "FAILED",
            "neId": "string",
            "neName": "string",
            "operationalState": "PARTIALLY_DOWN",
            "portAdminState": "UP",
            "portId": "string",
            "portName": "string",
            "portOperationalState": "PARTIALLY_DOWN",
            "portSpeed": 3,
            "serviceId": "string"
          },
          {
            "actualEndState": "Deployed",
            "adminState": "DOWN",
            "appId": "string",
            "customAttributes": [
              {},
              {},
              {},
              {},
              {}
            ],
            "customAttributesTemplateId": "string",
            "description": "string",
            "externalIds": [
              {},
              {},
              {},
              {},
              {},
              {},
              {},
              {},
              {}
            ],
            "id": "string",
            "name": "string",
            "neDeploymentState": "FAILED",
            "neId": "string",
            "neName": "string",
            "operationalState": "TRANSITION",
            "portAdminState": "DOWN",
            "portId": "string",
            "portName": "string",
            "portOperationalState": "PARTIALLY_DOWN",
            "portSpeed": 3,
            "serviceId": "string"
          },
          {
            "actualEndState": "Deployed",
            "adminState": "MAINTENANCE",
            "appId": "string",
            "customAttributes": [
              {},
              {},
              {},
              {},
              {},
              {},
              {}
            ],
            "customAttributesTemplateId": "string",
            "description": "string",
            "externalIds": [
              {},
              {}
            ],
            "id": "string",
            "name": "string",
            "neDeploymentState": "DEPLOYED",
            "neId": "string",
            "neName": "string",
            "operationalState": "DOWN",
            "portAdminState": "MAINTENANCE",
            "portId": "string",
            "portName": "string",
            "portOperationalState": "DOWN",
            "portSpeed": 1,
            "serviceId": "string"
          },
          {
            "actualEndState": "Saved",
            "adminState": "UP",
            "appId": "string",
            "customAttributes": [
              {},
              {},
              {},
              {},
              {}
            ],
            "customAttributesTemplateId": "string",
            "description": "string",
            "externalIds": [
              {},
              {},
              {},
              {},
              {},
              {},
              {},
              {},
              {},
              {}
            ],
            "id": "string",
            "name": "string",
            "neDeploymentState": "UNKNOWN",
            "neId": "string",
            "neName": "string",
            "operationalState": "UP",
            "portAdminState": "UP",
            "portId": "string",
            "portName": "string",
            "portOperationalState": "TRANSITION",
            "portSpeed": 10,
            "serviceId": "string"
          },
          {
            "actualEndState": "Saved",
            "adminState": "DOWN",
            "appId": "string",
            "customAttributes": [
              {},
              {},
              {},
              {},
              {},
              {},
              {}
            ],
            "customAttributesTemplateId": "string",
            "description": "string",
            "externalIds": [
              {},
              {},
              {},
              {}
            ],
            "id": "string",
            "name": "string",
            "neDeploymentState": "NA",
            "neId": "string",
            "neName": "string",
            "operationalState": "DOWN",
            "portAdminState": "UP",
            "portId": "string",
            "portName": "string",
            "portOperationalState": "UNKNOWN",
            "portSpeed": 8,
            "serviceId": "string"
          },
          {
            "actualEndState": "Deployed",
            "adminState": "DOWN",
            "appId": "string",
            "customAttributes": [
              {},
              {},
              {},
              {},
              {},
              {},
              {}
            ],
            "customAttributesTemplateId": "string",
            "description": "string",
            "externalIds": [
              {},
              {},
              {},
              {}
            ],
            "id": "string",
            "name": "string",
            "neDeploymentState": "UNKNOWN",
            "neId": "string",
            "neName": "string",
            "operationalState": "DOWN",
            "portAdminState": "UP",
            "portId": "string",
            "portName": "string",
            "portOperationalState": "TRANSITION",
            "portSpeed": 9,
            "serviceId": "string"
          },
          {
            "actualEndState": "Deployed",
            "adminState": "DOWN",
            "appId": "string",
            "customAttributes": [
              {},
              {},
              {},
              {},
              {},
              {},
              {}
            ],
            "customAttributesTemplateId": "string",
            "description": "string",
            "externalIds": [
              {},
              {},
              {},
              {},
              {},
              {},
              {},
              {},
              {},
              {}
            ],
            "id": "string",
            "name": "string",
            "neDeploymentState": "DEPLOYED",
            "neId": "string",
            "neName": "string",
            "operationalState": "UNKNOWN",
            "portAdminState": "UP",
            "portId": "string",
            "portName": "string",
            "portOperationalState": "DEGRADED",
            "portSpeed": 9,
            "serviceId": "string"
          },
          {
            "actualEndState": "Saved",
            "adminState": "UP",
            "appId": "string",
            "customAttributes": [
              {},
              {},
              {},
              {},
              {}
            ],
            "customAttributesTemplateId": "string",
            "description": "string",
            "externalIds": [
              {},
              {},
              {},
              {},
              {},
              {},
              {}
            ],
            "id": "string",
            "name": "string",
            "neDeploymentState": "NA",
            "neId": "string",
            "neName": "string",
            "operationalState": "UP",
            "portAdminState": "MAINTENANCE",
            "portId": "string",
            "portName": "string",
            "portOperationalState": "PARTIALLY_DOWN",
            "portSpeed": 1,
            "serviceId": "string"
          },
          {
            "actualEndState": "Saved",
            "adminState": "UP",
            "appId": "string",
            "customAttributes": [
              {},
              {},
              {},
              {},
              {},
              {},
              {}
            ],
            "customAttributesTemplateId": "string",
            "description": "string",
            "externalIds": [
              {},
              {},
              {}
            ],
            "id": "string",
            "name": "string",
            "neDeploymentState": "PENDING",
            "neId": "string",
            "neName": "string",
            "operationalState": "DOWN",
            "portAdminState": "MAINTENANCE",
            "portId": "string",
            "portName": "string",
            "portOperationalState": "TRANSITION",
            "portSpeed": 1,
            "serviceId": "string"
          }
        ],
        "externalIds": [
          {
            "context": "MDM",
            "id": "string",
            "location": [
              "string",
              "string",
              "string",
              "string"
            ]
          },
          {
            "context": "MDM",
            "id": "string",
            "location": [
              "string",
              "string",
              "string",
              "string"
            ]
          },
          {
            "context": "NFM_P",
            "id": "string",
            "location": [
              "string",
              "string"
            ]
          },
          {
            "context": "NODE",
            "id": "string",
            "location": [
              "string",
              "string",
              "string",
              "string",
              "string",
              "string",
              "string",
              "string",
              "string"
            ]
          },
          {
            "context": "MDM",
            "id": "string",
            "location": [
              "string",
              "string",
              "string",
              "string"
            ]
          },
          {
            "context": "NFM_P",
            "id": "string",
            "location": [
              "string",
              "string",
              "string"
            ]
          },
          {
            "context": "NFM_P",
            "id": "string",
            "location": [
              "string",
              "string",
              "string",
              "string",
              "string",
              "string",
              "string"
            ]
          },
          {
            "context": "NSP",
            "id": "string",
            "location": [
              "string",
              "string",
              "string",
              "string",
              "string"
            ]
          }
        ],
        "groupId": "string",
        "id": "string",
        "lifeCycle": {
          "phase": "Planning",
          "reason": "string",
          "state": "Undeployed"
        },
        "maxCost": 8,
        "maxHops": 9,
        "maxLatency": 2,
        "name": "string",
        "neDeploymentState": "DEPLOYED",
        "nodeServiceId": 3,
        "objective": "LATENCY",
        "operationalState": "DEGRADED",
        "pathProfileId": "string",
        "requestedEndState": "Saved",
        "reverseBW": 3,
        "serviceType": "L2_EXTENSION_NNI",
        "templateId": "string",
        "tunnelSelectionId": "string"
      },
      {
        "actualEndState": "Saved",
        "adminState": "DOWN",
        "appId": "string",
        "bidirectional": "NO",
        "bw": 1,
        "customAttributes": [
          {
            "attributeName": "string",
            "attributeValue": "string"
          },
          {
            "attributeName": "string",
            "attributeValue": "string"
          },
          {
            "attributeName": "string",
            "attributeValue": "string"
          }
        ],
        "customAttributesTemplateId": "string",
        "customerId": 2,
        "description": "string",
        "endpointExtensions": [
          {
            "connectedInner": 4,
            "connectedOuter": 4,
            "connectedPortId": "string",
            "customAttributes": [
              {},
              {},
              {},
              {},
              {},
              {},
              {}
            ],
            "nniPort": {},
            "uniPort": {}
          },
          {
            "connectedInner": 9,
            "connectedOuter": 7,
            "connectedPortId": "string",
            "customAttributes": [
              {},
              {},
              {},
              {}
            ],
            "nniPort": {},
            "uniPort": {}
          },
          {
            "connectedInner": 3,
            "connectedOuter": 9,
            "connectedPortId": "string",
            "customAttributes": [
              {},
              {},
              {},
              {},
              {},
              {},
              {},
              {},
              {},
              {}
            ],
            "nniPort": {},
            "uniPort": {}
          },
          {
            "connectedInner": 8,
            "connectedOuter": 1,
            "connectedPortId": "string",
            "customAttributes": [
              {},
              {},
              {},
              {}
            ],
            "nniPort": {},
            "uniPort": {}
          },
          {
            "connectedInner": 6,
            "connectedOuter": 3,
            "connectedPortId": "string",
            "customAttributes": [
              {},
              {},
              {},
              {},
              {},
              {},
              {},
              {},
              {}
            ],
            "nniPort": {},
            "uniPort": {}
          }
        ],
        "endpoints": [
          {
            "actualEndState": "Deployed",
            "adminState": "MAINTENANCE",
            "appId": "string",
            "customAttributes": [
              {}
            ],
            "customAttributesTemplateId": "string",
            "description": "string",
            "externalIds": [
              {},
              {},
              {},
              {},
              {},
              {},
              {},
              {},
              {}
            ],
            "id": "string",
            "name": "string",
            "neDeploymentState": "DEPLOYED",
            "neId": "string",
            "neName": "string",
            "operationalState": "PARTIALLY_DOWN",
            "portAdminState": "MAINTENANCE",
            "portId": "string",
            "portName": "string",
            "portOperationalState": "PARTIALLY_DOWN",
            "portSpeed": 3,
            "serviceId": "string"
          },
          {
            "actualEndState": "Deployed",
            "adminState": "DOWN",
            "appId": "string",
            "customAttributes": [
              {}
            ],
            "customAttributesTemplateId": "string",
            "description": "string",
            "externalIds": [
              {},
              {},
              {},
              {},
              {},
              {},
              {}
            ],
            "id": "string",
            "name": "string",
            "neDeploymentState": "UNKNOWN",
            "neId": "string",
            "neName": "string",
            "operationalState": "UNKNOWN",
            "portAdminState": "UP",
            "portId": "string",
            "portName": "string",
            "portOperationalState": "DOWN",
            "portSpeed": 7,
            "serviceId": "string"
          },
          {
            "actualEndState": "Saved",
            "adminState": "MAINTENANCE",
            "appId": "string",
            "customAttributes": [
              {},
              {},
              {},
              {},
              {},
              {},
              {}
            ],
            "customAttributesTemplateId": "string",
            "description": "string",
            "externalIds": [
              {},
              {},
              {},
              {},
              {},
              {},
              {},
              {},
              {},
              {}
            ],
            "id": "string",
            "name": "string",
            "neDeploymentState": "PENDING",
            "neId": "string",
            "neName": "string",
            "operationalState": "DEGRADED",
            "portAdminState": "DOWN",
            "portId": "string",
            "portName": "string",
            "portOperationalState": "DEGRADED",
            "portSpeed": 5,
            "serviceId": "string"
          }
        ],
        "externalIds": [
          {
            "context": "NSP",
            "id": "string",
            "location": [
              "string",
              "string",
              "string"
            ]
          },
          {
            "context": "NSP",
            "id": "string",
            "location": [
              "string"
            ]
          },
          {
            "context": "NODE",
            "id": "string",
            "location": [
              "string",
              "string",
              "string",
              "string",
              "string",
              "string",
              "string"
            ]
          },
          {
            "context": "NSP",
            "id": "string",
            "location": [
              "string",
              "string",
              "string",
              "string",
              "string",
              "string",
              "string",
              "string"
            ]
          },
          {
            "context": "NFM_T",
            "id": "string",
            "location": [
              "string",
              "string",
              "string",
              "string",
              "string",
              "string",
              "string",
              "string"
            ]
          },
          {
            "context": "NFM_T",
            "id": "string",
            "location": [
              "string",
              "string",
              "string",
              "string",
              "string",
              "string",
              "string",
              "string",
              "string"
            ]
          },
          {
            "context": "NFM_T",
            "id": "string",
            "location": [
              "string",
              "string",
              "string",
              "string",
              "string"
            ]
          },
          {
            "context": "MDM",
            "id": "string",
            "location": [
              "string"
            ]
          },
          {
            "context": "NFM_P",
            "id": "string",
            "location": [
              "string",
              "string"
            ]
          },
          {
            "context": "NFM_T",
            "id": "string",
            "location": [
              "string",
              "string",
              "string",
              "string"
            ]
          }
        ],
        "groupId": "string",
        "id": "string",
        "lifeCycle": {
          "phase": "Activation",
          "reason": "string",
          "state": "Routing"
        },
        "maxCost": 4,
        "maxHops": 6,
        "maxLatency": 2,
        "name": "string",
        "neDeploymentState": "UNKNOWN",
        "nodeServiceId": 9,
        "objective": "STAR_WEIGHT",
        "operationalState": "DEGRADED",
        "pathProfileId": "string",
        "requestedEndState": "Saved",
        "reverseBW": 8,
        "serviceType": "L3_VPN",
        "templateId": "string",
        "tunnelSelectionId": "string"
      },
      {
        "actualEndState": "Deployed",
        "adminState": "UP",
        "appId": "string",
        "bidirectional": "ANY_REVERSE_ROUTE",
        "bw": 5,
        "customAttributes": [
          {
            "attributeName": "string",
            "attributeValue": "string"
          }
        ],
        "customAttributesTemplateId": "string",
        "customerId": 4,
        "description": "string",
        "endpointExtensions": [
          {
            "connectedInner": 2,
            "connectedOuter": 6,
            "connectedPortId": "string",
            "customAttributes": [
              {},
              {},
              {},
              {},
              {},
              {},
              {},
              {}
            ],
            "nniPort": {},
            "uniPort": {}
          },
          {
            "connectedInner": 2,
            "connectedOuter": 10,
            "connectedPortId": "string",
            "customAttributes": [
              {},
              {},
              {},
              {},
              {},
              {},
              {},
              {},
              {}
            ],
            "nniPort": {},
            "uniPort": {}
          },
          {
            "connectedInner": 6,
            "connectedOuter": 9,
            "connectedPortId": "string",
            "customAttributes": [
              {},
              {}
            ],
            "nniPort": {},
            "uniPort": {}
          },
          {
            "connectedInner": 1,
            "connectedOuter": 7,
            "connectedPortId": "string",
            "customAttributes": [
              {}
            ],
            "nniPort": {},
            "uniPort": {}
          },
          {
            "connectedInner": 10,
            "connectedOuter": 4,
            "connectedPortId": "string",
            "customAttributes": [
              {}
            ],
            "nniPort": {},
            "uniPort": {}
          },
          {
            "connectedInner": 8,
            "connectedOuter": 10,
            "connectedPortId": "string",
            "customAttributes": [
              {},
              {},
              {},
              {},
              {},
              {},
              {},
              {}
            ],
            "nniPort": {},
            "uniPort": {}
          },
          {
            "connectedInner": 10,
            "connectedOuter": 10,
            "connectedPortId": "string",
            "customAttributes": [
              {},
              {},
              {},
              {},
              {}
            ],
            "nniPort": {},
            "uniPort": {}
          }
        ],
        "endpoints": [
          {
            "actualEndState": "Saved",
            "adminState": "UP",
            "appId": "string",
            "customAttributes": [
              {}
            ],
            "customAttributesTemplateId": "string",
            "description": "string",
            "externalIds": [
              {}
            ],
            "id": "string",
            "name": "string",
            "neDeploymentState": "PENDING",
            "neId": "string",
            "neName": "string",
            "operationalState": "UNKNOWN",
            "portAdminState": "DOWN",
            "portId": "string",
            "portName": "string",
            "portOperationalState": "DOWN",
            "portSpeed": 7,
            "serviceId": "string"
          },
          {
            "actualEndState": "Saved",
            "adminState": "DOWN",
            "appId": "string",
            "customAttributes": [
              {}
            ],
            "customAttributesTemplateId": "string",
            "description": "string",
            "externalIds": [
              {},
              {},
              {},
              {},
              {}
            ],
            "id": "string",
            "name": "string",
            "neDeploymentState": "FAILED",
            "neId": "string",
            "neName": "string",
            "operationalState": "DOWN",
            "portAdminState": "DOWN",
            "portId": "string",
            "portName": "string",
            "portOperationalState": "DOWN",
            "portSpeed": 4,
            "serviceId": "string"
          },
          {
            "actualEndState": "Saved",
            "adminState": "DOWN",
            "appId": "string",
            "customAttributes": [
              {},
              {},
              {},
              {},
              {},
              {},
              {}
            ],
            "customAttributesTemplateId": "string",
            "description": "string",
            "externalIds": [
              {},
              {},
              {},
              {},
              {},
              {}
            ],
            "id": "string",
            "name": "string",
            "neDeploymentState": "DEPLOYED",
            "neId": "string",
            "neName": "string",
            "operationalState": "DOWN",
            "portAdminState": "UP",
            "portId": "string",
            "portName": "string",
            "portOperationalState": "DOWN",
            "portSpeed": 7,
            "serviceId": "string"
          },
          {
            "actualEndState": "Saved",
            "adminState": "DOWN",
            "appId": "string",
            "customAttributes": [
              {},
              {},
              {},
              {},
              {},
              {},
              {}
            ],
            "customAttributesTemplateId": "string",
            "description": "string",
            "externalIds": [
              {},
              {},
              {},
              {},
              {},
              {},
              {}
            ],
            "id": "string",
            "name": "string",
            "neDeploymentState": "PENDING",
            "neId": "string",
            "neName": "string",
            "operationalState": "UNKNOWN",
            "portAdminState": "DOWN",
            "portId": "string",
            "portName": "string",
            "portOperationalState": "DOWN",
            "portSpeed": 7,
            "serviceId": "string"
          },
          {
            "actualEndState": "Deployed",
            "adminState": "DOWN",
            "appId": "string",
            "customAttributes": [
              {}
            ],
            "customAttributesTemplateId": "string",
            "description": "string",
            "externalIds": [
              {},
              {},
              {},
              {},
              {},
              {},
              {},
              {}
            ],
            "id": "string",
            "name": "string",
            "neDeploymentState": "UNKNOWN",
            "neId": "string",
            "neName": "string",
            "operationalState": "DOWN",
            "portAdminState": "MAINTENANCE",
            "portId": "string",
            "portName": "string",
            "portOperationalState": "PARTIALLY_DOWN",
            "portSpeed": 7,
            "serviceId": "string"
          },
          {
            "actualEndState": "Deployed",
            "adminState": "MAINTENANCE",
            "appId": "string",
            "customAttributes": [
              {},
              {},
              {},
              {},
              {},
              {},
              {},
              {},
              {},
              {}
            ],
            "customAttributesTemplateId": "string",
            "description": "string",
            "externalIds": [
              {},
              {},
              {},
              {},
              {}
            ],
            "id": "string",
            "name": "string",
            "neDeploymentState": "DEPLOYED",
            "neId": "string",
            "neName": "string",
            "operationalState": "PARTIALLY_DOWN",
            "portAdminState": "DOWN",
            "portId": "string",
            "portName": "string",
            "portOperationalState": "TRANSITION",
            "portSpeed": 2,
            "serviceId": "string"
          },
          {
            "actualEndState": "Saved",
            "adminState": "DOWN",
            "appId": "string",
            "customAttributes": [
              {},
              {},
              {},
              {},
              {}
            ],
            "customAttributesTemplateId": "string",
            "description": "string",
            "externalIds": [
              {}
            ],
            "id": "string",
            "name": "string",
            "neDeploymentState": "NA",
            "neId": "string",
            "neName": "string",
            "operationalState": "PARTIALLY_DOWN",
            "portAdminState": "MAINTENANCE",
            "portId": "string",
            "portName": "string",
            "portOperationalState": "UP",
            "portSpeed": 7,
            "serviceId": "string"
          },
          {
            "actualEndState": "Deployed",
            "adminState": "UP",
            "appId": "string",
            "customAttributes": [
              {},
              {},
              {},
              {},
              {},
              {},
              {},
              {},
              {}
            ],
            "customAttributesTemplateId": "string",
            "description": "string",
            "externalIds": [
              {},
              {},
              {}
            ],
            "id": "string",
            "name": "string",
            "neDeploymentState": "PENDING",
            "neId": "string",
            "neName": "string",
            "operationalState": "UP",
            "portAdminState": "DOWN",
            "portId": "string",
            "portName": "string",
            "portOperationalState": "UNKNOWN",
            "portSpeed": 10,
            "serviceId": "string"
          },
          {
            "actualEndState": "Deployed",
            "adminState": "UP",
            "appId": "string",
            "customAttributes": [
              {},
              {},
              {},
              {},
              {}
            ],
            "customAttributesTemplateId": "string",
            "description": "string",
            "externalIds": [
              {},
              {},
              {},
              {},
              {},
              {},
              {},
              {},
              {}
            ],
            "id": "string",
            "name": "string",
            "neDeploymentState": "PENDING",
            "neId": "string",
            "neName": "string",
            "operationalState": "TRANSITION",
            "portAdminState": "UP",
            "portId": "string",
            "portName": "string",
            "portOperationalState": "UNKNOWN",
            "portSpeed": 10,
            "serviceId": "string"
          }
        ],
        "externalIds": [
          {
            "context": "NFM_T",
            "id": "string",
            "location": [
              "string"
            ]
          }
        ],
        "groupId": "string",
        "id": "string",
        "lifeCycle": {
          "phase": "Deployment",
          "reason": "string",
          "state": "Undeploy"
        },
        "maxCost": 6,
        "maxHops": 4,
        "maxLatency": 3,
        "name": "string",
        "neDeploymentState": "UNKNOWN",
        "nodeServiceId": 2,
        "objective": "DISTANCE",
        "operationalState": "UP",
        "pathProfileId": "string",
        "requestedEndState": "Deployed",
        "reverseBW": 4,
        "serviceType": "L2_EXTENSION_UNI",
        "templateId": "string",
        "tunnelSelectionId": "string"
      },
      {
        "actualEndState": "Deployed",
        "adminState": "UP",
        "appId": "string",
        "bidirectional": "ASYMMETRIC_LOOSE",
        "bw": 7,
        "customAttributes": [
          {
            "attributeName": "string",
            "attributeValue": "string"
          },
          {
            "attributeName": "string",
            "attributeValue": "string"
          },
          {
            "attributeName": "string",
            "attributeValue": "string"
          }
        ],
        "customAttributesTemplateId": "string",
        "customerId": 8,
        "description": "string",
        "endpointExtensions": [
          {
            "connectedInner": 7,
            "connectedOuter": 5,
            "connectedPortId": "string",
            "customAttributes": [
              {},
              {},
              {},
              {},
              {},
              {},
              {},
              {},
              {}
            ],
            "nniPort": {},
            "uniPort": {}
          },
          {
            "connectedInner": 2,
            "connectedOuter": 3,
            "connectedPortId": "string",
            "customAttributes": [
              {},
              {}
            ],
            "nniPort": {},
            "uniPort": {}
          },
          {
            "connectedInner": 4,
            "connectedOuter": 1,
            "connectedPortId": "string",
            "customAttributes": [
              {},
              {},
              {}
            ],
            "nniPort": {},
            "uniPort": {}
          }
        ],
        "endpoints": [
          {
            "actualEndState": "Saved",
            "adminState": "DOWN",
            "appId": "string",
            "customAttributes": [
              {},
              {},
              {}
            ],
            "customAttributesTemplateId": "string",
            "description": "string",
            "externalIds": [
              {}
            ],
            "id": "string",
            "name": "string",
            "neDeploymentState": "FAILED",
            "neId": "string",
            "neName": "string",
            "operationalState": "DOWN",
            "portAdminState": "DOWN",
            "portId": "string",
            "portName": "string",
            "portOperationalState": "TRANSITION",
            "portSpeed": 5,
            "serviceId": "string"
          },
          {
            "actualEndState": "Deployed",
            "adminState": "UP",
            "appId": "string",
            "customAttributes": [
              {},
              {},
              {},
              {},
              {},
              {},
              {}
            ],
            "customAttributesTemplateId": "string",
            "description": "string",
            "externalIds": [
              {},
              {},
              {},
              {},
              {},
              {}
            ],
            "id": "string",
            "name": "string",
            "neDeploymentState": "NA",
            "neId": "string",
            "neName": "string",
            "operationalState": "PARTIALLY_DOWN",
            "portAdminState": "DOWN",
            "portId": "string",
            "portName": "string",
            "portOperationalState": "DOWN",
            "portSpeed": 4,
            "serviceId": "string"
          },
          {
            "actualEndState": "Saved",
            "adminState": "UP",
            "appId": "string",
            "customAttributes": [
              {}
            ],
            "customAttributesTemplateId": "string",
            "description": "string",
            "externalIds": [
              {},
              {},
              {},
              {},
              {},
              {},
              {}
            ],
            "id": "string",
            "name": "string",
            "neDeploymentState": "NA",
            "neId": "string",
            "neName": "string",
            "operationalState": "DOWN",
            "portAdminState": "UP",
            "portId": "string",
            "portName": "string",
            "portOperationalState": "TRANSITION",
            "portSpeed": 4,
            "serviceId": "string"
          },
          {
            "actualEndState": "Saved",
            "adminState": "DOWN",
            "appId": "string",
            "customAttributes": [
              {},
              {},
              {},
              {},
              {}
            ],
            "customAttributesTemplateId": "string",
            "description": "string",
            "externalIds": [
              {},
              {},
              {},
              {},
              {},
              {}
            ],
            "id": "string",
            "name": "string",
            "neDeploymentState": "FAILED",
            "neId": "string",
            "neName": "string",
            "operationalState": "UNKNOWN",
            "portAdminState": "UP",
            "portId": "string",
            "portName": "string",
            "portOperationalState": "UP",
            "portSpeed": 9,
            "serviceId": "string"
          },
          {
            "actualEndState": "Saved",
            "adminState": "MAINTENANCE",
            "appId": "string",
            "customAttributes": [
              {},
              {},
              {},
              {},
              {}
            ],
            "customAttributesTemplateId": "string",
            "description": "string",
            "externalIds": [
              {},
              {},
              {},
              {},
              {},
              {},
              {}
            ],
            "id": "string",
            "name": "string",
            "neDeploymentState": "FAILED",
            "neId": "string",
            "neName": "string",
            "operationalState": "DEGRADED",
            "portAdminState": "MAINTENANCE",
            "portId": "string",
            "portName": "string",
            "portOperationalState": "TRANSITION",
            "portSpeed": 4,
            "serviceId": "string"
          },
          {
            "actualEndState": "Deployed",
            "adminState": "DOWN",
            "appId": "string",
            "customAttributes": [
              {},
              {},
              {},
              {},
              {},
              {},
              {}
            ],
            "customAttributesTemplateId": "string",
            "description": "string",
            "externalIds": [
              {},
              {},
              {},
              {},
              {},
              {},
              {},
              {},
              {},
              {}
            ],
            "id": "string",
            "name": "string",
            "neDeploymentState": "DEPLOYED",
            "neId": "string",
            "neName": "string",
            "operationalState": "TRANSITION",
            "portAdminState": "UP",
            "portId": "string",
            "portName": "string",
            "portOperationalState": "UNKNOWN",
            "portSpeed": 6,
            "serviceId": "string"
          },
          {
            "actualEndState": "Saved",
            "adminState": "MAINTENANCE",
            "appId": "string",
            "customAttributes": [
              {},
              {},
              {},
              {},
              {}
            ],
            "customAttributesTemplateId": "string",
            "description": "string",
            "externalIds": [
              {},
              {},
              {},
              {},
              {},
              {},
              {},
              {}
            ],
            "id": "string",
            "name": "string",
            "neDeploymentState": "NA",
            "neId": "string",
            "neName": "string",
            "operationalState": "DEGRADED",
            "portAdminState": "MAINTENANCE",
            "portId": "string",
            "portName": "string",
            "portOperationalState": "UNKNOWN",
            "portSpeed": 4,
            "serviceId": "string"
          },
          {
            "actualEndState": "Saved",
            "adminState": "MAINTENANCE",
            "appId": "string",
            "customAttributes": [
              {},
              {},
              {},
              {},
              {},
              {},
              {},
              {},
              {},
              {}
            ],
            "customAttributesTemplateId": "string",
            "description": "string",
            "externalIds": [
              {}
            ],
            "id": "string",
            "name": "string",
            "neDeploymentState": "NA",
            "neId": "string",
            "neName": "string",
            "operationalState": "DEGRADED",
            "portAdminState": "MAINTENANCE",
            "portId": "string",
            "portName": "string",
            "portOperationalState": "UP",
            "portSpeed": 3,
            "serviceId": "string"
          },
          {
            "actualEndState": "Deployed",
            "adminState": "MAINTENANCE",
            "appId": "string",
            "customAttributes": [
              {},
              {},
              {},
              {},
              {},
              {},
              {},
              {}
            ],
            "customAttributesTemplateId": "string",
            "description": "string",
            "externalIds": [
              {},
              {},
              {},
              {},
              {},
              {},
              {},
              {},
              {},
              {}
            ],
            "id": "string",
            "name": "string",
            "neDeploymentState": "DEPLOYED",
            "neId": "string",
            "neName": "string",
            "operationalState": "UP",
            "portAdminState": "DOWN",
            "portId": "string",
            "portName": "string",
            "portOperationalState": "PARTIALLY_DOWN",
            "portSpeed": 8,
            "serviceId": "string"
          }
        ],
        "externalIds": [
          {
            "context": "NODE",
            "id": "string",
            "location": [
              "string"
            ]
          },
          {
            "context": "NFM_P",
            "id": "string",
            "location": [
              "string",
              "string",
              "string",
              "string",
              "string",
              "string",
              "string"
            ]
          }
        ],
        "groupId": "string",
        "id": "string",
        "lifeCycle": {
          "phase": "Planning",
          "reason": "string",
          "state": "PartiallyDeployed"
        },
        "maxCost": 6,
        "maxHops": 9,
        "maxLatency": 5,
        "name": "string",
        "neDeploymentState": "UNKNOWN",
        "nodeServiceId": 5,
        "objective": "DISTANCE",
        "operationalState": "PARTIALLY_DOWN",
        "pathProfileId": "string",
        "requestedEndState": "Deployed",
        "reverseBW": 2,
        "serviceType": "ELAN",
        "templateId": "string",
        "tunnelSelectionId": "string"
      },
      {
        "actualEndState": "Saved",
        "adminState": "DOWN",
        "appId": "string",
        "bidirectional": "ANY_REVERSE_ROUTE",
        "bw": 1,
        "customAttributes": [
          {
            "attributeName": "string",
            "attributeValue": "string"
          },
          {
            "attributeName": "string",
            "attributeValue": "string"
          }
        ],
        "customAttributesTemplateId": "string",
        "customerId": 3,
        "description": "string",
        "endpointExtensions": [
          {
            "connectedInner": 9,
            "connectedOuter": 4,
            "connectedPortId": "string",
            "customAttributes": [
              {},
              {},
              {},
              {},
              {}
            ],
            "nniPort": {},
            "uniPort": {}
          }
        ],
        "endpoints": [
          {
            "actualEndState": "Saved",
            "adminState": "UP",
            "appId": "string",
            "customAttributes": [
              {},
              {}
            ],
            "customAttributesTemplateId": "string",
            "description": "string",
            "externalIds": [
              {}
            ],
            "id": "string",
            "name": "string",
            "neDeploymentState": "NA",
            "neId": "string",
            "neName": "string",
            "operationalState": "UP",
            "portAdminState": "UP",
            "portId": "string",
            "portName": "string",
            "portOperationalState": "PARTIALLY_DOWN",
            "portSpeed": 8,
            "serviceId": "string"
          }
        ],
        "externalIds": [
          {
            "context": "NODE",
            "id": "string",
            "location": [
              "string",
              "string",
              "string"
            ]
          },
          {
            "context": "NFM_P",
            "id": "string",
            "location": [
              "string"
            ]
          },
          {
            "context": "NODE",
            "id": "string",
            "location": [
              "string"
            ]
          },
          {
            "context": "NSP",
            "id": "string",
            "location": [
              "string",
              "string",
              "string",
              "string",
              "string",
              "string",
              "string"
            ]
          },
          {
            "context": "NFM_P",
            "id": "string",
            "location": [
              "string"
            ]
          }
        ],
        "groupId": "string",
        "id": "string",
        "lifeCycle": {
          "phase": "Creation",
          "reason": "string",
          "state": "DeploymentFailed"
        },
        "maxCost": 7,
        "maxHops": 6,
        "maxLatency": 8,
        "name": "string",
        "neDeploymentState": "FAILED",
        "nodeServiceId": 4,
        "objective": "STAR_WEIGHT",
        "operationalState": "UNKNOWN",
        "pathProfileId": "string",
        "requestedEndState": "Saved",
        "reverseBW": 4,
        "serviceType": "ODU",
        "templateId": "string",
        "tunnelSelectionId": "string"
      },
      {
        "actualEndState": "Deployed",
        "adminState": "UP",
        "appId": "string",
        "bidirectional": "SYMMETRIC_STRICT",
        "bw": 5,
        "customAttributes": [
          {
            "attributeName": "string",
            "attributeValue": "string"
          },
          {
            "attributeName": "string",
            "attributeValue": "string"
          },
          {
            "attributeName": "string",
            "attributeValue": "string"
          },
          {
            "attributeName": "string",
            "attributeValue": "string"
          },
          {
            "attributeName": "string",
            "attributeValue": "string"
          }
        ],
        "customAttributesTemplateId": "string",
        "customerId": 4,
        "description": "string",
        "endpointExtensions": [
          {
            "connectedInner": 2,
            "connectedOuter": 5,
            "connectedPortId": "string",
            "customAttributes": [
              {},
              {},
              {},
              {}
            ],
            "nniPort": {},
            "uniPort": {}
          },
          {
            "connectedInner": 10,
            "connectedOuter": 7,
            "connectedPortId": "string",
            "customAttributes": [
              {},
              {},
              {},
              {},
              {},
              {},
              {},
              {},
              {}
            ],
            "nniPort": {},
            "uniPort": {}
          }
        ],
        "endpoints": [
          {
            "actualEndState": "Saved",
            "adminState": "UP",
            "appId": "string",
            "customAttributes": [
              {},
              {},
              {},
              {}
            ],
            "customAttributesTemplateId": "string",
            "description": "string",
            "externalIds": [
              {},
              {},
              {},
              {},
              {},
              {},
              {},
              {},
              {},
              {}
            ],
            "id": "string",
            "name": "string",
            "neDeploymentState": "FAILED",
            "neId": "string",
            "neName": "string",
            "operationalState": "DOWN",
            "portAdminState": "MAINTENANCE",
            "portId": "string",
            "portName": "string",
            "portOperationalState": "DOWN",
            "portSpeed": 1,
            "serviceId": "string"
          },
          {
            "actualEndState": "Deployed",
            "adminState": "UP",
            "appId": "string",
            "customAttributes": [
              {},
              {},
              {},
              {},
              {},
              {},
              {},
              {},
              {},
              {}
            ],
            "customAttributesTemplateId": "string",
            "description": "string",
            "externalIds": [
              {},
              {},
              {},
              {},
              {},
              {},
              {}
            ],
            "id": "string",
            "name": "string",
            "neDeploymentState": "FAILED",
            "neId": "string",
            "neName": "string",
            "operationalState": "UNKNOWN",
            "portAdminState": "DOWN",
            "portId": "string",
            "portName": "string",
            "portOperationalState": "TRANSITION",
            "portSpeed": 4,
            "serviceId": "string"
          },
          {
            "actualEndState": "Saved",
            "adminState": "UP",
            "appId": "string",
            "customAttributes": [
              {},
              {},
              {}
            ],
            "customAttributesTemplateId": "string",
            "description": "string",
            "externalIds": [
              {},
              {},
              {},
              {},
              {},
              {}
            ],
            "id": "string",
            "name": "string",
            "neDeploymentState": "PENDING",
            "neId": "string",
            "neName": "string",
            "operationalState": "TRANSITION",
            "portAdminState": "UP",
            "portId": "string",
            "portName": "string",
            "portOperationalState": "PARTIALLY_DOWN",
            "portSpeed": 2,
            "serviceId": "string"
          },
          {
            "actualEndState": "Deployed",
            "adminState": "MAINTENANCE",
            "appId": "string",
            "customAttributes": [
              {},
              {},
              {},
              {},
              {},
              {}
            ],
            "customAttributesTemplateId": "string",
            "description": "string",
            "externalIds": [
              {},
              {},
              {},
              {}
            ],
            "id": "string",
            "name": "string",
            "neDeploymentState": "UNKNOWN",
            "neId": "string",
            "neName": "string",
            "operationalState": "DOWN",
            "portAdminState": "UP",
            "portId": "string",
            "portName": "string",
            "portOperationalState": "DEGRADED",
            "portSpeed": 9,
            "serviceId": "string"
          },
          {
            "actualEndState": "Deployed",
            "adminState": "UP",
            "appId": "string",
            "customAttributes": [
              {},
              {},
              {},
              {},
              {},
              {},
              {},
              {}
            ],
            "customAttributesTemplateId": "string",
            "description": "string",
            "externalIds": [
              {},
              {},
              {},
              {},
              {},
              {},
              {},
              {},
              {},
              {}
            ],
            "id": "string",
            "name": "string",
            "neDeploymentState": "FAILED",
            "neId": "string",
            "neName": "string",
            "operationalState": "UNKNOWN",
            "portAdminState": "MAINTENANCE",
            "portId": "string",
            "portName": "string",
            "portOperationalState": "UP",
            "portSpeed": 6,
            "serviceId": "string"
          },
          {
            "actualEndState": "Saved",
            "adminState": "UP",
            "appId": "string",
            "customAttributes": [
              {},
              {},
              {},
              {},
              {},
              {},
              {},
              {},
              {},
              {}
            ],
            "customAttributesTemplateId": "string",
            "description": "string",
            "externalIds": [
              {}
            ],
            "id": "string",
            "name": "string",
            "neDeploymentState": "UNKNOWN",
            "neId": "string",
            "neName": "string",
            "operationalState": "PARTIALLY_DOWN",
            "portAdminState": "UP",
            "portId": "string",
            "portName": "string",
            "portOperationalState": "TRANSITION",
            "portSpeed": 3,
            "serviceId": "string"
          },
          {
            "actualEndState": "Deployed",
            "adminState": "UP",
            "appId": "string",
            "customAttributes": [
              {},
              {}
            ],
            "customAttributesTemplateId": "string",
            "description": "string",
            "externalIds": [
              {},
              {},
              {}
            ],
            "id": "string",
            "name": "string",
            "neDeploymentState": "DEPLOYED",
            "neId": "string",
            "neName": "string",
            "operationalState": "PARTIALLY_DOWN",
            "portAdminState": "MAINTENANCE",
            "portId": "string",
            "portName": "string",
            "portOperationalState": "PARTIALLY_DOWN",
            "portSpeed": 2,
            "serviceId": "string"
          },
          {
            "actualEndState": "Deployed",
            "adminState": "DOWN",
            "appId": "string",
            "customAttributes": [
              {},
              {},
              {},
              {},
              {},
              {},
              {}
            ],
            "customAttributesTemplateId": "string",
            "description": "string",
            "externalIds": [
              {}
            ],
            "id": "string",
            "name": "string",
            "neDeploymentState": "PENDING",
            "neId": "string",
            "neName": "string",
            "operationalState": "PARTIALLY_DOWN",
            "portAdminState": "MAINTENANCE",
            "portId": "string",
            "portName": "string",
            "portOperationalState": "DOWN",
            "portSpeed": 2,
            "serviceId": "string"
          },
          {
            "actualEndState": "Deployed",
            "adminState": "UP",
            "appId": "string",
            "customAttributes": [
              {},
              {},
              {},
              {},
              {},
              {},
              {}
            ],
            "customAttributesTemplateId": "string",
            "description": "string",
            "externalIds": [
              {},
              {}
            ],
            "id": "string",
            "name": "string",
            "neDeploymentState": "FAILED",
            "neId": "string",
            "neName": "string",
            "operationalState": "UNKNOWN",
            "portAdminState": "MAINTENANCE",
            "portId": "string",
            "portName": "string",
            "portOperationalState": "TRANSITION",
            "portSpeed": 6,
            "serviceId": "string"
          },
          {
            "actualEndState": "Deployed",
            "adminState": "MAINTENANCE",
            "appId": "string",
            "customAttributes": [
              {},
              {},
              {},
              {},
              {},
              {}
            ],
            "customAttributesTemplateId": "string",
            "description": "string",
            "externalIds": [
              {}
            ],
            "id": "string",
            "name": "string",
            "neDeploymentState": "UNKNOWN",
            "neId": "string",
            "neName": "string",
            "operationalState": "UP",
            "portAdminState": "UP",
            "portId": "string",
            "portName": "string",
            "portOperationalState": "DOWN",
            "portSpeed": 6,
            "serviceId": "string"
          }
        ],
        "externalIds": [
          {
            "context": "NFM_T",
            "id": "string",
            "location": [
              "string",
              "string",
              "string",
              "string",
              "string"
            ]
          },
          {
            "context": "MDM",
            "id": "string",
            "location": [
              "string",
              "string",
              "string",
              "string"
            ]
          },
          {
            "context": "NSP",
            "id": "string",
            "location": [
              "string",
              "string",
              "string",
              "string",
              "string"
            ]
          }
        ],
        "groupId": "string",
        "id": "string",
        "lifeCycle": {
          "phase": "Creation",
          "reason": "string",
          "state": "Undeployed"
        },
        "maxCost": 2,
        "maxHops": 10,
        "maxLatency": 5,
        "name": "string",
        "neDeploymentState": "UNKNOWN",
        "nodeServiceId": 1,
        "objective": "DISTANCE",
        "operationalState": "TRANSITION",
        "pathProfileId": "string",
        "requestedEndState": "Deployed",
        "reverseBW": 1,
        "serviceType": "L2_EXTENSION_UNI",
        "templateId": "string",
        "tunnelSelectionId": "string"
      },
      {
        "actualEndState": "Saved",
        "adminState": "DOWN",
        "appId": "string",
        "bidirectional": "SYMMETRIC_LOOSE",
        "bw": 1,
        "customAttributes": [
          {
            "attributeName": "string",
            "attributeValue": "string"
          },
          {
            "attributeName": "string",
            "attributeValue": "string"
          },
          {
            "attributeName": "string",
            "attributeValue": "string"
          },
          {
            "attributeName": "string",
            "attributeValue": "string"
          },
          {
            "attributeName": "string",
            "attributeValue": "string"
          }
        ],
        "customAttributesTemplateId": "string",
        "customerId": 7,
        "description": "string",
        "endpointExtensions": [
          {
            "connectedInner": 1,
            "connectedOuter": 1,
            "connectedPortId": "string",
            "customAttributes": [
              {},
              {},
              {},
              {},
              {},
              {},
              {},
              {},
              {}
            ],
            "nniPort": {},
            "uniPort": {}
          },
          {
            "connectedInner": 6,
            "connectedOuter": 6,
            "connectedPortId": "string",
            "customAttributes": [
              {},
              {},
              {},
              {}
            ],
            "nniPort": {},
            "uniPort": {}
          },
          {
            "connectedInner": 7,
            "connectedOuter": 1,
            "connectedPortId": "string",
            "customAttributes": [
              {},
              {}
            ],
            "nniPort": {},
            "uniPort": {}
          }
        ],
        "endpoints": [
          {
            "actualEndState": "Deployed",
            "adminState": "UP",
            "appId": "string",
            "customAttributes": [
              {},
              {},
              {},
              {}
            ],
            "customAttributesTemplateId": "string",
            "description": "string",
            "externalIds": [
              {},
              {}
            ],
            "id": "string",
            "name": "string",
            "neDeploymentState": "PENDING",
            "neId": "string",
            "neName": "string",
            "operationalState": "DEGRADED",
            "portAdminState": "DOWN",
            "portId": "string",
            "portName": "string",
            "portOperationalState": "DEGRADED",
            "portSpeed": 7,
            "serviceId": "string"
          },
          {
            "actualEndState": "Saved",
            "adminState": "UP",
            "appId": "string",
            "customAttributes": [
              {},
              {},
              {}
            ],
            "customAttributesTemplateId": "string",
            "description": "string",
            "externalIds": [
              {},
              {},
              {},
              {},
              {},
              {},
              {},
              {},
              {}
            ],
            "id": "string",
            "name": "string",
            "neDeploymentState": "UNKNOWN",
            "neId": "string",
            "neName": "string",
            "operationalState": "UP",
            "portAdminState": "UP",
            "portId": "string",
            "portName": "string",
            "portOperationalState": "UP",
            "portSpeed": 6,
            "serviceId": "string"
          },
          {
            "actualEndState": "Saved",
            "adminState": "UP",
            "appId": "string",
            "customAttributes": [
              {},
              {},
              {},
              {},
              {},
              {},
              {},
              {},
              {},
              {}
            ],
            "customAttributesTemplateId": "string",
            "description": "string",
            "externalIds": [
              {},
              {},
              {},
              {}
            ],
            "id": "string",
            "name": "string",
            "neDeploymentState": "DEPLOYED",
            "neId": "string",
            "neName": "string",
            "operationalState": "PARTIALLY_DOWN",
            "portAdminState": "DOWN",
            "portId": "string",
            "portName": "string",
            "portOperationalState": "UP",
            "portSpeed": 2,
            "serviceId": "string"
          },
          {
            "actualEndState": "Deployed",
            "adminState": "DOWN",
            "appId": "string",
            "customAttributes": [
              {},
              {},
              {},
              {},
              {},
              {},
              {},
              {}
            ],
            "customAttributesTemplateId": "string",
            "description": "string",
            "externalIds": [
              {}
            ],
            "id": "string",
            "name": "string",
            "neDeploymentState": "UNKNOWN",
            "neId": "string",
            "neName": "string",
            "operationalState": "DOWN",
            "portAdminState": "MAINTENANCE",
            "portId": "string",
            "portName": "string",
            "portOperationalState": "PARTIALLY_DOWN",
            "portSpeed": 9,
            "serviceId": "string"
          },
          {
            "actualEndState": "Saved",
            "adminState": "DOWN",
            "appId": "string",
            "customAttributes": [
              {}
            ],
            "customAttributesTemplateId": "string",
            "description": "string",
            "externalIds": [
              {},
              {},
              {},
              {},
              {}
            ],
            "id": "string",
            "name": "string",
            "neDeploymentState": "UNKNOWN",
            "neId": "string",
            "neName": "string",
            "operationalState": "PARTIALLY_DOWN",
            "portAdminState": "DOWN",
            "portId": "string",
            "portName": "string",
            "portOperationalState": "UNKNOWN",
            "portSpeed": 2,
            "serviceId": "string"
          },
          {
            "actualEndState": "Saved",
            "adminState": "MAINTENANCE",
            "appId": "string",
            "customAttributes": [
              {},
              {},
              {},
              {},
              {},
              {}
            ],
            "customAttributesTemplateId": "string",
            "description": "string",
            "externalIds": [
              {}
            ],
            "id": "string",
            "name": "string",
            "neDeploymentState": "DEPLOYED",
            "neId": "string",
            "neName": "string",
            "operationalState": "DOWN",
            "portAdminState": "MAINTENANCE",
            "portId": "string",
            "portName": "string",
            "portOperationalState": "UP",
            "portSpeed": 8,
            "serviceId": "string"
          },
          {
            "actualEndState": "Saved",
            "adminState": "DOWN",
            "appId": "string",
            "customAttributes": [
              {},
              {},
              {}
            ],
            "customAttributesTemplateId": "string",
            "description": "string",
            "externalIds": [
              {},
              {},
              {},
              {},
              {},
              {}
            ],
            "id": "string",
            "name": "string",
            "neDeploymentState": "PENDING",
            "neId": "string",
            "neName": "string",
            "operationalState": "UP",
            "portAdminState": "DOWN",
            "portId": "string",
            "portName": "string",
            "portOperationalState": "TRANSITION",
            "portSpeed": 10,
            "serviceId": "string"
          },
          {
            "actualEndState": "Saved",
            "adminState": "UP",
            "appId": "string",
            "customAttributes": [
              {},
              {},
              {},
              {},
              {},
              {},
              {},
              {},
              {},
              {}
            ],
            "customAttributesTemplateId": "string",
            "description": "string",
            "externalIds": [
              {},
              {},
              {},
              {},
              {},
              {},
              {}
            ],
            "id": "string",
            "name": "string",
            "neDeploymentState": "PENDING",
            "neId": "string",
            "neName": "string",
            "operationalState": "PARTIALLY_DOWN",
            "portAdminState": "MAINTENANCE",
            "portId": "string",
            "portName": "string",
            "portOperationalState": "TRANSITION",
            "portSpeed": 7,
            "serviceId": "string"
          },
          {
            "actualEndState": "Deployed",
            "adminState": "DOWN",
            "appId": "string",
            "customAttributes": [
              {},
              {},
              {},
              {},
              {},
              {},
              {},
              {},
              {}
            ],
            "customAttributesTemplateId": "string",
            "description": "string",
            "externalIds": [
              {},
              {},
              {}
            ],
            "id": "string",
            "name": "string",
            "neDeploymentState": "FAILED",
            "neId": "string",
            "neName": "string",
            "operationalState": "DOWN",
            "portAdminState": "MAINTENANCE",
            "portId": "string",
            "portName": "string",
            "portOperationalState": "DEGRADED",
            "portSpeed": 8,
            "serviceId": "string"
          }
        ],
        "externalIds": [
          {
            "context": "NODE",
            "id": "string",
            "location": [
              "string",
              "string",
              "string"
            ]
          },
          {
            "context": "NODE",
            "id": "string",
            "location": [
              "string",
              "string",
              "string",
              "string",
              "string",
              "string",
              "string",
              "string",
              "string"
            ]
          },
          {
            "context": "NODE",
            "id": "string",
            "location": [
              "string",
              "string",
              "string",
              "string"
            ]
          },
          {
            "context": "NFM_T",
            "id": "string",
            "location": [
              "string",
              "string",
              "string",
              "string",
              "string",
              "string",
              "string",
              "string",
              "string"
            ]
          },
          {
            "context": "MDM",
            "id": "string",
            "location": [
              "string",
              "string",
              "string",
              "string",
              "string",
              "string"
            ]
          },
          {
            "context": "NODE",
            "id": "string",
            "location": [
              "string",
              "string"
            ]
          },
          {
            "context": "NFM_T",
            "id": "string",
            "location": [
              "string",
              "string",
              "string",
              "string",
              "string",
              "string"
            ]
          },
          {
            "context": "NODE",
            "id": "string",
            "location": [
              "string",
              "string",
              "string",
              "string",
              "string",
              "string",
              "string"
            ]
          },
          {
            "context": "MDM",
            "id": "string",
            "location": [
              "string",
              "string",
              "string",
              "string",
              "string",
              "string",
              "string",
              "string",
              "string",
              "string"
            ]
          },
          {
            "context": "NFM_P",
            "id": "string",
            "location": [
              "string",
              "string"
            ]
          }
        ],
        "groupId": "string",
        "id": "string",
        "lifeCycle": {
          "phase": "Deployment",
          "reason": "string",
          "state": "Undeployed"
        },
        "maxCost": 8,
        "maxHops": 6,
        "maxLatency": 1,
        "name": "string",
        "neDeploymentState": "UNKNOWN",
        "nodeServiceId": 10,
        "objective": "LATENCY",
        "operationalState": "DOWN",
        "pathProfileId": "string",
        "requestedEndState": "Deployed",
        "reverseBW": 8,
        "serviceType": "ODU",
        "templateId": "string",
        "tunnelSelectionId": "string"
      }
    ],
    "endRow": 6,
    "startRow": 1,
    "status": 4,
    "totalRows": 2
  }
}