{
  "response": {
    "data": {
      "actualEndState": "Saved",
      "adminState": "DOWN",
      "appId": "string",
      "bidirectional": "ANY_REVERSE_ROUTE",
      "bw": 5,
      "customAttributes": [
        {
          "attributeName": "string",
          "attributeValue": "string"
        }
      ],
      "customAttributesTemplateId": "string",
      "customerId": 7,
      "description": "string",
      "endpointExtensions": [
        {
          "connectedInner": 7,
          "connectedOuter": 2,
          "connectedPortId": "string",
          "customAttributes": [
            {},
            {},
            {},
            {}
          ],
          "nniPort": {},
          "uniPort": {}
        },
        {
          "connectedInner": 9,
          "connectedOuter": 10,
          "connectedPortId": "string",
          "customAttributes": [
            {}
          ],
          "nniPort": {},
          "uniPort": {}
        },
        {
          "connectedInner": 8,
          "connectedOuter": 4,
          "connectedPortId": "string",
          "customAttributes": [
            {},
            {},
            {},
            {},
            {},
            {},
            {},
            {},
            {}
          ],
          "nniPort": {},
          "uniPort": {}
        },
        {
          "connectedInner": 1,
          "connectedOuter": 8,
          "connectedPortId": "string",
          "customAttributes": [
            {}
          ],
          "nniPort": {},
          "uniPort": {}
        },
        {
          "connectedInner": 5,
          "connectedOuter": 7,
          "connectedPortId": "string",
          "customAttributes": [
            {},
            {},
            {},
            {},
            {},
            {},
            {},
            {},
            {}
          ],
          "nniPort": {},
          "uniPort": {}
        },
        {
          "connectedInner": 3,
          "connectedOuter": 7,
          "connectedPortId": "string",
          "customAttributes": [
            {},
            {},
            {},
            {},
            {},
            {},
            {},
            {},
            {}
          ],
          "nniPort": {},
          "uniPort": {}
        },
        {
          "connectedInner": 3,
          "connectedOuter": 3,
          "connectedPortId": "string",
          "customAttributes": [
            {},
            {},
            {},
            {},
            {},
            {},
            {},
            {},
            {}
          ],
          "nniPort": {},
          "uniPort": {}
        },
        {
          "connectedInner": 5,
          "connectedOuter": 8,
          "connectedPortId": "string",
          "customAttributes": [
            {},
            {},
            {},
            {},
            {},
            {},
            {},
            {},
            {},
            {}
          ],
          "nniPort": {},
          "uniPort": {}
        },
        {
          "connectedInner": 9,
          "connectedOuter": 2,
          "connectedPortId": "string",
          "customAttributes": [
            {},
            {},
            {},
            {}
          ],
          "nniPort": {},
          "uniPort": {}
        },
        {
          "connectedInner": 6,
          "connectedOuter": 1,
          "connectedPortId": "string",
          "customAttributes": [
            {},
            {},
            {},
            {},
            {},
            {},
            {},
            {},
            {},
            {}
          ],
          "nniPort": {},
          "uniPort": {}
        }
      ],
      "endpoints": [
        {
          "actualEndState": "Deployed",
          "adminState": "DOWN",
          "appId": "string",
          "customAttributes": [
            {},
            {},
            {}
          ],
          "customAttributesTemplateId": "string",
          "description": "string",
          "externalIds": [
            {},
            {},
            {},
            {},
            {},
            {},
            {}
          ],
          "id": "string",
          "name": "string",
          "neDeploymentState": "FAILED",
          "neId": "string",
          "neName": "string",
          "operationalState": "DEGRADED",
          "portAdminState": "MAINTENANCE",
          "portId": "string",
          "portName": "string",
          "portOperationalState": "UP",
          "portSpeed": 9,
          "serviceId": "string"
        },
        {
          "actualEndState": "Deployed",
          "adminState": "DOWN",
          "appId": "string",
          "customAttributes": [
            {},
            {},
            {},
            {},
            {},
            {},
            {},
            {},
            {}
          ],
          "customAttributesTemplateId": "string",
          "description": "string",
          "externalIds": [
            {},
            {},
            {},
            {},
            {},
            {},
            {}
          ],
          "id": "string",
          "name": "string",
          "neDeploymentState": "PENDING",
          "neId": "string",
          "neName": "string",
          "operationalState": "DEGRADED",
          "portAdminState": "UP",
          "portId": "string",
          "portName": "string",
          "portOperationalState": "DOWN",
          "portSpeed": 1,
          "serviceId": "string"
        }
      ],
      "externalIds": [
        {
          "context": "MDM",
          "id": "string",
          "location": [
            "string",
            "string",
            "string",
            "string"
          ]
        },
        {
          "context": "MDM",
          "id": "string",
          "location": [
            "string",
            "string",
            "string",
            "string"
          ]
        },
        {
          "context": "MDM",
          "id": "string",
          "location": [
            "string",
            "string",
            "string",
            "string",
            "string",
            "string",
            "string"
          ]
        },
        {
          "context": "NODE",
          "id": "string",
          "location": [
            "string"
          ]
        },
        {
          "context": "NSP",
          "id": "string",
          "location": [
            "string"
          ]
        },
        {
          "context": "NFM_P",
          "id": "string",
          "location": [
            "string",
            "string",
            "string",
            "string",
            "string",
            "string"
          ]
        }
      ],
      "groupId": "string",
      "id": "string",
      "lifeCycle": {
        "phase": "Activation",
        "reason": "string",
        "state": "Undeploy"
      },
      "maxCost": 9,
      "maxHops": 8,
      "maxLatency": 2,
      "name": "string",
      "neDeploymentState": "PENDING",
      "nodeServiceId": 3,
      "objective": "DISTANCE",
      "operationalState": "TRANSITION",
      "pathProfileId": "string",
      "requestedEndState": "Saved",
      "reverseBW": 6,
      "serviceType": "LAG",
      "templateId": "string",
      "tunnelSelectionId": "string"
    },
    "endRow": 2,
    "startRow": 8,
    "status": 2,
    "totalRows": 8
  }
}