{
  "response": {
    "data": {
      "adminState": "UP",
      "appId": "string",
      "autoBindType": "none",
      "bidirectional": "ASYMMETRIC_LOOSE",
      "customerId": 5,
      "extensionTemplate": {
        "allowL2ExtensionConfiguration": true,
        "enableL2ExtensionAugmentation": true,
        "nni": {
          "autosetTagsToMatchServiceEndpoint": true,
          "innerTag": 8,
          "outerTag": 7
        },
        "uni": {
          "innerTag": 1,
          "outerTag": 9
        }
      },
      "id": "string",
      "innerTag": 2,
      "maxCost": 8,
      "maxHops": 7,
      "maxLatency": 5,
      "mediationProfileId": "string",
      "meta": [
        "string",
        "string",
        "string",
        "string",
        "string",
        "string"
      ],
      "monitorBandwidth": false,
      "mtu": 7,
      "name": "string",
      "objectDescription": "string",
      "objective": "STAR_WEIGHT",
      "outerTag": 9,
      "portFilter": [
        {
          "condition1": {
            "operator": "string",
            "value": "string"
          },
          "condition2": {
            "operator": "string",
            "value": "string"
          },
          "connector": "string",
          "groupNum": 4,
          "name": "string",
          "operator": "string"
        }
      ],
      "qosId": "string",
      "qosName": "string",
      "relaxEndpointValidation": true,
      "tunnelSelectionId": "string",
      "vcType": "SATOP_E1",
      "workflowProfileId": "string",
      "workflowValidate": "string"
    },
    "endRow": 5,
    "startRow": 8,
    "status": 9,
    "totalRows": 10
  }
}