{
  "response": {
    "data": {
      "appId": "string",
      "id": "string",
      "mediationInfos": [
        {
          "mediationName": "string",
          "mediationVersion": "string",
          "templateGlobalName": "string"
        },
        {
          "mediationName": "string",
          "mediationVersion": "string",
          "templateGlobalName": "string"
        },
        {
          "mediationName": "string",
          "mediationVersion": "string",
          "templateGlobalName": "string"
        },
        {
          "mediationName": "string",
          "mediationVersion": "string",
          "templateGlobalName": "string"
        },
        {
          "mediationName": "string",
          "mediationVersion": "string",
          "templateGlobalName": "string"
        }
      ],
      "name": "string",
      "objectDescription": "string",
      "profileType": "IES"
    },
    "endRow": 8,
    "startRow": 1,
    "status": 6,
    "totalRows": 4
  }
}