{
  "response": {
    "data": {
      "destination": {
        "destNode": "string",
        "destTp": "string"
      },
      "linkId": {
        "uri": {}
      },
      "nspLink": {
        "linkConfig": {},
        "linkState": {}
      },
      "source": {
        "sourceNode": "string",
        "sourceTp": "string"
      },
      "supportingLink": {}
    },
    "endRow": 2,
    "startRow": 6,
    "status": 4,
    "totalRows": 10
  }
}