{
  "response": {
    "data": {
      "address": "string",
      "contactPerson": "string",
      "customerName": "string",
      "description": "string",
      "email": "string",
      "id": 5,
      "phoneNumber": "string"
    },
    "endRow": 8,
    "startRow": 6,
    "status": 6,
    "totalRows": 7
  }
}