{
  "response": {
    "data": {
      "actualEndState": "Deployed",
      "adminState": "DOWN",
      "appId": "string",
      "bidirectional": "ASYMMETRIC_STRICT",
      "bw": 3,
      "customAttributes": [
        {
          "attributeName": "string",
          "attributeValue": "string"
        },
        {
          "attributeName": "string",
          "attributeValue": "string"
        },
        {
          "attributeName": "string",
          "attributeValue": "string"
        },
        {
          "attributeName": "string",
          "attributeValue": "string"
        },
        {
          "attributeName": "string",
          "attributeValue": "string"
        }
      ],
      "customAttributesTemplateId": "string",
      "customerId": 1,
      "description": "string",
      "endpointExtensions": [
        {
          "connectedInner": 10,
          "connectedOuter": 2,
          "connectedPortId": "string",
          "customAttributes": [
            {},
            {},
            {},
            {},
            {},
            {},
            {},
            {},
            {},
            {}
          ],
          "nniPort": {},
          "uniPort": {}
        },
        {
          "connectedInner": 10,
          "connectedOuter": 7,
          "connectedPortId": "string",
          "customAttributes": [
            {},
            {}
          ],
          "nniPort": {},
          "uniPort": {}
        },
        {
          "connectedInner": 10,
          "connectedOuter": 10,
          "connectedPortId": "string",
          "customAttributes": [
            {},
            {},
            {},
            {}
          ],
          "nniPort": {},
          "uniPort": {}
        },
        {
          "connectedInner": 4,
          "connectedOuter": 5,
          "connectedPortId": "string",
          "customAttributes": [
            {},
            {},
            {},
            {},
            {},
            {},
            {},
            {},
            {},
            {}
          ],
          "nniPort": {},
          "uniPort": {}
        },
        {
          "connectedInner": 4,
          "connectedOuter": 4,
          "connectedPortId": "string",
          "customAttributes": [
            {},
            {},
            {}
          ],
          "nniPort": {},
          "uniPort": {}
        },
        {
          "connectedInner": 3,
          "connectedOuter": 2,
          "connectedPortId": "string",
          "customAttributes": [
            {},
            {},
            {},
            {},
            {},
            {}
          ],
          "nniPort": {},
          "uniPort": {}
        },
        {
          "connectedInner": 3,
          "connectedOuter": 10,
          "connectedPortId": "string",
          "customAttributes": [
            {},
            {},
            {},
            {},
            {},
            {},
            {},
            {},
            {},
            {}
          ],
          "nniPort": {},
          "uniPort": {}
        },
        {
          "connectedInner": 9,
          "connectedOuter": 3,
          "connectedPortId": "string",
          "customAttributes": [
            {},
            {}
          ],
          "nniPort": {},
          "uniPort": {}
        },
        {
          "connectedInner": 4,
          "connectedOuter": 3,
          "connectedPortId": "string",
          "customAttributes": [
            {},
            {},
            {},
            {},
            {},
            {},
            {},
            {}
          ],
          "nniPort": {},
          "uniPort": {}
        }
      ],
      "endpoints": [
        {
          "actualEndState": "Saved",
          "adminState": "DOWN",
          "appId": "string",
          "customAttributes": [
            {},
            {},
            {},
            {},
            {},
            {},
            {},
            {}
          ],
          "customAttributesTemplateId": "string",
          "description": "string",
          "externalIds": [
            {},
            {}
          ],
          "id": "string",
          "name": "string",
          "neDeploymentState": "NA",
          "neId": "string",
          "neName": "string",
          "operationalState": "UP",
          "portAdminState": "MAINTENANCE",
          "portId": "string",
          "portName": "string",
          "portOperationalState": "TRANSITION",
          "portSpeed": 3,
          "serviceId": "string"
        }
      ],
      "externalIds": [
        {
          "context": "NFM_P",
          "id": "string",
          "location": [
            "string",
            "string",
            "string"
          ]
        }
      ],
      "groupId": "string",
      "id": "string",
      "lifeCycle": {
        "phase": "Activation",
        "reason": "string",
        "state": "Undeployed"
      },
      "maxCost": 10,
      "maxHops": 2,
      "maxLatency": 7,
      "name": "string",
      "neDeploymentState": "NA",
      "nodeServiceId": 10,
      "objective": "LATENCY",
      "operationalState": "PARTIALLY_DOWN",
      "pathProfileId": "string",
      "requestedEndState": "Saved",
      "reverseBW": 1,
      "serviceType": "L2_BACKHAUL",
      "templateId": "string",
      "tunnelSelectionId": "string"
    },
    "endRow": 7,
    "startRow": 3,
    "status": 3,
    "totalRows": 2
  }
}