{
  "response": {
    "data": {
      "actualEndState": "Deployed",
      "adminState": "UP",
      "appId": "string",
      "bidirectional": "SYMMETRIC_STRICT",
      "bw": 4,
      "customAttributes": [
        {
          "attributeName": "string",
          "attributeValue": "string"
        },
        {
          "attributeName": "string",
          "attributeValue": "string"
        },
        {
          "attributeName": "string",
          "attributeValue": "string"
        }
      ],
      "customAttributesTemplateId": "string",
      "customerId": 1,
      "description": "string",
      "endpointExtensions": [
        {
          "connectedInner": 4,
          "connectedOuter": 6,
          "connectedPortId": "string",
          "customAttributes": [
            {},
            {},
            {},
            {},
            {},
            {},
            {}
          ],
          "nniPort": {},
          "uniPort": {}
        },
        {
          "connectedInner": 1,
          "connectedOuter": 10,
          "connectedPortId": "string",
          "customAttributes": [
            {},
            {}
          ],
          "nniPort": {},
          "uniPort": {}
        },
        {
          "connectedInner": 8,
          "connectedOuter": 10,
          "connectedPortId": "string",
          "customAttributes": [
            {},
            {},
            {}
          ],
          "nniPort": {},
          "uniPort": {}
        },
        {
          "connectedInner": 10,
          "connectedOuter": 4,
          "connectedPortId": "string",
          "customAttributes": [
            {}
          ],
          "nniPort": {},
          "uniPort": {}
        },
        {
          "connectedInner": 9,
          "connectedOuter": 5,
          "connectedPortId": "string",
          "customAttributes": [
            {}
          ],
          "nniPort": {},
          "uniPort": {}
        }
      ],
      "endpoints": [
        {
          "actualEndState": "Saved",
          "adminState": "UP",
          "appId": "string",
          "customAttributes": [
            {},
            {},
            {},
            {},
            {},
            {},
            {}
          ],
          "customAttributesTemplateId": "string",
          "description": "string",
          "externalIds": [
            {},
            {},
            {},
            {},
            {}
          ],
          "id": "string",
          "name": "string",
          "neDeploymentState": "UNKNOWN",
          "neId": "string",
          "neName": "string",
          "operationalState": "UP",
          "portAdminState": "UP",
          "portId": "string",
          "portName": "string",
          "portOperationalState": "DOWN",
          "portSpeed": 5,
          "serviceId": "string"
        }
      ],
      "externalIds": [
        {
          "context": "NFM_T",
          "id": "string",
          "location": [
            "string",
            "string",
            "string",
            "string",
            "string"
          ]
        },
        {
          "context": "MDM",
          "id": "string",
          "location": [
            "string",
            "string",
            "string",
            "string",
            "string",
            "string",
            "string"
          ]
        },
        {
          "context": "NFM_T",
          "id": "string",
          "location": [
            "string",
            "string",
            "string",
            "string",
            "string",
            "string"
          ]
        },
        {
          "context": "NFM_P",
          "id": "string",
          "location": [
            "string",
            "string",
            "string",
            "string",
            "string",
            "string",
            "string",
            "string"
          ]
        },
        {
          "context": "NFM_T",
          "id": "string",
          "location": [
            "string",
            "string",
            "string",
            "string",
            "string"
          ]
        },
        {
          "context": "NODE",
          "id": "string",
          "location": [
            "string",
            "string"
          ]
        }
      ],
      "groupId": "string",
      "id": "string",
      "lifeCycle": {
        "phase": "Planning",
        "reason": "string",
        "state": "Saved"
      },
      "maxCost": 7,
      "maxHops": 1,
      "maxLatency": 6,
      "name": "string",
      "neDeploymentState": "NA",
      "nodeServiceId": 6,
      "objective": "LATENCY",
      "operationalState": "TRANSITION",
      "pathProfileId": "string",
      "requestedEndState": "Saved",
      "reverseBW": 1,
      "serviceType": "PHYSICAL_LINK",
      "templateId": "string",
      "tunnelSelectionId": "string"
    },
    "endRow": 9,
    "startRow": 10,
    "status": 4,
    "totalRows": 7
  }
}