{
  "response": {
    "data": [
      {
        "adminState": "MAINTENANCE",
        "appId": "string",
        "autobind": "any",
        "bidirectional": "ASYMMETRIC_STRICT",
        "customerId": 7,
        "id": "string",
        "innerTag": 10,
        "maxCost": 5,
        "maxHops": 9,
        "maxLatency": 3,
        "mediationProfileId": "string",
        "meta": [
          "string",
          "string",
          "string",
          "string",
          "string",
          "string",
          "string",
          "string"
        ],
        "mtu": 9,
        "name": "string",
        "objectDescription": "string",
        "objective": "LATENCY",
        "outerTag": 4,
        "portFilter": [
          {
            "condition1": {
              "operator": "string",
              "value": "string"
            },
            "condition2": {
              "operator": "string",
              "value": "string"
            },
            "connector": "string",
            "groupNum": 5,
            "name": "string",
            "operator": "string"
          },
          {
            "condition1": {
              "operator": "string",
              "value": "string"
            },
            "condition2": {
              "operator": "string",
              "value": "string"
            },
            "connector": "string",
            "groupNum": 5,
            "name": "string",
            "operator": "string"
          },
          {
            "condition1": {
              "operator": "string",
              "value": "string"
            },
            "condition2": {
              "operator": "string",
              "value": "string"
            },
            "connector": "string",
            "groupNum": 6,
            "name": "string",
            "operator": "string"
          },
          {
            "condition1": {
              "operator": "string",
              "value": "string"
            },
            "condition2": {
              "operator": "string",
              "value": "string"
            },
            "connector": "string",
            "groupNum": 10,
            "name": "string",
            "operator": "string"
          }
        ],
        "qosId": "string",
        "qosName": "string",
        "rdRtRangePolicyId": "string",
        "relaxEndpointValidation": true,
        "transportSliceName": "string",
        "tunnelSelectionId": "string",
        "vrfPerEndpoint": false,
        "workflowProfileId": "string",
        "workflowValidate": "string"
      }
    ],
    "endRow": 5,
    "startRow": 10,
    "status": 5,
    "totalRows": 5
  }
}