{
  "response": {
    "data": {
      "appId": "string",
      "id": "string",
      "name": "string",
      "objectDescription": "string",
      "reversionPolicy": {
        "reversionMode": "non_revertive",
        "waitToRevertTime": {
          "time": {}
        }
      },
      "switchPolicy": {
        "waitToSwitchTime": {
          "time": {}
        }
      }
    },
    "endRow": 3,
    "startRow": 8,
    "status": 8,
    "totalRows": 8
  }
}