{
  "$id": "schema.json",
  "type": "object",
  "schema": "http://json-schema.org/draft-07/schema#",
  "translate": false,
  "dynamicfields": true,
  "properties": {
    "ph_request_type": {
      "type": "string",
      "description": "type of request (internal to adapter)",
      "default": "getLatency",
      "enum": [
        "getLatency",
        "patchLatency",
        "deleteLatency",
        "getTcaConfigPolicy",
        "patchTcaConfigPolicy",
        "getTrafficDataCollection",
        "patchTrafficDataCollection",
        "getNrcpHistorical",
        "patchNrcpHistorical",
        "getSrPolicyConfig",
        "patchSrPolicyConfig",
        "getAssocGroupConfig",
        "patchAssocGroupConfig",
        "getBsidGenerationConfig",
        "patchBsidGenerationConfig",
        "getDeviceNameIpService",
        "patchDeviceNameIpService",
        "getLspBsidGenerationConfig",
        "patchLspBsidGenerationConfig"
      ],
      "external_name": "ph_request_type"
    }
  },
  "definitions": {}
}