{
  "response": {
    "data": [
      {
        "administrativeFailureErrorCode": "INTERNAL_ERROR",
        "administrativeState": "MAINTENANCE",
        "computationState": "UNKNOWN",
        "computedHops": {},
        "creationType": "REQUESTED",
        "destinationAddress": {},
        "destinationId": "string",
        "destinationNetworkName": [
          "string",
          "string",
          "string"
        ],
        "latency": 6,
        "lifecycleState": "PartiallyDeployed",
        "lspId": "string",
        "maintenanceAffected": "HOPS_IN_MAINTENANCE",
        "operationalState": "UNKNOWN",
        "ownershipState": {},
        "paramsConfig": {},
        "paramsState": {},
        "pathErrorCode": "PCC_NOT_EXIST",
        "pathId": "string",
        "pathName": "string",
        "pathType": "UNKNOWN",
        "protectionState": "ACTIVE",
        "protectionType": "UNKNOWN",
        "provisionedHops": {},
        "recordedHops": {},
        "sourceAddress": {},
        "sourceId": "string",
        "sourceNetworkName": [
          "string",
          "string",
          "string",
          "string",
          "string",
          "string",
          "string",
          "string"
        ],
        "sourceRouterAddress": {},
        "tunnelId": 3
      },
      {
        "administrativeFailureErrorCode": "UNKNOWN_REASON",
        "administrativeState": "DOWN",
        "computationState": "PATH_NOT_FOUND",
        "computedHops": {},
        "creationType": "UNKNOWN",
        "destinationAddress": {},
        "destinationId": "string",
        "destinationNetworkName": [
          "string",
          "string",
          "string"
        ],
        "latency": 8,
        "lifecycleState": "Routing",
        "lspId": "string",
        "maintenanceAffected": "MAINTENANCE_CLEAR",
        "operationalState": "DEGRADED",
        "ownershipState": {},
        "paramsConfig": {},
        "paramsState": {},
        "pathErrorCode": "SYNC_DELETE",
        "pathId": "string",
        "pathName": "string",
        "pathType": "UNKNOWN",
        "protectionState": "UNKNOWN",
        "protectionType": "PRIMARY",
        "provisionedHops": {},
        "recordedHops": {},
        "sourceAddress": {},
        "sourceId": "string",
        "sourceNetworkName": [
          "string",
          "string",
          "string",
          "string",
          "string",
          "string",
          "string",
          "string",
          "string",
          "string"
        ],
        "sourceRouterAddress": {},
        "tunnelId": 2
      },
      {
        "administrativeFailureErrorCode": "PCE_NOT_FOUND",
        "administrativeState": "DOWN",
        "computationState": "UNKNOWN",
        "computedHops": {},
        "creationType": "REQUESTED",
        "destinationAddress": {},
        "destinationId": "string",
        "destinationNetworkName": [
          "string",
          "string",
          "string",
          "string",
          "string"
        ],
        "latency": 5,
        "lifecycleState": "RoutingFailed",
        "lspId": "string",
        "maintenanceAffected": "NONE",
        "operationalState": "UNKNOWN",
        "ownershipState": {},
        "paramsConfig": {},
        "paramsState": {},
        "pathErrorCode": "INTERNAL_ERROR",
        "pathId": "string",
        "pathName": "string",
        "pathType": "UNKNOWN",
        "protectionState": "ACTIVE",
        "protectionType": "SECONDARY",
        "provisionedHops": {},
        "recordedHops": {},
        "sourceAddress": {},
        "sourceId": "string",
        "sourceNetworkName": [
          "string",
          "string",
          "string"
        ],
        "sourceRouterAddress": {},
        "tunnelId": 4
      },
      {
        "administrativeFailureErrorCode": "UNACCEPTABLE_PARAM",
        "administrativeState": "DOWN",
        "computationState": "PATH_NOT_COMPUTED",
        "computedHops": {},
        "creationType": "PROVISIONED",
        "destinationAddress": {},
        "destinationId": "string",
        "destinationNetworkName": [
          "string",
          "string",
          "string"
        ],
        "latency": 2,
        "lifecycleState": "Saved",
        "lspId": "string",
        "maintenanceAffected": "NONE",
        "operationalState": "UP",
        "ownershipState": {},
        "paramsConfig": {},
        "paramsState": {},
        "pathErrorCode": "PCE_NOT_FOUND",
        "pathId": "string",
        "pathName": "string",
        "pathType": "UNKNOWN",
        "protectionState": "UNKNOWN",
        "protectionType": "UNKNOWN",
        "provisionedHops": {},
        "recordedHops": {},
        "sourceAddress": {},
        "sourceId": "string",
        "sourceNetworkName": [
          "string",
          "string",
          "string",
          "string",
          "string",
          "string",
          "string",
          "string",
          "string",
          "string"
        ],
        "sourceRouterAddress": {},
        "tunnelId": 4
      },
      {
        "administrativeFailureErrorCode": "NO_ERROR",
        "administrativeState": "UP",
        "computationState": "PATH_NOT_COMPUTED",
        "computedHops": {},
        "creationType": "DISCOVERED",
        "destinationAddress": {},
        "destinationId": "string",
        "destinationNetworkName": [
          "string",
          "string",
          "string",
          "string",
          "string",
          "string",
          "string"
        ],
        "latency": 9,
        "lifecycleState": "DeploymentFailed",
        "lspId": "string",
        "maintenanceAffected": "HOPS_IN_MAINTENANCE",
        "operationalState": "PARTIALLY_DOWN",
        "ownershipState": {},
        "paramsConfig": {},
        "paramsState": {},
        "pathErrorCode": "PCC_INTERNAL_ERROR",
        "pathId": "string",
        "pathName": "string",
        "pathType": "UNKNOWN",
        "protectionState": "UNKNOWN",
        "protectionType": "UNKNOWN",
        "provisionedHops": {},
        "recordedHops": {},
        "sourceAddress": {},
        "sourceId": "string",
        "sourceNetworkName": [
          "string",
          "string",
          "string"
        ],
        "sourceRouterAddress": {},
        "tunnelId": 8
      },
      {
        "administrativeFailureErrorCode": "NSP_INTERNAL",
        "administrativeState": "UP",
        "computationState": "UNKNOWN",
        "computedHops": {},
        "creationType": "PROVISIONED",
        "destinationAddress": {},
        "destinationId": "string",
        "destinationNetworkName": [
          "string",
          "string"
        ],
        "latency": 8,
        "lifecycleState": "Deployed",
        "lspId": "string",
        "maintenanceAffected": "MAINTENANCE_CLEAR",
        "operationalState": "DEGRADED",
        "ownershipState": {},
        "paramsConfig": {},
        "paramsState": {},
        "pathErrorCode": "PCC_NOT_EXIST",
        "pathId": "string",
        "pathName": "string",
        "pathType": "RSVP",
        "protectionState": "ACTIVE",
        "protectionType": "STANDBY",
        "provisionedHops": {},
        "recordedHops": {},
        "sourceAddress": {},
        "sourceId": "string",
        "sourceNetworkName": [
          "string",
          "string"
        ],
        "sourceRouterAddress": {},
        "tunnelId": 3
      },
      {
        "administrativeFailureErrorCode": "UNDEFINED_PATH_ERR",
        "administrativeState": "UP",
        "computationState": "UNKNOWN",
        "computedHops": {},
        "creationType": "UNKNOWN",
        "destinationAddress": {},
        "destinationId": "string",
        "destinationNetworkName": [
          "string",
          "string",
          "string",
          "string",
          "string"
        ],
        "latency": 2,
        "lifecycleState": "Undeployed",
        "lspId": "string",
        "maintenanceAffected": "HOPS_IN_MAINTENANCE",
        "operationalState": "PARTIALLY_DOWN",
        "ownershipState": {},
        "paramsConfig": {},
        "paramsState": {},
        "pathErrorCode": "INVALID_PLSPID",
        "pathId": "string",
        "pathName": "string",
        "pathType": "UNKNOWN",
        "protectionState": "UNKNOWN",
        "protectionType": "SECONDARY",
        "provisionedHops": {},
        "recordedHops": {},
        "sourceAddress": {},
        "sourceId": "string",
        "sourceNetworkName": [
          "string",
          "string",
          "string",
          "string",
          "string",
          "string",
          "string",
          "string",
          "string"
        ],
        "sourceRouterAddress": {},
        "tunnelId": 1
      },
      {
        "administrativeFailureErrorCode": "UNACCEPTABLE_PARAM",
        "administrativeState": "UP",
        "computationState": "PATH_NOT_FOUND",
        "computedHops": {},
        "creationType": "UNKNOWN",
        "destinationAddress": {},
        "destinationId": "string",
        "destinationNetworkName": [
          "string"
        ],
        "latency": 1,
        "lifecycleState": "WaitingForDeployment",
        "lspId": "string",
        "maintenanceAffected": "NONE",
        "operationalState": "UNKNOWN",
        "ownershipState": {},
        "paramsConfig": {},
        "paramsState": {},
        "pathErrorCode": "VSR_NOT_EXSIST",
        "pathId": "string",
        "pathName": "string",
        "pathType": "UNKNOWN",
        "protectionState": "ACTIVE",
        "protectionType": "SECONDARY",
        "provisionedHops": {},
        "recordedHops": {},
        "sourceAddress": {},
        "sourceId": "string",
        "sourceNetworkName": [
          "string",
          "string",
          "string",
          "string",
          "string",
          "string",
          "string",
          "string"
        ],
        "sourceRouterAddress": {},
        "tunnelId": 2
      },
      {
        "administrativeFailureErrorCode": "NO_RESPONSE",
        "administrativeState": "MAINTENANCE",
        "computationState": "PATH_NOT_COMPUTED",
        "computedHops": {},
        "creationType": "UNKNOWN",
        "destinationAddress": {},
        "destinationId": "string",
        "destinationNetworkName": [
          "string",
          "string"
        ],
        "latency": 4,
        "lifecycleState": "Deployed",
        "lspId": "string",
        "maintenanceAffected": "MAINTENANCE_CLEAR",
        "operationalState": "UP",
        "ownershipState": {},
        "paramsConfig": {},
        "paramsState": {},
        "pathErrorCode": "SYNC_DELETE",
        "pathId": "string",
        "pathName": "string",
        "pathType": "UNKNOWN",
        "protectionState": "INACTIVE",
        "protectionType": "STANDBY",
        "provisionedHops": {},
        "recordedHops": {},
        "sourceAddress": {},
        "sourceId": "string",
        "sourceNetworkName": [
          "string",
          "string",
          "string",
          "string",
          "string",
          "string",
          "string",
          "string",
          "string",
          "string"
        ],
        "sourceRouterAddress": {},
        "tunnelId": 8
      }
    ],
    "endRow": 8,
    "startRow": 1,
    "status": 9,
    "totalRows": 10
  }
}