{
  "response": {
    "data": {
      "actualEndState": "Saved",
      "adminState": "MAINTENANCE",
      "appId": "string",
      "bidirectional": "SYMMETRIC_LOOSE",
      "bw": 5,
      "customAttributes": [
        {
          "attributeName": "string",
          "attributeValue": "string"
        },
        {
          "attributeName": "string",
          "attributeValue": "string"
        },
        {
          "attributeName": "string",
          "attributeValue": "string"
        },
        {
          "attributeName": "string",
          "attributeValue": "string"
        }
      ],
      "customAttributesTemplateId": "string",
      "customerId": 3,
      "description": "string",
      "endpointExtensions": [
        {
          "connectedInner": 1,
          "connectedOuter": 5,
          "connectedPortId": "string",
          "customAttributes": [
            {},
            {},
            {},
            {},
            {},
            {}
          ],
          "nniPort": {},
          "uniPort": {}
        },
        {
          "connectedInner": 8,
          "connectedOuter": 8,
          "connectedPortId": "string",
          "customAttributes": [
            {},
            {},
            {},
            {},
            {},
            {},
            {},
            {}
          ],
          "nniPort": {},
          "uniPort": {}
        },
        {
          "connectedInner": 4,
          "connectedOuter": 7,
          "connectedPortId": "string",
          "customAttributes": [
            {},
            {},
            {},
            {},
            {},
            {},
            {}
          ],
          "nniPort": {},
          "uniPort": {}
        },
        {
          "connectedInner": 2,
          "connectedOuter": 1,
          "connectedPortId": "string",
          "customAttributes": [
            {},
            {},
            {},
            {},
            {},
            {}
          ],
          "nniPort": {},
          "uniPort": {}
        },
        {
          "connectedInner": 8,
          "connectedOuter": 7,
          "connectedPortId": "string",
          "customAttributes": [
            {},
            {},
            {},
            {},
            {},
            {},
            {},
            {},
            {},
            {}
          ],
          "nniPort": {},
          "uniPort": {}
        }
      ],
      "endpoints": [
        {
          "actualEndState": "Saved",
          "adminState": "UP",
          "appId": "string",
          "customAttributes": [
            {},
            {},
            {},
            {}
          ],
          "customAttributesTemplateId": "string",
          "description": "string",
          "externalIds": [
            {},
            {},
            {},
            {},
            {},
            {},
            {}
          ],
          "id": "string",
          "name": "string",
          "neDeploymentState": "DEPLOYED",
          "neId": "string",
          "neName": "string",
          "operationalState": "TRANSITION",
          "portAdminState": "DOWN",
          "portId": "string",
          "portName": "string",
          "portOperationalState": "UP",
          "portSpeed": 3,
          "serviceId": "string"
        },
        {
          "actualEndState": "Deployed",
          "adminState": "UP",
          "appId": "string",
          "customAttributes": [
            {},
            {},
            {},
            {}
          ],
          "customAttributesTemplateId": "string",
          "description": "string",
          "externalIds": [
            {},
            {},
            {},
            {},
            {},
            {},
            {},
            {}
          ],
          "id": "string",
          "name": "string",
          "neDeploymentState": "UNKNOWN",
          "neId": "string",
          "neName": "string",
          "operationalState": "DOWN",
          "portAdminState": "MAINTENANCE",
          "portId": "string",
          "portName": "string",
          "portOperationalState": "DOWN",
          "portSpeed": 7,
          "serviceId": "string"
        },
        {
          "actualEndState": "Deployed",
          "adminState": "MAINTENANCE",
          "appId": "string",
          "customAttributes": [
            {},
            {},
            {},
            {},
            {},
            {},
            {},
            {},
            {},
            {}
          ],
          "customAttributesTemplateId": "string",
          "description": "string",
          "externalIds": [
            {}
          ],
          "id": "string",
          "name": "string",
          "neDeploymentState": "NA",
          "neId": "string",
          "neName": "string",
          "operationalState": "UP",
          "portAdminState": "MAINTENANCE",
          "portId": "string",
          "portName": "string",
          "portOperationalState": "PARTIALLY_DOWN",
          "portSpeed": 3,
          "serviceId": "string"
        },
        {
          "actualEndState": "Deployed",
          "adminState": "MAINTENANCE",
          "appId": "string",
          "customAttributes": [
            {},
            {},
            {},
            {},
            {},
            {}
          ],
          "customAttributesTemplateId": "string",
          "description": "string",
          "externalIds": [
            {},
            {},
            {},
            {}
          ],
          "id": "string",
          "name": "string",
          "neDeploymentState": "UNKNOWN",
          "neId": "string",
          "neName": "string",
          "operationalState": "DOWN",
          "portAdminState": "UP",
          "portId": "string",
          "portName": "string",
          "portOperationalState": "UP",
          "portSpeed": 9,
          "serviceId": "string"
        },
        {
          "actualEndState": "Deployed",
          "adminState": "DOWN",
          "appId": "string",
          "customAttributes": [
            {},
            {},
            {},
            {},
            {},
            {},
            {}
          ],
          "customAttributesTemplateId": "string",
          "description": "string",
          "externalIds": [
            {},
            {},
            {}
          ],
          "id": "string",
          "name": "string",
          "neDeploymentState": "DEPLOYED",
          "neId": "string",
          "neName": "string",
          "operationalState": "DEGRADED",
          "portAdminState": "MAINTENANCE",
          "portId": "string",
          "portName": "string",
          "portOperationalState": "TRANSITION",
          "portSpeed": 9,
          "serviceId": "string"
        },
        {
          "actualEndState": "Deployed",
          "adminState": "UP",
          "appId": "string",
          "customAttributes": [
            {}
          ],
          "customAttributesTemplateId": "string",
          "description": "string",
          "externalIds": [
            {},
            {},
            {},
            {},
            {}
          ],
          "id": "string",
          "name": "string",
          "neDeploymentState": "NA",
          "neId": "string",
          "neName": "string",
          "operationalState": "DEGRADED",
          "portAdminState": "UP",
          "portId": "string",
          "portName": "string",
          "portOperationalState": "TRANSITION",
          "portSpeed": 2,
          "serviceId": "string"
        },
        {
          "actualEndState": "Saved",
          "adminState": "MAINTENANCE",
          "appId": "string",
          "customAttributes": [
            {},
            {},
            {}
          ],
          "customAttributesTemplateId": "string",
          "description": "string",
          "externalIds": [
            {}
          ],
          "id": "string",
          "name": "string",
          "neDeploymentState": "PENDING",
          "neId": "string",
          "neName": "string",
          "operationalState": "DOWN",
          "portAdminState": "MAINTENANCE",
          "portId": "string",
          "portName": "string",
          "portOperationalState": "DOWN",
          "portSpeed": 4,
          "serviceId": "string"
        },
        {
          "actualEndState": "Saved",
          "adminState": "UP",
          "appId": "string",
          "customAttributes": [
            {},
            {},
            {},
            {},
            {},
            {}
          ],
          "customAttributesTemplateId": "string",
          "description": "string",
          "externalIds": [
            {},
            {},
            {},
            {},
            {},
            {},
            {},
            {}
          ],
          "id": "string",
          "name": "string",
          "neDeploymentState": "NA",
          "neId": "string",
          "neName": "string",
          "operationalState": "UNKNOWN",
          "portAdminState": "MAINTENANCE",
          "portId": "string",
          "portName": "string",
          "portOperationalState": "PARTIALLY_DOWN",
          "portSpeed": 3,
          "serviceId": "string"
        },
        {
          "actualEndState": "Deployed",
          "adminState": "MAINTENANCE",
          "appId": "string",
          "customAttributes": [
            {}
          ],
          "customAttributesTemplateId": "string",
          "description": "string",
          "externalIds": [
            {},
            {},
            {},
            {},
            {}
          ],
          "id": "string",
          "name": "string",
          "neDeploymentState": "NA",
          "neId": "string",
          "neName": "string",
          "operationalState": "PARTIALLY_DOWN",
          "portAdminState": "DOWN",
          "portId": "string",
          "portName": "string",
          "portOperationalState": "PARTIALLY_DOWN",
          "portSpeed": 6,
          "serviceId": "string"
        }
      ],
      "externalIds": [
        {
          "context": "MDM",
          "id": "string",
          "location": [
            "string",
            "string",
            "string",
            "string",
            "string"
          ]
        },
        {
          "context": "MDM",
          "id": "string",
          "location": [
            "string",
            "string",
            "string"
          ]
        },
        {
          "context": "NFM_P",
          "id": "string",
          "location": [
            "string",
            "string",
            "string",
            "string",
            "string",
            "string",
            "string"
          ]
        },
        {
          "context": "NFM_P",
          "id": "string",
          "location": [
            "string",
            "string",
            "string",
            "string"
          ]
        }
      ],
      "groupId": "string",
      "id": "string",
      "lifeCycle": {
        "phase": "Deployment",
        "reason": "string",
        "state": "RoutingFailed"
      },
      "maxCost": 2,
      "maxHops": 5,
      "maxLatency": 2,
      "name": "string",
      "neDeploymentState": "PENDING",
      "nodeServiceId": 1,
      "objective": "TE_METRIC",
      "operationalState": "TRANSITION",
      "pathProfileId": "string",
      "requestedEndState": "Saved",
      "reverseBW": 7,
      "serviceType": "L2_EXTENSION_UNI",
      "templateId": "string",
      "tunnelSelectionId": "string"
    },
    "endRow": 3,
    "startRow": 1,
    "status": 8,
    "totalRows": 9
  }
}