{
  "nokia-conf:port": [
    {
      "port-id": "1/1/1",
      "admin-state": "enable"
    },
    {
      "port-id": "1/1/9",
      "admin-state": "enable"
    },
    {
      "port-id": "1/1/10",
      "admin-state": "enable"
    }
  ]
}