{
  "portId": "1",
  "name": "My switch port",
  "tags": [
    "tag1",
    "tag2"
  ],
  "enabled": true,
  "poeEnabled": true,
  "type": "access",
  "vlan": 10,
  "voiceVlan": 20,
  "allowedVlans": "1,3,5-10",
  "isolationEnabled": false,
  "rstpEnabled": true,
  "stpGuard": "disabled",
  "linkNegotiation": "Auto negotiate",
  "linkNegotiationCapabilities": [
    "Auto negotiate",
    "1 Gigabit full duplex (auto)"
  ],
  "portScheduleId": "1234",
  "udld": "Alert only",
  "accessPolicyType": "Sticky MAC allow list",
  "accessPolicyNumber": 2,
  "macAllowList": [
    "34:56:fe:ce:8e:b0",
    "34:56:fe:ce:8e:b1"
  ],
  "stickyMacAllowList": [
    "34:56:fe:ce:8e:b0",
    "34:56:fe:ce:8e:b1"
  ],
  "stickyMacAllowListLimit": 5,
  "stormControlEnabled": true,
  "flexibleStackingEnabled": true
}