{
  "$id": "schema.json",
  "type": "object",
  "schema": "http://json-schema.org/draft-07/schema#",
  "translate": false,
  "dynamicfields": true,
  "properties": {
    "ph_request_type": {
      "type": "string",
      "description": "type of request (internal to adapter)",
      "default": "createNetworkSmProfileClarity",
      "enum": [
        "createNetworkSmProfileClarity",
        "updateNetworkSmProfileClarity",
        "addNetworkSmProfileClarity",
        "getNetworkSmProfileClarity",
        "deleteNetworkSmProfileClarity",
        "createNetworkSmProfileUmbrella",
        "updateNetworkSmProfileUmbrella",
        "addNetworkSmProfileUmbrella",
        "getNetworkSmProfileUmbrella",
        "deleteNetworkSmProfileUmbrella",
        "createNetworkSmAppPolaris",
        "getNetworkSmAppPolaris",
        "updateNetworkSmAppPolaris",
        "deleteNetworkSmAppPolaris",
        "getNetworkSmDevices",
        "getNetworkSmUsers",
        "getNetworkSmUserDeviceProfiles",
        "getNetworkSmDeviceProfiles",
        "getNetworkSmUserSoftwares",
        "getNetworkSmSoftwares",
        "getNetworkSmNetworkAdapters",
        "getNetworkSmWlanLists",
        "getNetworkSmSecurityCenters",
        "getNetworkSmRestrictions",
        "getNetworkSmCerts",
        "updateNetworkSmDevicesTags",
        "updateNetworkSmDevicesTagsV1",
        "updateNetworkSmDeviceFields",
        "lockNetworkSmDevices",
        "wipeNetworkSmDevice",
        "wipeNetworkSmDeviceV1",
        "checkinNetworkSmDevices",
        "checkinNetworkSmDevicesV1",
        "moveNetworkSmDevices",
        "moveNetworkSmDevicesV1",
        "unenrollNetworkSmDevice",
        "updateNetworkSmProfileReinstall",
        "getNetworkSmProfiles",
        "deleteNetworkSmProfile",
        "createNetworkSmProfileCreate",
        "getNetworkSmCellularUsageHistory",
        "getNetworkSmPerformanceHistory",
        "getNetworkSmDesktopLogs",
        "getNetworkSmDeviceCommandLogs",
        "getNetworkSmConnectivity",
        "refreshTheDetailsOfADevice"
      ],
      "external_name": "ph_request_type"
    }
  },
  "definitions": {}
}