{
  "actions": [
    {
      "name": "getDeviceCellularGatewaySettingsPortForwardingRules",
      "protocol": "REST",
      "method": "GET",
      "entitypath": {
        "v0": "{base_path}/{version}/devices/{pathv1}/cellularGateway/settings/portForwardingRules?{query}",
        "v1": "{base_path}/{version}/devices/{pathv1}/cellularGateway/portForwardingRules?{query}"
      },
      "requestSchema": "schema.json",
      "responseSchema": "schema.json",
      "timeout": 0,
      "sendEmpty": false,
      "sendGetBody": false,
      "requestDatatype": "JSON",
      "responseDatatype": "JSON",
      "headers": {},
      "responseObjects": [
        {
          "type": "default",
          "key": "",
          "mockFile": ""
        }
      ]
    },
    {
      "name": "updateDeviceCellularGatewaySettingsPortForwardingRules",
      "protocol": "REST",
      "method": "PUT",
      "entitypath": {
        "v0": "{base_path}/{version}/devices/{pathv1}/cellularGateway/settings/portForwardingRules?{query}",
        "v1": "{base_path}/{version}/devices/{pathv1}/cellularGateway/portForwardingRules?{query}"
      },
      "requestSchema": "schema.json",
      "responseSchema": "schema.json",
      "timeout": 0,
      "sendEmpty": false,
      "sendGetBody": false,
      "requestDatatype": "JSON",
      "responseDatatype": "JSON",
      "headers": {},
      "responseObjects": [
        {
          "type": "default",
          "key": "",
          "mockFile": ""
        }
      ]
    }
  ]
}