{
  "actions": [
    {
      "name": "getNetworkSmTargetGroups",
      "protocol": "REST",
      "method": "GET",
      "entitypath": "{base_path}/{version}/networks/{pathv1}/sm/targetGroups?{query}",
      "requestSchema": "schema.json",
      "responseSchema": "schema.json",
      "timeout": 0,
      "sendEmpty": false,
      "sendGetBody": false,
      "requestDatatype": "JSON",
      "responseDatatype": "JSON",
      "headers": {},
      "responseObjects": [
        {
          "type": "default",
          "key": "",
          "mockFile": "mockdatafiles/getNetworkSmTargetGroups-default.json"
        }
      ]
    },
    {
      "name": "createNetworkSmTargetGroup",
      "protocol": "REST",
      "method": "POST",
      "entitypath": "{base_path}/{version}/networks/{pathv1}/sm/targetGroups?{query}",
      "requestSchema": "schema.json",
      "responseSchema": "schema.json",
      "timeout": 0,
      "sendEmpty": false,
      "sendGetBody": false,
      "requestDatatype": "JSON",
      "responseDatatype": "JSON",
      "headers": {},
      "responseObjects": [
        {
          "type": "default",
          "key": "",
          "mockFile": "mockdatafiles/createNetworkSmTargetGroup-default.json"
        }
      ]
    },
    {
      "name": "getNetworkSmTargetGroup",
      "protocol": "REST",
      "method": "GET",
      "entitypath": "{base_path}/{version}/networks/{pathv1}/sm/targetGroups/{pathv2}?{query}",
      "requestSchema": "schema.json",
      "responseSchema": "schema.json",
      "timeout": 0,
      "sendEmpty": false,
      "sendGetBody": false,
      "requestDatatype": "JSON",
      "responseDatatype": "JSON",
      "headers": {},
      "responseObjects": [
        {
          "type": "default",
          "key": "",
          "mockFile": "mockdatafiles/getNetworkSmTargetGroup-default.json"
        }
      ]
    },
    {
      "name": "updateNetworkSmTargetGroup",
      "protocol": "REST",
      "method": "PUT",
      "entitypath": "{base_path}/{version}/networks/{pathv1}/sm/targetGroups/{pathv2}?{query}",
      "requestSchema": "schema.json",
      "responseSchema": "schema.json",
      "timeout": 0,
      "sendEmpty": false,
      "sendGetBody": false,
      "requestDatatype": "JSON",
      "responseDatatype": "JSON",
      "headers": {},
      "responseObjects": [
        {
          "type": "default",
          "key": "",
          "mockFile": "mockdatafiles/updateNetworkSmTargetGroup-default.json"
        }
      ]
    },
    {
      "name": "deleteNetworkSmTargetGroup",
      "protocol": "REST",
      "method": "DELETE",
      "entitypath": "{base_path}/{version}/networks/{pathv1}/sm/targetGroups/{pathv2}?{query}",
      "requestSchema": "schema.json",
      "responseSchema": "schema.json",
      "timeout": 0,
      "sendEmpty": false,
      "sendGetBody": false,
      "requestDatatype": "JSON",
      "responseDatatype": "JSON",
      "headers": {},
      "responseObjects": [
        {
          "type": "default",
          "key": "",
          "mockFile": ""
        }
      ]
    }
  ]
}