[
  {
    "floorPlanId": "string",
    "imageUrl": "string",
    "imageUrlExpiresAt": "string",
    "imageExtension": "string",
    "imageMd5": "string",
    "name": "string",
    "devices": [
      {
        "name": "string",
        "lat": 7,
        "lng": 4,
        "serial": "string",
        "mac": "string",
        "model": "string",
        "address": "string",
        "notes": "string",
        "lanIp": "string",
        "tags": "string",
        "networkId": "string",
        "beaconIdParams": {
          "uuid": "string",
          "major": 10,
          "minor": 8
        },
        "firmware": "string",
        "floorPlanId": "string"
      }
    ],
    "width": 5,
    "height": 3,
    "center": {
      "lat": 3,
      "lng": 10
    },
    "bottomLeftCorner": {
      "lat": 8,
      "lng": 7
    },
    "bottomRightCorner": {
      "lat": 7,
      "lng": 6
    },
    "topLeftCorner": {
      "lat": 9,
      "lng": 6
    },
    "topRightCorner": {
      "lat": 4,
      "lng": 3
    }
  },
  {
    "floorPlanId": "string",
    "imageUrl": "string",
    "imageUrlExpiresAt": "string",
    "imageExtension": "string",
    "imageMd5": "string",
    "name": "string",
    "devices": [
      {
        "name": "string",
        "lat": 1,
        "lng": 1,
        "serial": "string",
        "mac": "string",
        "model": "string",
        "address": "string",
        "notes": "string",
        "lanIp": "string",
        "tags": "string",
        "networkId": "string",
        "beaconIdParams": {
          "uuid": "string",
          "major": 8,
          "minor": 8
        },
        "firmware": "string",
        "floorPlanId": "string"
      },
      {
        "name": "string",
        "lat": 10,
        "lng": 10,
        "serial": "string",
        "mac": "string",
        "model": "string",
        "address": "string",
        "notes": "string",
        "lanIp": "string",
        "tags": "string",
        "networkId": "string",
        "beaconIdParams": {
          "uuid": "string",
          "major": 3,
          "minor": 9
        },
        "firmware": "string",
        "floorPlanId": "string"
      },
      {
        "name": "string",
        "lat": 6,
        "lng": 2,
        "serial": "string",
        "mac": "string",
        "model": "string",
        "address": "string",
        "notes": "string",
        "lanIp": "string",
        "tags": "string",
        "networkId": "string",
        "beaconIdParams": {
          "uuid": "string",
          "major": 9,
          "minor": 7
        },
        "firmware": "string",
        "floorPlanId": "string"
      },
      {
        "name": "string",
        "lat": 10,
        "lng": 5,
        "serial": "string",
        "mac": "string",
        "model": "string",
        "address": "string",
        "notes": "string",
        "lanIp": "string",
        "tags": "string",
        "networkId": "string",
        "beaconIdParams": {
          "uuid": "string",
          "major": 4,
          "minor": 6
        },
        "firmware": "string",
        "floorPlanId": "string"
      },
      {
        "name": "string",
        "lat": 7,
        "lng": 1,
        "serial": "string",
        "mac": "string",
        "model": "string",
        "address": "string",
        "notes": "string",
        "lanIp": "string",
        "tags": "string",
        "networkId": "string",
        "beaconIdParams": {
          "uuid": "string",
          "major": 8,
          "minor": 9
        },
        "firmware": "string",
        "floorPlanId": "string"
      },
      {
        "name": "string",
        "lat": 8,
        "lng": 5,
        "serial": "string",
        "mac": "string",
        "model": "string",
        "address": "string",
        "notes": "string",
        "lanIp": "string",
        "tags": "string",
        "networkId": "string",
        "beaconIdParams": {
          "uuid": "string",
          "major": 8,
          "minor": 3
        },
        "firmware": "string",
        "floorPlanId": "string"
      },
      {
        "name": "string",
        "lat": 5,
        "lng": 4,
        "serial": "string",
        "mac": "string",
        "model": "string",
        "address": "string",
        "notes": "string",
        "lanIp": "string",
        "tags": "string",
        "networkId": "string",
        "beaconIdParams": {
          "uuid": "string",
          "major": 2,
          "minor": 1
        },
        "firmware": "string",
        "floorPlanId": "string"
      },
      {
        "name": "string",
        "lat": 4,
        "lng": 9,
        "serial": "string",
        "mac": "string",
        "model": "string",
        "address": "string",
        "notes": "string",
        "lanIp": "string",
        "tags": "string",
        "networkId": "string",
        "beaconIdParams": {
          "uuid": "string",
          "major": 2,
          "minor": 6
        },
        "firmware": "string",
        "floorPlanId": "string"
      }
    ],
    "width": 6,
    "height": 9,
    "center": {
      "lat": 5,
      "lng": 4
    },
    "bottomLeftCorner": {
      "lat": 8,
      "lng": 1
    },
    "bottomRightCorner": {
      "lat": 9,
      "lng": 4
    },
    "topLeftCorner": {
      "lat": 4,
      "lng": 3
    },
    "topRightCorner": {
      "lat": 3,
      "lng": 3
    }
  }
]