[
  {
    "startTime": "2018-10-09T22:18:27Z",
    "endTime": "2018-10-09T22:19:27Z",
    "lossPercent": 5,
    "latencyMs": 324
  },
  {
    "startTime": "2018-10-09T22:19:27Z",
    "endTime": "2018-10-09T22:20:27Z",
    "lossPercent": 1,
    "latencyMs": 43
  },
  {
    "startTime": "2018-10-09T22:20:27Z",
    "endTime": "2018-10-09T22:21:27Z",
    "lossPercent": 0,
    "latencyMs": 44
  }
]