{
  "actions": [
    {
      "name": "getNetworkMerakiAuthUsers",
      "protocol": "REST",
      "method": "GET",
      "entitypath": "{base_path}/{version}/networks/{pathv1}/merakiAuthUsers?{query}",
      "requestSchema": "schema.json",
      "responseSchema": "schema.json",
      "timeout": 0,
      "sendEmpty": false,
      "sendGetBody": false,
      "requestDatatype": "JSON",
      "responseDatatype": "JSON",
      "headers": {},
      "responseObjects": [
        {
          "type": "default",
          "key": "",
          "mockFile": "mockdatafiles/getNetworkMerakiAuthUsers-default.json"
        }
      ]
    },
    {
      "name": "getNetworkMerakiAuthUser",
      "protocol": "REST",
      "method": "GET",
      "entitypath": "{base_path}/{version}/networks/{pathv1}/merakiAuthUsers/{pathv2}?{query}",
      "requestSchema": "schema.json",
      "responseSchema": "schema.json",
      "timeout": 0,
      "sendEmpty": false,
      "sendGetBody": false,
      "requestDatatype": "JSON",
      "responseDatatype": "JSON",
      "headers": {},
      "responseObjects": [
        {
          "type": "default",
          "key": "",
          "mockFile": "mockdatafiles/getNetworkMerakiAuthUser-default.json"
        }
      ]
    }
  ]
}