{
  "artifactId": "1",
  "organizationId": "2",
  "name": "example",
  "status": {
    "type": "pending"
  },
  "uploadId": "00112233445566778899aabbccddeeff",
  "uploadUrl": "https://meraki_custom_cv_upload_url",
  "uploadUrlExpiry": "2022-01-23T01:23:45.123456+00:00"
}