{
  "id": "d7fa4948-7921-4dfa-af6b-ae8b16c20c39",
  "networkId": "N_24329156",
  "name": "My route",
  "gatewayIp": "1.2.3.5",
  "subnet": "192.168.1.0/24",
  "fixedIpAssignments": "{}",
  "reservedIpRanges": "[]",
  "enabled": true
}