{
  "defaultSettings": {
    "igmpSnoopingEnabled": true,
    "floodUnknownMulticastTrafficEnabled": true
  },
  "overrides": [
    {
      "switches": [
        "Q234-ABCD-0001",
        "Q234-ABCD-0002",
        "Q234-ABCD-0003"
      ],
      "igmpSnoopingEnabled": true,
      "floodUnknownMulticastTrafficEnabled": true
    },
    {
      "stacks": [
        "789102",
        "123456",
        "129102"
      ],
      "igmpSnoopingEnabled": true,
      "floodUnknownMulticastTrafficEnabled": true
    }
  ]
}