{
  "actions": [
    {
      "name": "returnsTheSAMLSSOEnabledSettingsForAnOrganization",
      "protocol": "REST",
      "method": "GET",
      "entitypath": "{base_path}/{version}/organizations/{pathv1}/saml?{query}",
      "requestSchema": "schema.json",
      "responseSchema": "schema.json",
      "timeout": 0,
      "sendEmpty": false,
      "sendGetBody": false,
      "requestDatatype": "JSON",
      "responseDatatype": "JSON",
      "headers": {},
      "responseObjects": [
        {
          "type": "default",
          "key": "",
          "mockFile": "mockdatafiles/returnsTheSAMLSSOEnabledSettingsForAnOrganization-default.json"
        }
      ]
    },
    {
      "name": "updatesTheSAMLSSOEnabledSettingsForAnOrganization",
      "protocol": "REST",
      "method": "PUT",
      "entitypath": "{base_path}/{version}/organizations/{pathv1}/saml?{query}",
      "requestSchema": "schema.json",
      "responseSchema": "schema.json",
      "timeout": 0,
      "sendEmpty": false,
      "requestDatatype": "JSON",
      "responseDatatype": "JSON",
      "headers": {},
      "responseObjects": [
        {
          "type": "default",
          "key": "",
          "mockFile": "mockdatafiles/updatesTheSAMLSSOEnabledSettingsForAnOrganization-default.json"
        }
      ]
    }
  ]
}