{
  "pingId": "1284392014819",
  "url": "/devices/SERIAL/liveTools/ping/1284392014819",
  "request": {
    "serial": "Q234-ABCD-5678",
    "target": "75.75.75.75",
    "count": 2
  },
  "status": "complete",
  "results": {
    "sent": 5,
    "received": 5,
    "loss": {
      "percentage": 0
    },
    "latencies": {
      "minimum": 15.8,
      "average": 15.8,
      "maximum": 15.9
    },
    "replies": [
      {
        "sequenceId": 1,
        "size": 84,
        "latency": 15.7
      }
    ]
  }
}