{
  "actions": [
    {
      "name": "getNetworkAlertSettings",
      "protocol": "REST",
      "method": "GET",
      "entitypath": {
        "v0":"{base_path}/{version}/networks/{pathv1}/alertSettings?{query}",
        "v1":"{base_path}/{version}/networks/{pathv1}/alerts/Settings?{query}"
      },
      "requestSchema": "schema.json",
      "responseSchema": "schema.json",
      "timeout": 0,
      "sendEmpty": false,
      "sendGetBody": false,
      "requestDatatype": "JSON",
      "responseDatatype": "JSON",
      "headers": {},
      "responseObjects": [
        {
          "type": "default",
          "key": "",
          "mockFile": "mockdatafiles/getNetworkAlertSettings-default.json"
        }
      ]
    },
    {
      "name": "updateNetworkAlertSettings",
      "protocol": "REST",
      "method": "PUT",
      "entitypath": {
        "v0":"{base_path}/{version}/networks/{pathv1}/alertSettings?{query}",
        "v1":"{base_path}/{version}/networks/{pathv1}/alerts/Settings?{query}"
      },
      "requestSchema": "schema.json",
      "responseSchema": "schema.json",
      "timeout": 0,
      "sendEmpty": false,
      "sendGetBody": false,
      "requestDatatype": "JSON",
      "responseDatatype": "JSON",
      "headers": {},
      "responseObjects": [
        {
          "type": "default",
          "key": "",
          "mockFile": "mockdatafiles/updateNetworkAlertSettings-default.json"
        }
      ]
    }
  ]
}