{
  "actions": [
    {
      "name": "listLayer3InterfacesForASwitch",
      "protocol": "REST",
      "method": "GET",
      "entitypath": "{base_path}/{version}/devices/{pathv1}/switch/routing/interfaces?{query}",
      "requestSchema": "schema.json",
      "responseSchema": "schema.json",
      "timeout": 0,
      "sendEmpty": false,
      "sendGetBody": false,
      "requestDatatype": "JSON",
      "responseDatatype": "JSON",
      "headers": {},
      "responseObjects": [
        {
          "type": "default",
          "key": "",
          "mockFile": "mockdatafiles/listLayer3InterfacesForASwitch-default.json"
        }
      ]
    },
    {
      "name": "createALayer3InterfaceForASwitch",
      "protocol": "REST",
      "method": "POST",
      "entitypath": "{base_path}/{version}/devices/{pathv1}/switch/routing/interfaces?{query}",
      "requestSchema": "schema.json",
      "responseSchema": "schema.json",
      "timeout": 0,
      "sendEmpty": false,
      "requestDatatype": "JSON",
      "responseDatatype": "JSON",
      "headers": {},
      "responseObjects": [
        {
          "type": "default",
          "key": "",
          "mockFile": "mockdatafiles/createALayer3InterfaceForASwitch-default.json"
        }
      ]
    },
    {
      "name": "returnALayer3InterfaceForASwitch",
      "protocol": "REST",
      "method": "GET",
      "entitypath": "{base_path}/{version}/devices/{pathv1}/switch/routing/interfaces/{pathv2}?{query}",
      "requestSchema": "schema.json",
      "responseSchema": "schema.json",
      "timeout": 0,
      "sendEmpty": false,
      "sendGetBody": false,
      "requestDatatype": "JSON",
      "responseDatatype": "JSON",
      "headers": {},
      "responseObjects": [
        {
          "type": "default",
          "key": "",
          "mockFile": "mockdatafiles/returnALayer3InterfaceForASwitch-default.json"
        }
      ]
    },
    {
      "name": "updateALayer3InterfaceForASwitch",
      "protocol": "REST",
      "method": "PUT",
      "entitypath": "{base_path}/{version}/devices/{pathv1}/switch/routing/interfaces/{pathv2}?{query}",
      "requestSchema": "schema.json",
      "responseSchema": "schema.json",
      "timeout": 0,
      "sendEmpty": false,
      "requestDatatype": "JSON",
      "responseDatatype": "JSON",
      "headers": {},
      "responseObjects": [
        {
          "type": "default",
          "key": "",
          "mockFile": "mockdatafiles/updateALayer3InterfaceForASwitch-default.json"
        }
      ]
    },
    {
      "name": "deleteALayer3InterfaceFromTheSwitch",
      "protocol": "REST",
      "method": "DELETE",
      "entitypath": "{base_path}/{version}/devices/{pathv1}/switch/routing/interfaces/{pathv2}?{query}",
      "requestSchema": "schema.json",
      "responseSchema": "schema.json",
      "timeout": 0,
      "sendEmpty": false,
      "requestDatatype": "JSON",
      "responseDatatype": "JSON",
      "headers": {},
      "responseObjects": [
        {
          "type": "default",
          "key": "",
          "mockFile": ""
        }
      ]
    },
    {
      "name": "listLayer3InterfacesForASwitchStack",
      "protocol": "REST",
      "method": "GET",
      "entitypath": "{base_path}/{version}/networks/{pathv1}/switch/stacks/{pathv2}/routing/interfaces?{query}",
      "requestSchema": "schema.json",
      "responseSchema": "schema.json",
      "timeout": 0,
      "sendEmpty": false,
      "sendGetBody": false,
      "requestDatatype": "JSON",
      "responseDatatype": "JSON",
      "headers": {},
      "responseObjects": [
        {
          "type": "default",
          "key": "",
          "mockFile": "mockdatafiles/listLayer3InterfacesForASwitchStack-default.json"
        }
      ]
    },
    {
      "name": "createALayer3InterfaceForASwitchStack",
      "protocol": "REST",
      "method": "POST",
      "entitypath": "{base_path}/{version}/networks/{pathv1}/switch/stacks/{pathv2}/routing/interfaces?{query}",
      "requestSchema": "schema.json",
      "responseSchema": "schema.json",
      "timeout": 0,
      "sendEmpty": false,
      "requestDatatype": "JSON",
      "responseDatatype": "JSON",
      "headers": {},
      "responseObjects": [
        {
          "type": "default",
          "key": "",
          "mockFile": "mockdatafiles/createALayer3InterfaceForASwitchStack-default.json"
        }
      ]
    },
    {
      "name": "returnALayer3InterfaceFromASwitchStack",
      "protocol": "REST",
      "method": "GET",
      "entitypath": "{base_path}/{version}/networks/{pathv1}/switch/stacks/{pathv2}/routing/interfaces/{pathv3}?{query}",
      "requestSchema": "schema.json",
      "responseSchema": "schema.json",
      "timeout": 0,
      "sendEmpty": false,
      "sendGetBody": false,
      "requestDatatype": "JSON",
      "responseDatatype": "JSON",
      "headers": {},
      "responseObjects": [
        {
          "type": "default",
          "key": "",
          "mockFile": "mockdatafiles/returnALayer3InterfaceFromASwitchStack-default.json"
        }
      ]
    },
    {
      "name": "updateALayer3InterfaceForASwitchStack",
      "protocol": "REST",
      "method": "PUT",
      "entitypath": "{base_path}/{version}/networks/{pathv1}/switch/stacks/{pathv2}/routing/interfaces/{pathv3}?{query}",
      "requestSchema": "schema.json",
      "responseSchema": "schema.json",
      "timeout": 0,
      "sendEmpty": false,
      "requestDatatype": "JSON",
      "responseDatatype": "JSON",
      "headers": {},
      "responseObjects": [
        {
          "type": "default",
          "key": "",
          "mockFile": "mockdatafiles/updateALayer3InterfaceForASwitchStack-default.json"
        }
      ]
    },
    {
      "name": "deleteALayer3InterfaceFromASwitchStack",
      "protocol": "REST",
      "method": "DELETE",
      "entitypath": "{base_path}/{version}/networks/{pathv1}/switch/stacks/{pathv2}/routing/interfaces/{pathv3}?{query}",
      "requestSchema": "schema.json",
      "responseSchema": "schema.json",
      "timeout": 0,
      "sendEmpty": false,
      "requestDatatype": "JSON",
      "responseDatatype": "JSON",
      "headers": {},
      "responseObjects": [
        {
          "type": "default",
          "key": "",
          "mockFile": ""
        }
      ]
    }
  ]
}