{
  "actions": [
    {
      "name": "showUplinkSelectionSettingsForAnMXNetwork",
      "protocol": "REST",
      "method": "GET",
      "entitypath": "{base_path}/{version}/networks/{pathv1}/appliance/trafficShaping/uplinkSelection?{query}",
      "requestSchema": "schema.json",
      "responseSchema": "schema.json",
      "timeout": 0,
      "sendEmpty": false,
      "sendGetBody": false,
      "requestDatatype": "JSON",
      "responseDatatype": "JSON",
      "headers": {},
      "responseObjects": [
        {
          "type": "default",
          "key": "",
          "mockFile": "mockdatafiles/showUplinkSelectionSettingsForAnMXNetwork-default.json"
        }
      ]
    },
    {
      "name": "updateUplinkSelectionSettingsForAnMXNetwork",
      "protocol": "REST",
      "method": "PUT",
      "entitypath": "{base_path}/{version}/networks/{pathv1}/appliance/trafficShaping/uplinkSelection?{query}",
      "requestSchema": "schema.json",
      "responseSchema": "schema.json",
      "timeout": 0,
      "sendEmpty": false,
      "requestDatatype": "JSON",
      "responseDatatype": "JSON",
      "headers": {},
      "responseObjects": [
        {
          "type": "default",
          "key": "",
          "mockFile": "mockdatafiles/updateUplinkSelectionSettingsForAnMXNetwork-default.json"
        }
      ]
    }
  ]
}