{
  "actions": [
    {
      "name": "getNetworkCameraVideoLink",
      "protocol": "REST",
      "method": "GET",
      "entitypath": "{base_path}/{version}/networks/{pathv1}/cameras/{pathv2}/videoLink?{query}",
      "requestSchema": "schema.json",
      "responseSchema": "schema.json",
      "timeout": 0,
      "sendEmpty": false,
      "sendGetBody": false,
      "requestDatatype": "JSON",
      "responseDatatype": "JSON",
      "headers": {},
      "responseObjects": [
        {
          "type": "default",
          "key": "",
          "mockFile": "mockdatafiles/getNetworkCameraVideoLink-default.json"
        }
      ]
    },
    {
      "name": "generateNetworkCameraSnapshot",
      "protocol": "REST",
      "method": "POST",
      "entitypath": "{base_path}/{version}/networks/{pathv1}/cameras/{pathv2}/snapshot?{query}",
      "requestSchema": "schema.json",
      "responseSchema": "schema.json",
      "timeout": 0,
      "sendEmpty": false,
      "sendGetBody": false,
      "requestDatatype": "JSON",
      "responseDatatype": "JSON",
      "headers": {},
      "responseObjects": [
        {
          "type": "default",
          "key": "",
          "mockFile": "mockdatafiles/generateNetworkCameraSnapshot-default.json"
        }
      ]
    }
  ]
}