{
  "ssids": {
    "0": {
      "isAuthorized": true,
      "authorizedAt": "2017-07-19 16:24:13 UTC",
      "expiresAt": "2017-07-20 16:24:13 UTC"
    },
    "2": {
      "isAuthorized": false
    }
  }
}