[
  {
    "clientId": "k74272e",
    "clientIp": "1.2.3.4",
    "clientMac": "00:11:22:33:44:55",
    "applicationUsage": [
      {
        "application": "Google",
        "recv": 383,
        "sent": 56
      }
    ]
  }
]