{
  "actions": [
    {
      "name": "returnsWirelessProfileAssignedToTheGivenCamera",
      "protocol": "REST",
      "method": "GET",
      "entitypath": "{base_path}/{version}/devices/{pathv1}/camera/wirelessProfiles?{query}",
      "requestSchema": "schema.json",
      "responseSchema": "schema.json",
      "timeout": 0,
      "sendEmpty": false,
      "sendGetBody": false,
      "requestDatatype": "JSON",
      "responseDatatype": "JSON",
      "headers": {},
      "responseObjects": [
        {
          "type": "default",
          "key": "",
          "mockFile": "mockdatafiles/returnsWirelessProfileAssignedToTheGivenCamera-default.json"
        }
      ]
    },
    {
      "name": "assignWirelessProfilesToTheGivenCamera",
      "protocol": "REST",
      "method": "PUT",
      "entitypath": "{base_path}/{version}/devices/{pathv1}/camera/wirelessProfiles?{query}",
      "requestSchema": "schema.json",
      "responseSchema": "schema.json",
      "timeout": 0,
      "sendEmpty": false,
      "requestDatatype": "JSON",
      "responseDatatype": "JSON",
      "headers": {},
      "responseObjects": [
        {
          "type": "default",
          "key": "",
          "mockFile": "mockdatafiles/assignWirelessProfilesToTheGivenCamera-default.json"
        }
      ]
    },
    {
      "name": "createsANewCameraWirelessProfileForThisNetwork",
      "protocol": "REST",
      "method": "POST",
      "entitypath": "{base_path}/{version}/networks/{pathv1}/camera/wirelessProfiles?{query}",
      "requestSchema": "schema.json",
      "responseSchema": "schema.json",
      "timeout": 0,
      "sendEmpty": false,
      "requestDatatype": "JSON",
      "responseDatatype": "JSON",
      "headers": {},
      "responseObjects": [
        {
          "type": "default",
          "key": "",
          "mockFile": "mockdatafiles/createsANewCameraWirelessProfileForThisNetwork-default.json"
        }
      ]
    },
    {
      "name": "listTheCameraWirelessProfilesForThisNetwork",
      "protocol": "REST",
      "method": "GET",
      "entitypath": "{base_path}/{version}/networks/{pathv1}/camera/wirelessProfiles?{query}",
      "requestSchema": "schema.json",
      "responseSchema": "schema.json",
      "timeout": 0,
      "sendEmpty": false,
      "sendGetBody": false,
      "requestDatatype": "JSON",
      "responseDatatype": "JSON",
      "headers": {},
      "responseObjects": [
        {
          "type": "default",
          "key": "",
          "mockFile": "mockdatafiles/listTheCameraWirelessProfilesForThisNetwork-default.json"
        }
      ]
    },
    {
      "name": "retrieveASingleCameraWirelessProfile",
      "protocol": "REST",
      "method": "GET",
      "entitypath": "{base_path}/{version}/networks/{pathv1}/camera/wirelessProfiles/{pathv2}?{query}",
      "requestSchema": "schema.json",
      "responseSchema": "schema.json",
      "timeout": 0,
      "sendEmpty": false,
      "sendGetBody": false,
      "requestDatatype": "JSON",
      "responseDatatype": "JSON",
      "headers": {},
      "responseObjects": [
        {
          "type": "default",
          "key": "",
          "mockFile": "mockdatafiles/retrieveASingleCameraWirelessProfile-default.json"
        }
      ]
    },
    {
      "name": "updateAnExistingCameraWirelessProfileInThisNetwork",
      "protocol": "REST",
      "method": "PUT",
      "entitypath": "{base_path}/{version}/networks/{pathv1}/camera/wirelessProfiles/{pathv2}?{query}",
      "requestSchema": "schema.json",
      "responseSchema": "schema.json",
      "timeout": 0,
      "sendEmpty": false,
      "requestDatatype": "JSON",
      "responseDatatype": "JSON",
      "headers": {},
      "responseObjects": [
        {
          "type": "default",
          "key": "",
          "mockFile": "mockdatafiles/updateAnExistingCameraWirelessProfileInThisNetwork-default.json"
        }
      ]
    },
    {
      "name": "deleteAnExistingCameraWirelessProfileForThisNetwork",
      "protocol": "REST",
      "method": "DELETE",
      "entitypath": "{base_path}/{version}/networks/{pathv1}/camera/wirelessProfiles/{pathv2}?{query}",
      "requestSchema": "schema.json",
      "responseSchema": "schema.json",
      "timeout": 0,
      "sendEmpty": false,
      "requestDatatype": "JSON",
      "responseDatatype": "JSON",
      "headers": {},
      "responseObjects": [
        {
          "type": "default",
          "key": "",
          "mockFile": ""
        }
      ]
    }
  ]
}