[
  {
    "devices": [
      {
        "id": "1284392014819",
        "name": "Miles's phone",
        "tags": [
          "tag1",
          "tag2"
        ],
        "ssid": "My SSID",
        "wifiMac": "00:11:22:33:44:55",
        "osName": "iOS 9.3.5",
        "systemModel": "iPhone",
        "uuid": "3d990628ede4c628d52",
        "serialNumber": "F5XKHEBX",
        "ip": "1.2.3.4"
      }
    ],
    "batchToken": "MMbCbpHZtG3TKUCr9B9uc5"
  }
]