[
  {
    "name": "My peer 1",
    "publicIp": "123.123.123.1",
    "privateSubnets": [
      "192.168.1.0/24",
      "192.168.128.0/24"
    ],
    "secret": "asdf1234",
    "ipsecPolicies": {
      "ikeCipherAlgo": [
        "tripledes"
      ],
      "ikeAuthAlgo": [
        "sha1"
      ],
      "ikeDiffieHellmanGroup": [
        "group2"
      ],
      "ikeLifetime": 28800,
      "childCipherAlgo": [
        "aes128"
      ],
      "childAuthAlgo": [
        "sha1"
      ],
      "childPfsGroup": [
        "disabled"
      ],
      "childLifetime": 28800
    }
  },
  {
    "name": "My peer 2",
    "publicIp": "123.123.123.2",
    "privateSubnets": [
      "192.168.2.0/24",
      "192.168.129.0/24"
    ],
    "secret": "asdf56785678567856785678",
    "ipsecPoliciesPreset": "default"
  }
]