[
  {
      "name": "",
      "serial": "Q3AL-NE8E-R4K6",
      "mac": "f8:9e: 28:da: 62:d6",
      "networkId": "L_627126248111357524",
      "productType": "wireless",
      "model": "MR44",
      "address": "",
      "lat": 37.4180951010362,
      "lng": -122.098531723022,
      "notes": "",
      "tags": [
          "recently-added"
      ],
      "lanIp": "172.000.0.5",
      "configurationUpdatedAt": "2024-02-09T14: 39: 37Z",
      "firmware": "wireless-29-5-1",
      "url": "https: //meraki.com/Network/n/9rbT9dYb/manage/nodes/new_list/273358173922006",
      "details": []
  },
  {
      "name": "",
      "serial": "Q4AB-J4J8-6BJR",
      "mac": "f8:9e:28:c4:8e:72",
      "networkId": "L_627126248111357524",
      "productType": "switch",
      "model": "MS120-8LP",
      "address": "",
      "lat": 37.4180951010362,
      "lng": -122.098531723022,
      "notes": "",
      "tags": [],
      "lanIp": "172.000.0.4",
      "configurationUpdatedAt": "2024-01-31T16:57:29Z",
      "firmware": "switch-16-5",
      "url": "https://meraki.com/Network/n/-CRi2cYb/manage/nodes/new_list/273358172491378",
      "details": []
  }
]