[
  {
    "isRooted": true,
    "hasAntiVirus": true,
    "antiVirusName": "meraki_av",
    "isFireWallEnabled": true,
    "hasFireWallInstalled": true,
    "fireWallName": "meraki_fw",
    "isDiskEncrypted": true,
    "isAutoLoginDisabled": true,
    "id": "1284392014819",
    "runningProcs": "/software,/software_2"
  }
]