{
  "id": "aGlAaGkuY29t",
  "email": "miles@meraki.com",
  "name": "Miles Meraki",
  "createdAt": 1518365681,
  "accountType": "Guest",
  "authorizations": [
    {
      "authorizedZone": "Store WiFi",
      "expiresAt": 1526087474,
      "authorizedByName": "Miles Meraki",
      "authorizedByEmail": "miles@meraki.com"
    }
  ]
}