{
  "subnet": "192.168.1.0/24",
  "applianceIp": "192.168.1.2",
  "fixedIpAssignments": {},
  "reservedIpRanges": [],
  "dnsNameservers": "upstream_dns",
  "dnsCustomNameservers": [],
  "dhcpHandling": "Run a DHCP server",
  "dhcpLeaseTime": "1 day",
  "dhcpBootOptionsEnabled": false,
  "dhcpOptions": []
}