{
  "$id": "schema.json",
  "type": "object",
  "schema": "http://json-schema.org/draft-07/schema#",
  "translate": false,
  "dynamicfields": true,
  "properties": {
    "ph_request_type": {
      "type": "string",
      "description": "type of request (internal to adapter)",
      "default": "getDeviceCameraAnalyticsOverview",
      "enum": [
        "getDeviceCameraAnalyticsOverview",
        "getDeviceCameraAnalyticsZones",
        "getDeviceCameraAnalyticsZoneHistory",
        "getDeviceCameraAnalyticsRecent",
        "getDeviceCameraAnalyticsLive"
      ],
      "external_name": "ph_request_type"
    }
  },
  "definitions": {}
}