[
  {
    "status": "unread",
    "_id": 123,
    "title": "Router state change",
    "time": "2019-12-19T12:10:01.667Z",
    "device": "test0",
    "machineId": "123",
    "details": "Router state changed to \"Not running\""
  },
  {
    "status": "unread",
    "_id": 123,
    "title": "Router state change",
    "time": "2019-12-19T12:10:01.667Z",
    "device": "test0",
    "machineId": "123",
    "details": "Router state changed to \"Not running\""
  },
  {
    "status": "unread",
    "_id": 123,
    "title": "Router state change",
    "time": "2019-12-19T12:10:01.667Z",
    "device": "test0",
    "machineId": "123",
    "details": "Router state changed to \"Not running\""
  }
]