{
  "_id": "string",
  "interface": "string",
  "rangeStart": "string",
  "rangeEnd": "string",
  "dns": [
    "string"
  ],
  "macAssign": [
    {
      "host": "host1",
      "mac": "08:00:27:fd:00:00",
      "ipv4": "20.20.20.20"
    },
    {
      "host": "host1",
      "mac": "08:00:27:fd:00:00",
      "ipv4": "20.20.20.20"
    },
    {
      "host": "host1",
      "mac": "08:00:27:fd:00:00",
      "ipv4": "20.20.20.20"
    },
    {
      "host": "host1",
      "mac": "08:00:27:fd:00:00",
      "ipv4": "20.20.20.20"
    },
    {
      "host": "host1",
      "mac": "08:00:27:fd:00:00",
      "ipv4": "20.20.20.20"
    },
    {
      "host": "host1",
      "mac": "08:00:27:fd:00:00",
      "ipv4": "20.20.20.20"
    }
  ],
  "status": "string"
}