{
  "_id": "string",
  "machineId": "string",
  "name": "string",
  "description": "string",
  "site": "string",
  "defaultRoute": "string",
  "isApproved": true,
  "isConnected": true,
  "pendingDevModification": false,
  "hostname": "string",
  "deviceStatus": {},
  "deviceToken": "string",
  "fromToken": "string",
  "account": "string",
  "org": "string",
  "ipList": "string",
  "staticroutes": [
    {
      "destination": "destination",
      "ifname": "interface",
      "gateway": "gateway",
      "metric": "metric",
      "status": "completed"
    },
    {
      "destination": "destination",
      "ifname": "interface",
      "gateway": "gateway",
      "metric": "metric",
      "status": "completed"
    },
    {
      "destination": "destination",
      "ifname": "interface",
      "gateway": "gateway",
      "metric": "metric",
      "status": "completed"
    },
    {
      "destination": "destination",
      "ifname": "interface",
      "gateway": "gateway",
      "metric": "metric",
      "status": "completed"
    },
    {
      "destination": "destination",
      "ifname": "interface",
      "gateway": "gateway",
      "metric": "metric",
      "status": "completed"
    }
  ],
  "dhcp": [
    {
      "_id": "5e5f662f1b0eba50742b6223",
      "interface": "0000:00:08.00",
      "rangeStart": "20.20.20.2",
      "rangeEnd": "20.20.20.255",
      "dns": [
        "8.8.8.8",
        "8.8.8.4"
      ],
      "macAssign": [
        {
          "host": "host1",
          "mac": "08:00:27:fd:00:00",
          "ipv4": "20.20.20.20"
        }
      ],
      "status": "completed"
    },
    {
      "_id": "5e5f662f1b0eba50742b6223",
      "interface": "0000:00:08.00",
      "rangeStart": "20.20.20.2",
      "rangeEnd": "20.20.20.255",
      "dns": [
        "8.8.8.8",
        "8.8.8.4"
      ],
      "macAssign": [
        {
          "host": "host1",
          "mac": "08:00:27:fd:00:00",
          "ipv4": "20.20.20.20"
        }
      ],
      "status": "completed"
    }
  ],
  "upgradeSchedule": {
    "jobQueued": true,
    "_id": "_id",
    "time": "2019-12-19T12:10:01.667Z"
  },
  "labels": [
    "string",
    "string",
    "string"
  ],
  "interfaces": [
    {
      "IPv6": "IPv6",
      "PublicIP": "PublicIP",
      "IPv4": "IPv4",
      "type": "WAN",
      "MAC": "MAC",
      "routing": "OSPF",
      "IPv6Mask": "64",
      "isAssigned": true,
      "driver": "driver",
      "IPv4Mask": "24",
      "name": "name",
      "pciaddr": "pciaddr",
      "_id": "_id"
    },
    {
      "IPv6": "IPv6",
      "PublicIP": "PublicIP",
      "IPv4": "IPv4",
      "type": "WAN",
      "MAC": "MAC",
      "routing": "OSPF",
      "IPv6Mask": "64",
      "isAssigned": true,
      "driver": "driver",
      "IPv4Mask": "24",
      "name": "name",
      "pciaddr": "pciaddr",
      "_id": "_id"
    },
    {
      "IPv6": "IPv6",
      "PublicIP": "PublicIP",
      "IPv4": "IPv4",
      "type": "WAN",
      "MAC": "MAC",
      "routing": "OSPF",
      "IPv6Mask": "64",
      "isAssigned": true,
      "driver": "driver",
      "IPv4Mask": "24",
      "name": "name",
      "pciaddr": "pciaddr",
      "_id": "_id"
    },
    {
      "IPv6": "IPv6",
      "PublicIP": "PublicIP",
      "IPv4": "IPv4",
      "type": "WAN",
      "MAC": "MAC",
      "routing": "OSPF",
      "IPv6Mask": "64",
      "isAssigned": true,
      "driver": "driver",
      "IPv4Mask": "24",
      "name": "name",
      "pciaddr": "pciaddr",
      "_id": "_id"
    },
    {
      "IPv6": "IPv6",
      "PublicIP": "PublicIP",
      "IPv4": "IPv4",
      "type": "WAN",
      "MAC": "MAC",
      "routing": "OSPF",
      "IPv6Mask": "64",
      "isAssigned": true,
      "driver": "driver",
      "IPv4Mask": "24",
      "name": "name",
      "pciaddr": "pciaddr",
      "_id": "_id"
    },
    {
      "IPv6": "IPv6",
      "PublicIP": "PublicIP",
      "IPv4": "IPv4",
      "type": "WAN",
      "MAC": "MAC",
      "routing": "OSPF",
      "IPv6Mask": "64",
      "isAssigned": true,
      "driver": "driver",
      "IPv4Mask": "24",
      "name": "name",
      "pciaddr": "pciaddr",
      "_id": "_id"
    },
    {
      "IPv6": "IPv6",
      "PublicIP": "PublicIP",
      "IPv4": "IPv4",
      "type": "WAN",
      "MAC": "MAC",
      "routing": "OSPF",
      "IPv6Mask": "64",
      "isAssigned": true,
      "driver": "driver",
      "IPv4Mask": "24",
      "name": "name",
      "pciaddr": "pciaddr",
      "_id": "_id"
    },
    {
      "IPv6": "IPv6",
      "PublicIP": "PublicIP",
      "IPv4": "IPv4",
      "type": "WAN",
      "MAC": "MAC",
      "routing": "OSPF",
      "IPv6Mask": "64",
      "isAssigned": true,
      "driver": "driver",
      "IPv4Mask": "24",
      "name": "name",
      "pciaddr": "pciaddr",
      "_id": "_id"
    },
    {
      "IPv6": "IPv6",
      "PublicIP": "PublicIP",
      "IPv4": "IPv4",
      "type": "WAN",
      "MAC": "MAC",
      "routing": "OSPF",
      "IPv6Mask": "64",
      "isAssigned": true,
      "driver": "driver",
      "IPv4Mask": "24",
      "name": "name",
      "pciaddr": "pciaddr",
      "_id": "_id"
    },
    {
      "IPv6": "IPv6",
      "PublicIP": "PublicIP",
      "IPv4": "IPv4",
      "type": "WAN",
      "MAC": "MAC",
      "routing": "OSPF",
      "IPv6Mask": "64",
      "isAssigned": true,
      "driver": "driver",
      "IPv4Mask": "24",
      "name": "name",
      "pciaddr": "pciaddr",
      "_id": "_id"
    }
  ],
  "versions": {
    "agent": "agent",
    "router": "router",
    "device": "device"
  }
}