{
  "name": "adapter-db_sybase",
  "webName": "Adapter for Integration to Sybase Database",
  "supportLevel": "community",
  "vendor": "SAP",
  "product": "Sybase",
  "techAlliance": false,
  "osVersion": [],
  "apiVersions": [],
  "iapVersions": [
    "2021.1.x",
    "2021.2.x",
    "2022.1.x",
    "2023.1.x"
  ],
  "method": "Library",
  "type": "Adapter",
  "domains": [
    "Data Storage"
  ],
  "tags": [
    "Database & Repository Operations"
  ],
  "useCases": [
    "CRUD Operations",
    "Persist Data"
  ],
  "deprecated": {
    "isDeprecated": false
  },
  "brokerSince": "",
  "authMethods": [
    {
      "type": "Database Auth",
      "subtypes": [],
      "primary": true
    }
  ],
  "documentation": {
    "storeLink": "",
    "npmLink": "https://www.npmjs.com/package/@itentialopensource/adapter-db_sybase",
    "repoLink": "https://gitlab.com/itentialopensource/adapters/adapter-db_sybase",
    "docLink": "https://gitlab.com/itentialopensource/adapters/adapter-db_sybase/-/blob/master/README.md?ref_type=heads",
    "demoLinks": [],
    "trainingLinks": [
      {
        "title": "Itential Academy",
        "link": "https://www.itential.com/itential-academy/"
      }
    ],
    "faqLink": "https://docs.itential.com/opensource/docs/troubleshooting-an-adapter",
    "contributeLink": "https://gitlab.com/itentialopensource/adapters/contributing-guide",
    "issueLink": "https://itential.atlassian.net/servicedesk/customer/portals",
    "webLink": "https://www.itential.com/adapters/sybase/",
    "vendorLink": "https://www.sap.com/index.html",
    "productLink": "https://www.sap.com/products/technology-platform/sybase-ase.html",
    "apiLinks": [
      {
        "title": "Sybase SQL Reference",
        "link": "https://infocenter.sybase.com/help/index.jsp?topic=/com.sybase.help.sqlanywhere.12.0.1/dbusage/sqlqueries-sqlug.html",
        "public": true
      },
      {
        "title": "Sybase Node Library Documentation",
        "link": "https://www.npmjs.com/package/sybase",
        "public": true
      }
    ],
    "workshopLinks": [],
    "workshopHomePage": "https://www.itential.com/get-started/"
  },
  "assets": [],
  "relatedItems": {
    "adapters": [],
    "integrations": [],
    "ecosystemApplications": [],
    "workflowProjects": [],
    "transformationProjects": [],
    "exampleProjects": []
  }
}