{
  "$id": "schema.json",
  "type": "object",
  "schema": "http://json-schema.org/draft-07/schema#",
  "translate": true,
  "dynamicfields": true,
  "properties": {
    "ph_request_type": {
      "type": "string",
      "description": "type of request (internal to adapter)",
      "default": "listBlobs",
      "enum": [
        "listBlobs"
      ],
      "external_name": "ph_request_type"
    },
    "containerName": {
      "type": "string",
      "description": "Name of container.",
      "parse": false,
      "encode": false,
      "encrypt": {
        "type": "AES",
        "key": ""
      },
      "external_name": "container-name"
    }
  },
  "definitions": {}
}