{
  "name": "adapter-azure_blobs",
  "webName": "Adapter for Integration to Microsoft Azure Blobs",
  "supportLevel": "community",
  "vendor": "Microsoft",
  "product": "Azure Blobs",
  "techAlliance": false,
  "osVersion": [],
  "apiVersions": [],
  "iapVersions": [
    "2021.1.x",
    "2021.2.x",
    "2022.1.x",
    "2023.1.x"
  ],
  "method": "REST",
  "type": "Adapter",
  "domains": [
    "Data Storage"
  ],
  "tags": [
    "Database & Repository Operations"
  ],
  "useCases": [
    "CRUD Operations",
    "Persist Data"
  ],
  "deprecated": {
    "isDeprecated": false
  },
  "brokerSince": "",
  "authMethods": [
    {
      "type": "OAuth",
      "primary": true
    }
  ],
  "documentation": {
    "storeLink": "",
    "npmLink": "https://www.npmjs.com/package/@itentialopensource/adapter-azure_blobs",
    "repoLink": "https://gitlab.com/itentialopensource/adapters/adapter-azure_blobs",
    "docLink": "https://gitlab.com/itentialopensource/adapters/adapter-azure_blobs/-/blob/master/README.md?ref_type=heads",
    "demoLinks": [],
    "trainingLinks": [
      {
        "title": "Itential Academy",
        "link": "https://www.itential.com/itential-academy/"
      }
    ],
    "faqLink": "https://docs.itential.com/opensource/docs/troubleshooting-an-adapter",
    "contributeLink": "https://gitlab.com/itentialopensource/adapters/contributing-guide",
    "issueLink": "https://itential.atlassian.net/servicedesk/customer/portals",
    "webLink": "https://www.itential.com/adapters/azure-blob-storage/",
    "vendorLink": "https://www.microsoft.com/",
    "productLink": "https://azure.microsoft.com/en-us/products/storage/blobs",
    "apiLinks": [
      {
        "title": "Azure Blob Storage REST API",
        "link": "https://learn.microsoft.com/en-us/rest/api/storageservices/blob-service-rest-api",
        "public": true
      }
    ],
    "workshopLinks": [],
    "workshopHomePage": "https://www.itential.com/get-started/"
  },
  "assets": [],
  "relatedItems": {
    "adapters": [],
    "integrations": [],
    "ecosystemApplications": [],
    "workflowProjects": [],
    "transformationProjects": [],
    "exampleProjects": []
  }
}