{
  "total_records": 7,
  "polls": [
    {
      "id": "string",
      "status": "sharing",
      "title": "string",
      "questions": [
        {
          "name": "string",
          "type": "single",
          "answers": [
            "string",
            "string"
          ]
        },
        {
          "name": "string",
          "type": "multiple",
          "answers": [
            "string",
            "string",
            "string",
            "string",
            "string",
            "string"
          ]
        },
        {
          "name": "string",
          "type": "single",
          "answers": [
            "string",
            "string",
            "string"
          ]
        },
        {
          "name": "string",
          "type": "single",
          "answers": [
            "string",
            "string",
            "string",
            "string",
            "string",
            "string",
            "string",
            "string"
          ]
        },
        {
          "name": "string",
          "type": "multiple",
          "answers": [
            "string"
          ]
        },
        {
          "name": "string",
          "type": "multiple",
          "answers": [
            "string",
            "string",
            "string",
            "string",
            "string",
            "string",
            "string",
            "string",
            "string"
          ]
        },
        {
          "name": "string",
          "type": "single",
          "answers": [
            "string",
            "string",
            "string",
            "string",
            "string",
            "string",
            "string",
            "string",
            "string"
          ]
        },
        {
          "name": "string",
          "type": "single",
          "answers": [
            "string",
            "string",
            "string",
            "string",
            "string"
          ]
        }
      ]
    },
    {
      "id": "string",
      "status": "notstart",
      "title": "string",
      "questions": [
        {
          "name": "string",
          "type": "single",
          "answers": [
            "string",
            "string",
            "string",
            "string",
            "string",
            "string",
            "string",
            "string"
          ]
        },
        {
          "name": "string",
          "type": "multiple",
          "answers": [
            "string",
            "string",
            "string",
            "string",
            "string",
            "string",
            "string",
            "string",
            "string"
          ]
        },
        {
          "name": "string",
          "type": "multiple",
          "answers": [
            "string",
            "string",
            "string",
            "string",
            "string",
            "string",
            "string",
            "string"
          ]
        }
      ]
    },
    {
      "id": "string",
      "status": "notstart",
      "title": "string",
      "questions": [
        {
          "name": "string",
          "type": "single",
          "answers": [
            "string",
            "string"
          ]
        },
        {
          "name": "string",
          "type": "single",
          "answers": [
            "string",
            "string",
            "string",
            "string",
            "string",
            "string"
          ]
        },
        {
          "name": "string",
          "type": "multiple",
          "answers": [
            "string",
            "string",
            "string"
          ]
        }
      ]
    },
    {
      "id": "string",
      "status": "ended",
      "title": "string",
      "questions": [
        {
          "name": "string",
          "type": "multiple",
          "answers": [
            "string",
            "string",
            "string",
            "string",
            "string"
          ]
        },
        {
          "name": "string",
          "type": "multiple",
          "answers": [
            "string",
            "string",
            "string",
            "string",
            "string"
          ]
        },
        {
          "name": "string",
          "type": "multiple",
          "answers": [
            "string",
            "string",
            "string",
            "string",
            "string",
            "string",
            "string"
          ]
        },
        {
          "name": "string",
          "type": "multiple",
          "answers": [
            "string",
            "string"
          ]
        }
      ]
    },
    {
      "id": "string",
      "status": "notstart",
      "title": "string",
      "questions": [
        {
          "name": "string",
          "type": "single",
          "answers": [
            "string",
            "string",
            "string",
            "string",
            "string",
            "string",
            "string"
          ]
        },
        {
          "name": "string",
          "type": "multiple",
          "answers": [
            "string",
            "string",
            "string",
            "string",
            "string",
            "string"
          ]
        },
        {
          "name": "string",
          "type": "single",
          "answers": [
            "string",
            "string",
            "string",
            "string",
            "string",
            "string",
            "string",
            "string"
          ]
        },
        {
          "name": "string",
          "type": "single",
          "answers": [
            "string",
            "string",
            "string",
            "string",
            "string",
            "string",
            "string",
            "string",
            "string",
            "string"
          ]
        },
        {
          "name": "string",
          "type": "multiple",
          "answers": [
            "string",
            "string",
            "string"
          ]
        },
        {
          "name": "string",
          "type": "single",
          "answers": [
            "string",
            "string"
          ]
        },
        {
          "name": "string",
          "type": "multiple",
          "answers": [
            "string",
            "string",
            "string",
            "string"
          ]
        },
        {
          "name": "string",
          "type": "single",
          "answers": [
            "string",
            "string",
            "string",
            "string",
            "string",
            "string"
          ]
        }
      ]
    },
    {
      "id": "string",
      "status": "started",
      "title": "string",
      "questions": [
        {
          "name": "string",
          "type": "single",
          "answers": [
            "string",
            "string",
            "string",
            "string",
            "string",
            "string"
          ]
        },
        {
          "name": "string",
          "type": "multiple",
          "answers": [
            "string",
            "string",
            "string",
            "string"
          ]
        },
        {
          "name": "string",
          "type": "single",
          "answers": [
            "string",
            "string",
            "string",
            "string",
            "string",
            "string",
            "string",
            "string",
            "string"
          ]
        }
      ]
    }
  ]
}