{
  "id": "string",
  "owner_id": "string",
  "owner_email": "string",
  "created_at": "string",
  "options": {
    "share_rc": false,
    "room_connectors": "string",
    "share_mc": true,
    "meeting_connectors": "string",
    "pay_mode": "master"
  },
  "vanity_url": "string"
}