{
  "total_records": 8,
  "tracking_fields": [
    {
      "id": "string",
      "field": "string",
      "required": true,
      "visible": true,
      "recommended_values": [
        "string",
        "string",
        "string",
        "string",
        "string"
      ]
    },
    {
      "id": "string",
      "field": "string",
      "required": true,
      "visible": true,
      "recommended_values": [
        "string",
        "string",
        "string"
      ]
    },
    {
      "id": "string",
      "field": "string",
      "required": false,
      "visible": true,
      "recommended_values": [
        "string",
        "string",
        "string"
      ]
    },
    {
      "id": "string",
      "field": "string",
      "required": true,
      "visible": true,
      "recommended_values": [
        "string",
        "string",
        "string",
        "string"
      ]
    },
    {
      "id": "string",
      "field": "string",
      "required": true,
      "visible": true,
      "recommended_values": [
        "string",
        "string",
        "string"
      ]
    }
  ]
}