{
  "page_count": 8,
  "page_number": 1,
  "page_size": 30,
  "total_records": 4,
  "accounts": [
    {
      "id": "string",
      "account_name": "string",
      "owner_email": "string",
      "account_type": "string",
      "seats": 6,
      "subscription_start_time": "string",
      "subscription_end_time": "string",
      "created_at": "string"
    },
    {
      "id": "string",
      "account_name": "string",
      "owner_email": "string",
      "account_type": "string",
      "seats": 9,
      "subscription_start_time": "string",
      "subscription_end_time": "string",
      "created_at": "string"
    },
    {
      "id": "string",
      "account_name": "string",
      "owner_email": "string",
      "account_type": "string",
      "seats": 2,
      "subscription_start_time": "string",
      "subscription_end_time": "string",
      "created_at": "string"
    }
  ]
}