{
  "id": "string",
  "first_name": "string",
  "last_name": "string",
  "email": "string",
  "type": 3,
  "pmi": "string",
  "timezone": "string",
  "dept": "string",
  "created_at": "string",
  "last_login_time": "string",
  "last_client_version": "string",
  "language": "string",
  "vanity_url": "string",
  "personal_meeting_url": "string",
  "verified": 8,
  "pic_url": "string",
  "cms_user_id": "string",
  "account_id": "string",
  "host_key": "string",
  "use_pmi": false,
  "group_ids": [
    "string",
    "string",
    "string",
    "string",
    "string",
    "string",
    "string",
    "string",
    "string",
    "string"
  ],
  "im_group_ids": [
    "string",
    "string",
    "string",
    "string",
    "string",
    "string",
    "string",
    "string",
    "string"
  ]
}