{
  "name": "adapter-webex_teams",
  "webName": "Adapter for Integration to Cisco Webex Teams",
  "supportLevel": "community",
  "vendor": "Cisco Systems",
  "product": "Webex Teams",
  "techAlliance": false,
  "osVersion": [],
  "apiVersions": [],
  "iapVersions": [
    "2021.1.x",
    "2021.2.x",
    "2022.1.x",
    "2023.1.x"
  ],
  "method": "REST",
  "type": "Adapter",
  "domains": [
    "Notifications"
  ],
  "tags": [
    "Notifications & Ticket Management"
  ],
  "useCases": [
    "Send an email message"
  ],
  "deprecated": {
    "isDeprecated": false
  },
  "brokerSince": "",
  "authMethods": [
    {
      "type": "Token",
      "primary": true
    }
  ],
  "documentation": {
    "storeLink": "",
    "npmLink": "https://www.npmjs.com/package/@itentialopensource/adapter-webex_teams",
    "repoLink": "https://gitlab.com/itentialopensource/adapters/adapter-webex_teams",
    "docLink": "https://gitlab.com/itentialopensource/adapters/adapter-webex_teams/-/blob/master/README.md?ref_type=heads",
    "demoLinks": [],
    "trainingLinks": [
      {
        "title": "Itential Academy",
        "link": "https://www.itential.com/itential-academy/"
      }
    ],
    "faqLink": "https://docs.itential.com/opensource/docs/troubleshooting-an-adapter",
    "contributeLink": "https://gitlab.com/itentialopensource/adapters/contributing-guide",
    "issueLink": "https://itential.atlassian.net/servicedesk/customer/portals",
    "webLink": "https://www.itential.com/adapters/cisco-webex-teams/",
    "vendorLink": "https://www.cisco.com/",
    "productLink": "https://www.webex.com/",
    "apiLinks": [
      {
        "title": "Webex API Reference",
        "link": "https://developer.webex.com/docs/",
        "public": true
      }
    ],
    "workshopLinks": [],
    "workshopHomePage": "https://www.itential.com/get-started/"
  },
  "assets": [],
  "relatedItems": {
    "adapters": [],
    "integrations": [],
    "ecosystemApplications": [],
    "workflowProjects": [
      {
        "name": "Webex Teams Notification",
        "webName": "Webex Teams Notification Automations",
        "overview": "This Pre-Built integrates with the [Webex Teams Open Source Adapter](https://gitlab.com/itentialopensource/adapters/notification-messaging/adapter-webex_teams) to send a notification within Webex Teams.",
        "isDependency": false,
        "versions": [
          "0.0.16"
        ],
        "repoLink": "https://gitlab.com/itentialopensource/pre-built-automations/webex-teams-notification",
        "docLink": "<TBD>",
        "webLink": "https://www.itential.com/automations/webex-teams-notification/"
      }
    ],
    "transformationProjects": [],
    "exampleProjects": []
  }
}