{
  "$id": "token_request_example",
  "type": "object",
  "$schema": "http://json-schema.org/draft-07/schema#",
  "translate": true,
  "dynamicfields": false,
  "properties": {
    "ph_request_type": {
      "type": "string",
      "description": "type of request (internal to adapter)",
      "default": "getToken",
      "enum": [
        "getToken"
      ],
      "external_name": "ph_request_type"
    },
    "username": {
      "type": "string",
      "description": "username to log in with",
      "parse": false,
      "encode": false,
      "encrypt": {
        "type": "AES",
        "key": ""
      },
      "external_name": "user"
    },
    "password": {
      "type": "string",
      "description": "password to log in with",
      "parse": false,
      "encode": false,
      "encrypt": {
        "type": "AES",
        "key": ""
      },
      "external_name": "passwd"
    },
    "grant_type": {
      "type": "string",
      "default":"refresh_token",
      "description": "password to log in with",
      "parse": false,
      "encode": false,
      "encrypt": {
        "type": "AES",
        "key": ""
      },
      "external_name": "grant_type"
    },
    "client_secret": {
      "default":"client_secret_value",
      "type": "string",
      "description": "password to log in with",
      "parse": false,
      "encode": false,
      "encrypt": {
        "type": "AES",
        "key": ""
      },
      "external_name": "client_secret"
    }
  },
  "required": [
    "username",
    "password"
  ],
  "definitions": {}
}
