{
  "actions": [
    {
      "name": "getTeamMemberships",
      "protocol": "REST",
      "method": "GET",
      "entitypath": "{base_path}/{version}/team/memberships/?{query}",
      "requestSchema": "schema.json",
      "responseSchema": "schema.json",
      "timeout": 0,
      "sendEmpty": false,
      "sendGetBody": false,
      "requestDatatype": "JSON",
      "responseDatatype": "JSON",
      "headers": {},
      "responseObjects": [
        {
          "type": "default",
          "key": "",
          "mockFile": "mockdatafiles/getTeamMemberships-default.json"
        }
      ]
    },
    {
      "name": "createTeamMembership",
      "protocol": "REST",
      "method": "POST",
      "entitypath": "{base_path}/{version}/team/memberships/?{query}",
      "requestSchema": "schema.json",
      "responseSchema": "schema.json",
      "timeout": 0,
      "sendEmpty": false,
      "sendGetBody": false,
      "requestDatatype": "JSON",
      "responseDatatype": "JSON",
      "headers": {},
      "responseObjects": [
        {
          "type": "default",
          "key": "",
          "mockFile": "mockdatafiles/createTeamMembership-default.json"
        }
      ]
    },
    {
      "name": "getTeamMembership",
      "protocol": "REST",
      "method": "GET",
      "entitypath": "{base_path}/{version}/team/memberships/{pathv1}?{query}",
      "requestSchema": "schema.json",
      "responseSchema": "schema.json",
      "timeout": 0,
      "sendEmpty": false,
      "sendGetBody": false,
      "requestDatatype": "JSON",
      "responseDatatype": "JSON",
      "headers": {},
      "responseObjects": [
        {
          "type": "default",
          "key": "",
          "mockFile": "mockdatafiles/getTeamMembership-default.json"
        }
      ]
    },
    {
      "name": "updateTeamMembership",
      "protocol": "REST",
      "method": "PUT",
      "entitypath": "{base_path}/{version}/team/memberships/{pathv1}?{query}",
      "requestSchema": "schema.json",
      "responseSchema": "schema.json",
      "timeout": 0,
      "sendEmpty": false,
      "sendGetBody": false,
      "requestDatatype": "JSON",
      "responseDatatype": "JSON",
      "headers": {},
      "responseObjects": [
        {
          "type": "default",
          "key": "",
          "mockFile": "mockdatafiles/updateTeamMembership-default.json"
        }
      ]
    },
    {
      "name": "deleteTeamMembership",
      "protocol": "REST",
      "method": "DELETE",
      "entitypath": "{base_path}/{version}/team/memberships/{pathv1}?{query}",
      "requestSchema": "schema.json",
      "responseSchema": "schema.json",
      "timeout": 0,
      "sendEmpty": false,
      "sendGetBody": false,
      "requestDatatype": "JSON",
      "responseDatatype": "JSON",
      "headers": {},
      "responseObjects": [
        {
          "type": "default",
          "key": "",
          "mockFile": ""
        }
      ]
    }
  ]
}