{
  "actions": [
    {
      "name": "getRooms",
      "protocol": "REST",
      "method": "GET",
      "entitypath": "{base_path}/{version}/rooms/?{query}",
      "requestSchema": "schema.json",
      "responseSchema": "schema.json",
      "timeout": 0,
      "sendEmpty": false,
      "sendGetBody": false,
      "requestDatatype": "JSON",
      "responseDatatype": "JSON",
      "headers": {},
      "responseObjects": [
        {
          "type": "default",
          "key": "",
          "mockFile": "mockdatafiles/getRooms-default.json"
        }
      ]
    },
    {
      "name": "createRoom",
      "protocol": "REST",
      "method": "POST",
      "entitypath": "{base_path}/{version}/rooms/?{query}",
      "requestSchema": "schema.json",
      "responseSchema": "schema.json",
      "timeout": 0,
      "sendEmpty": false,
      "sendGetBody": false,
      "requestDatatype": "JSON",
      "responseDatatype": "JSON",
      "headers": {},
      "responseObjects": [
        {
          "type": "default",
          "key": "",
          "mockFile": "mockdatafiles/createRoom-default.json"
        }
      ]
    },
    {
      "name": "getRoom",
      "protocol": "REST",
      "method": "GET",
      "entitypath": "{base_path}/{version}/rooms/{pathv1}?{query}",
      "requestSchema": "schema.json",
      "responseSchema": "schema.json",
      "timeout": 0,
      "sendEmpty": false,
      "sendGetBody": false,
      "requestDatatype": "JSON",
      "responseDatatype": "JSON",
      "headers": {},
      "responseObjects": [
        {
          "type": "default",
          "key": "",
          "mockFile": "mockdatafiles/getRoom-default.json"
        }
      ]
    },
    {
      "name": "updateRoom",
      "protocol": "REST",
      "method": "PUT",
      "entitypath": "{base_path}/{version}/rooms/{pathv1}?{query}",
      "requestSchema": "schema.json",
      "responseSchema": "schema.json",
      "timeout": 0,
      "sendEmpty": false,
      "sendGetBody": false,
      "requestDatatype": "JSON",
      "responseDatatype": "JSON",
      "headers": {},
      "responseObjects": [
        {
          "type": "default",
          "key": "",
          "mockFile": "mockdatafiles/updateRoom-default.json"
        }
      ]
    },
    {
      "name": "deleteRoom",
      "protocol": "REST",
      "method": "DELETE",
      "entitypath": "{base_path}/{version}/rooms/{pathv1}?{query}",
      "requestSchema": "schema.json",
      "responseSchema": "schema.json",
      "timeout": 0,
      "sendEmpty": false,
      "sendGetBody": false,
      "requestDatatype": "JSON",
      "responseDatatype": "JSON",
      "headers": {},
      "responseObjects": [
        {
          "type": "default",
          "key": "",
          "mockFile": ""
        }
      ]
    }
  ]
}