{
  "channel": {
    "created": 1502833204,
    "creator": "U061F7AUR",
    "id": "C0DEL09A5",
    "is_archived": false,
    "is_channel": true,
    "is_general": false,
    "is_member": true,
    "is_mpim": false,
    "is_org_shared": false,
    "is_private": false,
    "is_shared": false,
    "last_read": "0000000000.000000",
    "latest": null,
    "members": [
      "U061F7AUR"
    ],
    "name": "endeavor",
    "name_normalized": "endeavor",
    "previous_names": [],
    "purpose": {
      "creator": "",
      "last_set": 0,
      "value": ""
    },
    "topic": {
      "creator": "",
      "last_set": 0,
      "value": ""
    },
    "unread_count": 0,
    "unread_count_display": 0
  },
  "ok": true
}