{
  "actions": [
    {
      "name": "getUsersprofileget",
      "protocol": "REST",
      "method": "GET",
      "entitypath": "{base_path}/{version}/users.profile.get?{query}",
      "requestSchema": "schema.json",
      "responseSchema": "schema.json",
      "timeout": 0,
      "sendEmpty": false,
      "sendGetBody": false,
      "requestDatatype": "JSON",
      "responseDatatype": "JSON",
      "headers": {},
      "responseObjects": [
        {
          "type": "default",
          "key": "",
          "mockFile": "mockdatafiles/getUsersprofileget-default.json"
        }
      ]
    },
    {
      "name": "postUsersprofileset",
      "protocol": "REST",
      "method": "POST",
      "entitypath": "{base_path}/{version}/users.profile.set?{query}",
      "requestSchema": "schema.json",
      "responseSchema": "schema.json",
      "timeout": 0,
      "sendEmpty": false,
      "sendGetBody": false,
      "requestDatatype": "JSON",
      "responseDatatype": "JSON",
      "headers": {},
      "responseObjects": [
        {
          "type": "default",
          "key": "",
          "mockFile": "mockdatafiles/postUsersprofileset-default.json"
        }
      ]
    }
  ]
}