{
  "name": "adapter-ringcentral",
  "webName": "Adapter for Integration to RingCentral",
  "supportLevel": "community",
  "vendor": "RingCentral",
  "product": "RingCentral",
  "techAlliance": false,
  "osVersion": [],
  "apiVersions": [],
  "iapVersions": [
    "2021.1.x",
    "2021.2.x",
    "2022.1.x",
    "2023.1.x"
  ],
  "method": "REST",
  "type": "Adapter",
  "domains": [
    "Notifications"
  ],
  "tags": [
    "Notifications & Ticket Management"
  ],
  "useCases": [
    "Send an email message"
  ],
  "deprecated": {
    "isDeprecated": false
  },
  "brokerSince": "",
  "authMethods": [
    {
      "type": "OAuth",
      "subtypes": [],
      "primary": true
    }
  ],
  "documentation": {
    "storeLink": "",
    "npmLink": "https://www.npmjs.com/package/@itentialopensource/adapter-ringcentral",
    "repoLink": "https://gitlab.com/itentialopensource/adapters/adapter-ringcentral",
    "docLink": "https://gitlab.com/itentialopensource/adapters/adapter-ringcentral/-/blob/master/README.md?ref_type=heads",
    "demoLinks": [],
    "trainingLinks": [
      {
        "title": "Itential Academy",
        "link": "https://www.itential.com/itential-academy/"
      }
    ],
    "faqLink": "https://docs.itential.com/opensource/docs/troubleshooting-an-adapter",
    "contributeLink": "https://gitlab.com/itentialopensource/adapters/contributing-guide",
    "issueLink": "https://itential.atlassian.net/servicedesk/customer/portals",
    "webLink": "https://www.itential.com/adapters/ringcentral/",
    "vendorLink": "https://www.ringcentral.com/",
    "productLink": "https://www.ringcentral.com/",
    "apiLinks": [
      {
        "title": "RingCentral API",
        "link": "https://netstorage.ringcentral.com/dpw/api-reference/specs/public/office/rc-platform.yml?v=2024072220240628-0704",
        "public": true
      }
    ],
    "workshopLinks": [],
    "workshopHomePage": "https://www.itential.com/get-started/"
  },
  "assets": [],
  "relatedItems": {
    "adapters": [],
    "integrations": [],
    "ecosystemApplications": [],
    "workflowProjects": [],
    "transformationProjects": [],
    "exampleProjects": []
  }
}