[
  {
    "title": "title-value",
    "createdByAppId": "createdByAppId-value",
    "links": {
      "oneNoteClientUrl": {
        "href": "href-value"
      },
      "oneNoteWebUrl": {
        "href": "href-value"
      }
    },
    "contentUrl": "contentUrl-value",
    "content": "content-value",
    "lastModifiedDateTime": "2016-10-19T10:37:00Z"
  },
  {
    "title": "title-value",
    "createdByAppId": "createdByAppId-value",
    "links": {
      "oneNoteClientUrl": {
        "href": "href-value"
      },
      "oneNoteWebUrl": {
        "href": "href-value"
      }
    },
    "contentUrl": "contentUrl-value",
    "content": "content-value",
    "lastModifiedDateTime": "2016-10-19T10:37:00Z"
  },
  {
    "title": "title-value",
    "createdByAppId": "createdByAppId-value",
    "links": {
      "oneNoteClientUrl": {
        "href": "href-value"
      },
      "oneNoteWebUrl": {
        "href": "href-value"
      }
    },
    "contentUrl": "contentUrl-value",
    "content": "content-value",
    "lastModifiedDateTime": "2016-10-19T10:37:00Z"
  }
]