{
  "$id": "schema.json",
  "type": "object",
  "schema": "http://json-schema.org/draft-07/schema#",
  "translate": true,
  "dynamicfields": true,
  "properties": {
    "ph_request_type": {
      "type": "string",
      "description": "type of request (internal to adapter)",
      "default": "getDrivesId",
      "enum": [
        "getDrivesId",
        "getDrivesIdItemsId",
        "getDrives",
        "getDrivesIdRootDelta",
        "getDrivesIdItemsIdChildren"
      ],
      "external_name": "ph_request_type"
    },
    "select": {
      "description": "",
      "parse": false,
      "encode": false,
      "encrypt": {
        "type": "AES",
        "key": ""
      },
      "external_name": "$select"
    },
    "expand": {
      "description": "",
      "parse": false,
      "encode": false,
      "encrypt": {
        "type": "AES",
        "key": ""
      },
      "external_name": "$expand"
    }
  },
  "definitions": {}
}