[
  {
    "contentType": "string",
    "id": "string (identifier)",
    "isInline": true,
    "lastModifiedDateTime": "String (timestamp)",
    "name": "string",
    "size": 1024
  },
  {
    "contentType": "string",
    "id": "string (identifier)",
    "isInline": true,
    "lastModifiedDateTime": "String (timestamp)",
    "name": "string",
    "size": 1024
  },
  {
    "contentType": "string",
    "id": "string (identifier)",
    "isInline": true,
    "lastModifiedDateTime": "String (timestamp)",
    "name": "string",
    "size": 1024
  }
]