{
  "actions": [
    {
      "name": "getSitesIdOnenoteNotebooks",
      "protocol": "REST",
      "method": "GET",
      "entitypath": "{base_path}/{version}/sites/{pathv1}/onenote/notebooks?{query}",
      "requestSchema": "schema.json",
      "responseSchema": "schema.json",
      "timeout": 0,
      "sendEmpty": false,
      "sendGetBody": false,
      "requestDatatype": "JSON",
      "responseDatatype": "JSON",
      "headers": {},
      "responseObjects": [
        {
          "type": "default",
          "key": "",
          "mockFile": "mockdatafiles/getSitesIdOnenoteNotebooks-default.json"
        }
      ]
    },
    {
      "name": "postSitesIdOnenoteNotebooks",
      "protocol": "REST",
      "method": "POST",
      "entitypath": "{base_path}/{version}/sites/{pathv1}/onenote/notebooks?{query}",
      "requestSchema": "schema.json",
      "responseSchema": "schema.json",
      "timeout": 0,
      "sendEmpty": false,
      "sendGetBody": false,
      "requestDatatype": "JSON",
      "responseDatatype": "JSON",
      "headers": {},
      "responseObjects": [
        {
          "type": "default",
          "key": "",
          "mockFile": "mockdatafiles/postSitesIdOnenoteNotebooks-default.json"
        }
      ]
    },
    {
      "name": "getSitesIdOnenoteSectionGroups",
      "protocol": "REST",
      "method": "GET",
      "entitypath": "{base_path}/{version}/sites/{pathv1}/onenote/sectionGroups?{query}",
      "requestSchema": "schema.json",
      "responseSchema": "schema.json",
      "timeout": 0,
      "sendEmpty": false,
      "sendGetBody": false,
      "requestDatatype": "JSON",
      "responseDatatype": "JSON",
      "headers": {},
      "responseObjects": [
        {
          "type": "default",
          "key": "",
          "mockFile": "mockdatafiles/getSitesIdOnenoteSectionGroups-default.json"
        }
      ]
    },
    {
      "name": "getSitesIdOnenoteSections",
      "protocol": "REST",
      "method": "GET",
      "entitypath": "{base_path}/{version}/sites/{pathv1}/onenote/sections?{query}",
      "requestSchema": "schema.json",
      "responseSchema": "schema.json",
      "timeout": 0,
      "sendEmpty": false,
      "sendGetBody": false,
      "requestDatatype": "JSON",
      "responseDatatype": "JSON",
      "headers": {},
      "responseObjects": [
        {
          "type": "default",
          "key": "",
          "mockFile": "mockdatafiles/getSitesIdOnenoteSections-default.json"
        }
      ]
    },
    {
      "name": "getSitesIdOnenotePages",
      "protocol": "REST",
      "method": "GET",
      "entitypath": "{base_path}/{version}/sites/{pathv1}/onenote/pages?{query}",
      "requestSchema": "schema.json",
      "responseSchema": "schema.json",
      "timeout": 0,
      "sendEmpty": false,
      "sendGetBody": false,
      "requestDatatype": "JSON",
      "responseDatatype": "JSON",
      "headers": {},
      "responseObjects": [
        {
          "type": "default",
          "key": "",
          "mockFile": "mockdatafiles/getSitesIdOnenotePages-default.json"
        }
      ]
    },
    {
      "name": "postSitesIdOnenotePages",
      "protocol": "REST",
      "method": "POST",
      "entitypath": "{base_path}/{version}/sites/{pathv1}/onenote/pages?{query}",
      "requestSchema": "schema.json",
      "responseSchema": "schema.json",
      "timeout": 0,
      "sendEmpty": false,
      "sendGetBody": false,
      "requestDatatype": "FORM",
      "responseDatatype": "JSON",
      "headers": {},
      "responseObjects": [
        {
          "type": "default",
          "key": "",
          "mockFile": "mockdatafiles/postSitesIdOnenotePages-default.json"
        }
      ]
    },
    {
      "name": "getSitesRoot",
      "protocol": "REST",
      "method": "GET",
      "entitypath": "{base_path}/{version}/sites/root?{query}",
      "requestSchema": "schema.json",
      "responseSchema": "schema.json",
      "timeout": 0,
      "sendEmpty": false,
      "sendGetBody": false,
      "requestDatatype": "JSON",
      "responseDatatype": "JSON",
      "headers": {},
      "responseObjects": [
        {
          "type": "default",
          "key": "",
          "mockFile": "mockdatafiles/getSitesRoot-default.json"
        }
      ]
    }
  ]
}