[
  {
    "createdBy": {
      "@odata.type": "microsoft.graph.identitySet"
    },
    "createdDateTime": "String (timestamp)",
    "id": "string (identifier)",
    "isDefault": true,
    "isShared": true,
    "lastModifiedBy": {
      "@odata.type": "microsoft.graph.identitySet"
    },
    "lastModifiedDateTime": "String (timestamp)",
    "links": {
      "@odata.type": "microsoft.graph.notebookLinks"
    },
    "displayName": "string",
    "sectionGroupsUrl": "string",
    "sectionsUrl": "string",
    "self": "string",
    "userRole": "String"
  }
]