{
  "ccRecipients": [
    {
      "@odata.type": "string"
    },
    {
      "@odata.type": "string"
    },
    {
      "@odata.type": "string"
    }
  ],
  "hasAttachments": true,
  "id": "string",
  "isLocked": false,
  "lastDeliveredDateTime": "string",
  "preview": "string",
  "toRecipients": [
    {
      "@odata.type": "string"
    },
    {
      "@odata.type": "string"
    },
    {
      "@odata.type": "string"
    },
    {
      "@odata.type": "string"
    },
    {
      "@odata.type": "string"
    },
    {
      "@odata.type": "string"
    },
    {
      "@odata.type": "string"
    },
    {
      "@odata.type": "string"
    }
  ],
  "topic": "string",
  "uniqueSenders": [
    "string",
    "string",
    "string",
    "string",
    "string"
  ]
}