[
  {
    "id": "b1c5353a-7aca-41b3-830f-27d5218fe0e5",
    "externalId": "f31b1263-ba99-435a-a679-911d24850d7c",
    "name": "Test App",
    "version": "1.0.1",
    "distributionMethod": "Organization"
  },
  {
    "id": "b1c5353a-7aca-41b3-830f-27d5218fe0e5",
    "externalId": "f31b1263-ba99-435a-a679-911d24850d7c",
    "name": "Test App",
    "version": "1.0.1",
    "distributionMethod": "Organization"
  },
  {
    "id": "b1c5353a-7aca-41b3-830f-27d5218fe0e5",
    "externalId": "f31b1263-ba99-435a-a679-911d24850d7c",
    "name": "Test App",
    "version": "1.0.1",
    "distributionMethod": "Organization"
  },
  {
    "id": "b1c5353a-7aca-41b3-830f-27d5218fe0e5",
    "externalId": "f31b1263-ba99-435a-a679-911d24850d7c",
    "name": "Test App",
    "version": "1.0.1",
    "distributionMethod": "Organization"
  }
]