[
  {
    "@odata.type": "#microsoft.graph.driveItem",
    "createdDateTime": "2019-07-25T22:01:14Z",
    "id": "01HQCBV2N6Y2GOVW7725BZO354PWSELRRZ",
    "lastModifiedDateTime": "2019-07-29T19:35:09Z",
    "name": "root",
    "webUrl": "https://easytesting.sharepoint.com/sites/testGroup101-nick2/Shared%20Documents",
    "size": 32361,
    "parentReference": {
      "driveId": "b!dleYMKwLf0WeUv0wNOeaYpZtpdCbJ49KhND4gCVtbUj1vY7qHpRRQK738mb5aL93",
      "driveType": "documentLibrary"
    },
    "fileSystemInfo": {
      "createdDateTime": "2019-07-25T22:01:14Z",
      "lastModifiedDateTime": "2019-07-29T19:35:09Z"
    },
    "folder": {
      "childCount": 3
    },
    "root": {}
  }
]