[
  {
    "isDefault": true,
    "pagesUrl": "pagesUrl-value",
    "displayName": "name-value",
    "createdBy": {
      "user": {
        "id": "id-value",
        "displayName": "displayName-value"
      }
    },
    "lastModifiedBy": {
      "user": {
        "id": "id-value",
        "displayName": "displayName-value"
      }
    }
  },
  {
    "isDefault": true,
    "pagesUrl": "pagesUrl-value",
    "displayName": "name-value",
    "createdBy": {
      "user": {
        "id": "id-value",
        "displayName": "displayName-value"
      }
    },
    "lastModifiedBy": {
      "user": {
        "id": "id-value",
        "displayName": "displayName-value"
      }
    }
  },
  {
    "isDefault": true,
    "pagesUrl": "pagesUrl-value",
    "displayName": "name-value",
    "createdBy": {
      "user": {
        "id": "id-value",
        "displayName": "displayName-value"
      }
    },
    "lastModifiedBy": {
      "user": {
        "id": "id-value",
        "displayName": "displayName-value"
      }
    }
  },
  {
    "isDefault": true,
    "pagesUrl": "pagesUrl-value",
    "displayName": "name-value",
    "createdBy": {
      "user": {
        "id": "id-value",
        "displayName": "displayName-value"
      }
    },
    "lastModifiedBy": {
      "user": {
        "id": "id-value",
        "displayName": "displayName-value"
      }
    }
  }
]