{
  "actions": [
    {
      "name": "getUsersIdJoinedTeams",
      "protocol": "REST",
      "method": "GET",
      "entitypath": "{base_path}/{version}/users/{pathv1}/joinedTeams?{query}",
      "requestSchema": "schema.json",
      "responseSchema": "schema.json",
      "timeout": 0,
      "sendEmpty": false,
      "sendGetBody": false,
      "requestDatatype": "JSON",
      "responseDatatype": "JSON",
      "headers": {},
      "responseObjects": [
        {
          "type": "default",
          "key": "",
          "mockFile": "mockdatafiles/getUsersIdJoinedTeams-default.json"
        }
      ]
    },
    {
      "name": "getUsersIdOrUserPrincipalNameDrive",
      "protocol": "REST",
      "method": "GET",
      "entitypath": "{base_path}/{version}/users/{pathv1}/drive?{query}",
      "requestSchema": "schema.json",
      "responseSchema": "schema.json",
      "timeout": 0,
      "sendEmpty": false,
      "sendGetBody": false,
      "requestDatatype": "JSON",
      "responseDatatype": "JSON",
      "headers": {},
      "responseObjects": [
        {
          "type": "default",
          "key": "",
          "mockFile": "mockdatafiles/getUsersIdOrUserPrincipalNameDrive-default.json"
        }
      ]
    },
    {
      "name": "getUsersIdOrUserPrincipalNameOnenoteNotebooks",
      "protocol": "REST",
      "method": "GET",
      "entitypath": "{base_path}/{version}/users/{pathv1}/onenote/notebooks?{query}",
      "requestSchema": "schema.json",
      "responseSchema": "schema.json",
      "timeout": 0,
      "sendEmpty": false,
      "sendGetBody": false,
      "requestDatatype": "JSON",
      "responseDatatype": "JSON",
      "headers": {},
      "responseObjects": [
        {
          "type": "default",
          "key": "",
          "mockFile": "mockdatafiles/getUsersIdOrUserPrincipalNameOnenoteNotebooks-default.json"
        }
      ]
    },
    {
      "name": "postUsersIdOrUserPrincipalNameOnenoteNotebooks",
      "protocol": "REST",
      "method": "POST",
      "entitypath": "{base_path}/{version}/users/{pathv1}/onenote/notebooks?{query}",
      "requestSchema": "schema.json",
      "responseSchema": "schema.json",
      "timeout": 0,
      "sendEmpty": false,
      "sendGetBody": false,
      "requestDatatype": "JSON",
      "responseDatatype": "JSON",
      "headers": {},
      "responseObjects": [
        {
          "type": "default",
          "key": "",
          "mockFile": "mockdatafiles/postUsersIdOrUserPrincipalNameOnenoteNotebooks-default.json"
        }
      ]
    },
    {
      "name": "getUsersIdOrUserPrincipalNameOnenotePages",
      "protocol": "REST",
      "method": "GET",
      "entitypath": "{base_path}/{version}/users/{pathv1}/onenote/pages?{query}",
      "requestSchema": "schema.json",
      "responseSchema": "schema.json",
      "timeout": 0,
      "sendEmpty": false,
      "sendGetBody": false,
      "requestDatatype": "JSON",
      "responseDatatype": "JSON",
      "headers": {},
      "responseObjects": [
        {
          "type": "default",
          "key": "",
          "mockFile": "mockdatafiles/getUsersIdOrUserPrincipalNameOnenotePages-default.json"
        }
      ]
    },
    {
      "name": "postUsersIdOrUserPrincipalNameOnenotePages",
      "protocol": "REST",
      "method": "POST",
      "entitypath": "{base_path}/{version}/users/{pathv1}/onenote/pages?{query}",
      "requestSchema": "schema.json",
      "responseSchema": "schema.json",
      "timeout": 0,
      "sendEmpty": false,
      "sendGetBody": false,
      "requestDatatype": "FORM",
      "responseDatatype": "JSON",
      "headers": {},
      "responseObjects": [
        {
          "type": "default",
          "key": "",
          "mockFile": "mockdatafiles/postUsersIdOrUserPrincipalNameOnenotePages-default.json"
        }
      ]
    },
    {
      "name": "getUsersIdOrPrincipalNameOnenoteSectionGroups",
      "protocol": "REST",
      "method": "GET",
      "entitypath": "{base_path}/{version}/users/{pathv1}/onenote/sectionGroups?{query}",
      "requestSchema": "schema.json",
      "responseSchema": "schema.json",
      "timeout": 0,
      "sendEmpty": false,
      "sendGetBody": false,
      "requestDatatype": "JSON",
      "responseDatatype": "JSON",
      "headers": {},
      "responseObjects": [
        {
          "type": "default",
          "key": "",
          "mockFile": "mockdatafiles/getUsersIdOrPrincipalNameOnenoteSectionGroups-default.json"
        }
      ]
    },
    {
      "name": "getUsersIdOrPrincipalNameOnenoteSections",
      "protocol": "REST",
      "method": "GET",
      "entitypath": "{base_path}/{version}/users/{pathv1}/onenote/sections?{query}",
      "requestSchema": "schema.json",
      "responseSchema": "schema.json",
      "timeout": 0,
      "sendEmpty": false,
      "sendGetBody": false,
      "requestDatatype": "JSON",
      "responseDatatype": "JSON",
      "headers": {},
      "responseObjects": [
        {
          "type": "default",
          "key": "",
          "mockFile": "mockdatafiles/getUsersIdOrPrincipalNameOnenoteSections-default.json"
        }
      ]
    },
    {
      "name": "getUsersIdOrPrincipalNameEventsIdAttachments",
      "protocol": "REST",
      "method": "GET",
      "entitypath": "{base_path}/{version}/users/{pathv1}/events/{pathv2}/attachments?{query}",
      "requestSchema": "schema.json",
      "responseSchema": "schema.json",
      "timeout": 0,
      "sendEmpty": false,
      "sendGetBody": false,
      "requestDatatype": "JSON",
      "responseDatatype": "JSON",
      "headers": {},
      "responseObjects": [
        {
          "type": "default",
          "key": "",
          "mockFile": "mockdatafiles/getUsersIdOrPrincipalNameEventsIdAttachments-default.json"
        }
      ]
    },
    {
      "name": "postUsersIdOrPrincipalNameEventsIdAttachments",
      "protocol": "REST",
      "method": "POST",
      "entitypath": "{base_path}/{version}/users/{pathv1}/events/{pathv2}/attachments?{query}",
      "requestSchema": "schema.json",
      "responseSchema": "schema.json",
      "timeout": 0,
      "sendEmpty": false,
      "sendGetBody": false,
      "requestDatatype": "JSON",
      "responseDatatype": "JSON",
      "headers": {},
      "responseObjects": [
        {
          "type": "default",
          "key": "",
          "mockFile": "mockdatafiles/postUsersIdOrPrincipalNameEventsIdAttachments-default.json"
        }
      ]
    },
    {
      "name": "getUsersIdOrPrincipalNameDriveItemsId",
      "protocol": "REST",
      "method": "GET",
      "entitypath": "{base_path}/{version}/users/{pathv1}/drive/items/{pathv2}?{query}",
      "requestSchema": "schema.json",
      "responseSchema": "schema.json",
      "timeout": 0,
      "sendEmpty": false,
      "sendGetBody": false,
      "requestDatatype": "JSON",
      "responseDatatype": "JSON",
      "headers": {},
      "responseObjects": [
        {
          "type": "default",
          "key": "",
          "mockFile": "mockdatafiles/getUsersIdOrPrincipalNameDriveItemsId-default.json"
        }
      ]
    },
    {
      "name": "getUsersIdOrPrincipalNameDriveItemsIdChildren",
      "protocol": "REST",
      "method": "GET",
      "entitypath": "{base_path}/{version}/users/{pathv1}/drive/items/{pathv2}/children?{query}",
      "requestSchema": "schema.json",
      "responseSchema": "schema.json",
      "timeout": 0,
      "sendEmpty": false,
      "sendGetBody": false,
      "requestDatatype": "JSON",
      "responseDatatype": "JSON",
      "headers": {},
      "responseObjects": [
        {
          "type": "default",
          "key": "",
          "mockFile": "mockdatafiles/getUsersIdOrPrincipalNameDriveItemsIdChildren-default.json"
        }
      ]
    },
    {
      "name": "getUsersIdDriveRootDelta",
      "protocol": "REST",
      "method": "GET",
      "entitypath": "{base_path}/{version}/users/{pathv1}/drive/root/delta?{query}",
      "requestSchema": "schema.json",
      "responseSchema": "schema.json",
      "timeout": 0,
      "sendEmpty": false,
      "sendGetBody": false,
      "requestDatatype": "JSON",
      "responseDatatype": "JSON",
      "headers": {},
      "responseObjects": [
        {
          "type": "default",
          "key": "",
          "mockFile": "mockdatafiles/getUsersIdDriveRootDelta-default.json"
        }
      ]
    },
    {
      "name": "getUserMessages",
      "protocol": "REST",
      "method": "GET",
      "entitypath": "{base_path}/{version}/users/{pathv1}/messages?{query}",
      "requestSchema": "schema.json",
      "responseSchema": "schema.json",
      "timeout": 0,
      "sendEmpty": false,
      "sendGetBody": false,
      "requestDatatype": "JSON",
      "responseDatatype": "JSON",
      "headers": {},
      "responseObjects": [
        {
          "type": "default",
          "key": "",
          "mockFile": ""
        }
      ]
    },
    {
      "name": "postUserMessages",
      "protocol": "REST",
      "method": "POST",
      "entitypath": "{base_path}/{version}/users/{pathv1}/messages?{query}",
      "requestSchema": "schema.json",
      "responseSchema": "schema.json",
      "timeout": 0,
      "sendEmpty": false,
      "sendGetBody": false,
      "requestDatatype": "JSON",
      "responseDatatype": "JSON",
      "headers": {},
      "responseObjects": [
        {
          "type": "default",
          "key": "",
          "mockFile": ""
        }
      ]
    },
    {
      "name": "postUserMoveMessages",
      "protocol": "REST",
      "method": "POST",
      "entitypath": "{base_path}/{version}/users/{pathv1}/messages/{pathv2}/move?{query}",
      "requestSchema": "schema.json",
      "responseSchema": "schema.json",
      "timeout": 0,
      "sendEmpty": false,
      "sendGetBody": false,
      "requestDatatype": "JSON",
      "responseDatatype": "JSON",
      "headers": {},
      "responseObjects": [
        {
          "type": "default",
          "key": "",
          "mockFile": ""
        }
      ]
    },
    {
      "name": "getUserMessagesFromFolder",
      "protocol": "REST",
      "method": "GET",
      "entitypath": "{base_path}/{version}/users/{pathv1}/mailFolders/{pathv2}/messages?{query}",
      "requestSchema": "schema.json",
      "responseSchema": "schema.json",
      "timeout": 0,
      "sendEmpty": false,
      "sendGetBody": false,
      "requestDatatype": "JSON",
      "responseDatatype": "JSON",
      "headers": {},
      "responseObjects": [
        {
          "type": "default",
          "key": "",
          "mockFile": ""
        }
      ]
    },
    {
      "name": "postUserMessagesFromFolder",
      "protocol": "REST",
      "method": "POST",
      "entitypath": "{base_path}/{version}/users/{pathv1}/mailFolders/{pathv2}/messages?{query}",
      "requestSchema": "schema.json",
      "responseSchema": "schema.json",
      "timeout": 0,
      "sendEmpty": false,
      "sendGetBody": false,
      "requestDatatype": "JSON",
      "responseDatatype": "JSON",
      "headers": {},
      "responseObjects": [
        {
          "type": "default",
          "key": "",
          "mockFile": ""
        }
      ]
    }
  ]
}