{
  "attendees": [
    {
      "@odata.type": "string"
    },
    {
      "@odata.type": "string"
    },
    {
      "@odata.type": "string"
    },
    {
      "@odata.type": "string"
    },
    {
      "@odata.type": "string"
    },
    {
      "@odata.type": "string"
    },
    {
      "@odata.type": "string"
    },
    {
      "@odata.type": "string"
    },
    {
      "@odata.type": "string"
    },
    {
      "@odata.type": "string"
    }
  ],
  "body": {
    "@odata.type": "string"
  },
  "bodyPreview": "string",
  "categories": [
    "string",
    "string",
    "string"
  ],
  "changeKey": "string",
  "createdDateTime": "string",
  "end": {
    "@odata.type": "string"
  },
  "hasAttachments": true,
  "iCalUId": "string",
  "id": "string",
  "importance": "string",
  "isAllDay": false,
  "isCancelled": true,
  "isOrganizer": true,
  "isReminderOn": true,
  "lastModifiedDateTime": "string",
  "location": {
    "@odata.type": "string"
  },
  "locations": [
    {
      "@odata.type": "string"
    },
    {
      "@odata.type": "string"
    },
    {
      "@odata.type": "string"
    },
    {
      "@odata.type": "string"
    }
  ],
  "onlineMeetingUrl": "string",
  "organizer": {
    "@odata.type": "string"
  },
  "originalEndTimeZone": "string",
  "originalStart": "string",
  "originalStartTimeZone": "string",
  "recurrence": {
    "@odata.type": "string"
  },
  "reminderMinutesBeforeStart": 7,
  "responseRequested": true,
  "responseStatus": {
    "@odata.type": "string"
  },
  "sensitivity": "string",
  "seriesMasterId": "string",
  "showAs": "string",
  "start": {
    "@odata.type": "string"
  },
  "subject": "string",
  "type": "string",
  "webLink": "string",
  "attachments": [
    {
      "@odata.type": "string"
    },
    {
      "@odata.type": "string"
    },
    {
      "@odata.type": "string"
    },
    {
      "@odata.type": "string"
    },
    {
      "@odata.type": "string"
    },
    {
      "@odata.type": "string"
    },
    {
      "@odata.type": "string"
    },
    {
      "@odata.type": "string"
    },
    {
      "@odata.type": "string"
    },
    {
      "@odata.type": "string"
    }
  ],
  "calendar": {
    "@odata.type": "string"
  },
  "extensions": [
    {
      "@odata.type": "string"
    },
    {
      "@odata.type": "string"
    },
    {
      "@odata.type": "string"
    },
    {
      "@odata.type": "string"
    },
    {
      "@odata.type": "string"
    },
    {
      "@odata.type": "string"
    },
    {
      "@odata.type": "string"
    },
    {
      "@odata.type": "string"
    },
    {
      "@odata.type": "string"
    }
  ],
  "instances": [
    {
      "@odata.type": "string"
    },
    {
      "@odata.type": "string"
    }
  ],
  "multiValueExtendedProperties": [
    {
      "@odata.type": "string"
    }
  ],
  "singleValueExtendedProperties": [
    {
      "@odata.type": "string"
    },
    {
      "@odata.type": "string"
    }
  ]
}