{
  "name": "Itential ServiceNow App",
  "webName": "Itential ServiceNow App",
  "vendor": "ServiceNow",
  "product": "IT Service Management",
  "osVersions": [
    "Tokyo",
    "Utah",
    "Vancouver"
  ],
  "apiVersions": [],
  "iapVersions": [
    "2021.1.x",
    "2021.2.x",
    "2022.1.x",
    "2023.1.x"
  ],
  "method": "REST",
  "type": "Ecosystem Application",
  "domains": [
    "Inventory",
    "Discovery & Topology",
    "ITSM (Service Management)"
  ],
  "tags": [],
  "useCases": [
    "Start Automation in Itential"
  ],
  "deprecated": {
    "isDeprecated": false
  },
  "brokerSince": "",
  "documentation": {
    "storeLink": "https://store.servicenow.com/sn_appstore_store.do#!/store/application/f2ba728813da041032813092e144b01f",
    "npmLink": "",
    "repoLink": "",
    "docLink": "https://docs.itential.com/opensource/docs/servicenow-application",
    "demoLinks": [
      {
        "title": "Enable Network & Infrastructure Automation in a ServiceNow Flow with Itential’s Latest Release of its ServiceNow App",
        "link": "https://www.itential.com/live-webinar/enable-network-infrastructure-automation-in-a-servicenow-flow-with-itentials-latest-release-of-its-servicenow-app/"
      },
      {
        "title": "Introducing the Itential ServiceNow App: Enable Cloud-Like Service Delivery for Infrastructure Changes",
        "link": "https://www.itential.com/blog/developer/itential-automation-platform/introducing-the-itential-servicenow-app-enable-cloud-like-service-delivery-for-infrastructure-changes/"
      },
      {
        "title": "INTEGRATION - Itential + ServiceNow",
        "link": "https://www.itential.com/solutions/integrations/servicenow-network-automation/"
      }
    ],
    "trainingLinks": [
      {
        "title": "Build Flows, Not Tickets: How Itential’s Latest ServiceNow App Enables Infrastructure Changes to Be Requested & Delivered Instantly",
        "link": "https://www.itential.com/blog/company/self-serve-networking/build-flows-not-tickets-how-itentials-latest-servicenow-app-enables-infrastructure-changes-to-be-requested-delivered-instantly/"
      },
      {
        "title": "How to Leverage Itential Actions in ServiceNow Flows with Itential’s ServiceNow App",
        "link": "https://www.itential.com/resource/demo/how-to-leverage-itential-actions-with-itentials-servicenow-app/"
      }
    ],
    "faqLink": "",
    "contributeLink": "",
    "issueLink": "https://itential.atlassian.net/servicedesk/customer/portals",
    "webLink": "",
    "vendorLink": "https://www.servicenow.com/",
    "productLink": "https://www.servicenow.com/products/itsm.html",
    "apiLinks": []
  },
  "assets": [],
  "relatedItems": {
    "adapters": [
      {
        "name": "adapter-servicenow",
        "webName": "Adapter for Integration to ServiceNow",
        "overview": "Integration from Itential Automation Platform to ServiceNow.",
        "isDependency": false,
        "versions": [
          "^2.8.x"
        ],
        "repolink": "https://gitlab.com/itentialopensource/adapters/itsm-testing/adapter-servicenow",
        "doclink": "https://docs.itential.com/opensource/docs/servicenow",
        "webLink": "https://www.itential.com/adapters/servicenow/"
      }
    ],
    "integrations": [],
    "ecosystemApplications": [],
    "workflowProjects": [
      {
        "name": "ServiceNow - Now Platform - REST",
        "webName": "ServiceNow Platform Modular Automations",
        "overview": "Project with workflows for the Now Platform from ServiceNow",
        "isDependency": false,
        "versions": [
          "^1.0.0"
        ],
        "repoLink": "https://gitlab.com/itentialopensource/pre-built-automations/servicenow-now-platform-rest",
        "docLink": "",
        "webLink": "https://www.itential.com/automations/servicenow-platform-modular-automations/"
      }
    ],
    "transformationProjects": [],
    "exampleProjects": []
  }
}