{
  "$id": "schema.json",
  "type": "object",
  "schema": "http://json-schema.org/draft-07/schema#",
  "translate": true,
  "dynamicfields": true,
  "properties": {
    "ph_request_type": {
      "type": "string",
      "description": "type of request (internal to adapter)",
      "default": "sendTestConfiguration",
      "enum": [
        "sendTestConfiguration",
        "getApiHelp",
        "getHelpAllCommands",
        "getHelpSpecificCommand",
        "getHelpSpecificObject",
        "getHelpOnSpecificObjectHandle",
        "searchHelpInfo",
        "writeMessageToLog",
        "performApiMethod",
        "bulkPerformCommand",
        "getSystemInformation"
      ],
      "external_name": "ph_request_type"
    },
    "objectType": {
      "type": "string",
      "description": "",
      "parse": false,
      "encode": false,
      "encrypt": {
        "type": "AES",
        "key": ""
      },
      "external_name": "object_type"
    },
    "helpSearchSubject": {
      "type": "string",
      "description": "commands or configTypes",
      "parse": false,
      "encode": false,
      "encrypt": {
        "type": "AES",
        "key": ""
      },
      "external_name": "help_search_subject"
    },
    "bodyFormData": {
      "type": "object",
      "description": "Required: command, optional: params in key:val pairs",
      "parse": false,
      "encode": false,
      "encrypt": {
        "type": "AES",
        "key": ""
      },
      "external_name": "body"
    }
  },
  "definitions": {}
}