{
    "openapi": "3.0.0",
    "info": {
        "title": "spirentTestCenter",
        "contact": {},
        "version": "1.0"
    },
    "servers": [
        {
            "url": "https://localhost",
            "variables": {}
        }
    ],
    "paths": {
        "/sessions/": {
            "get": {
                "tags": [
                    "sessionManagement"
                ],
                "summary": "list current sessions",
                "operationId": "listCurrentSessions",
                "parameters": [],
                "responses": {
                    "200": {
                        "description": "",
                        "headers": {}
                    }
                }
            },
            "post": {
                "tags": [
                    "sessionManagement"
                ],
                "summary": "create a new session",
                "operationId": "createNewSession",
                "parameters": [],
                "requestBody": {
                    "content": {
                        "application/x-www-form-urlencoded": {
                            "encoding": {},
                            "schema": {
                                "type": "object",
                                "description": "Must include userid and optional sessionname"
                            }
                        }
                    },
                    "required": true
                },
                "responses": {
                    "200": {
                        "description": "",
                        "headers": {}
                    }
                }
            }
        },
        "/sessions/{session_id}": {
            "get": {
                "tags": [
                    "sessionManagement"
                ],
                "summary": "Get information on a specified session.",
                "operationId": "getSessionInfo",
                "parameters": [
                    {
                        "name": "session_id",
                        "in": "path",
                        "description": "session id",
                        "required": true,
                        "schema": {
                            "type": "string"
                        }
                    }
                ],
                "responses": {
                    "200": {
                        "description": "",
                        "headers": {}
                    }
                }
            },
            "head": {
                "tags": [
                    "sessionManagement"
                ],
                "summary": "Determine if the specified session exists.",
                "operationId": "checkSessionExistance",
                "parameters": [
                    {
                        "name": "session_id",
                        "in": "path",
                        "description": "session id",
                        "required": true,
                        "schema": {
                            "type": "string"
                        }
                    }
                ],
                "responses": {
                    "200": {
                        "description": "",
                        "headers": {}
                    }
                }
            },
            "delete": {
                "tags": [
                    "sessionManagement"
                ],
                "summary": "end a session",
                "operationId": "endSession",
                "parameters": [
                    {
                        "name": "session_id",
                        "in": "path",
                        "description": "session id",
                        "required": true,
                        "schema": {
                            "type": "string"
                        }
                    }
                ],
                "responses": {
                    "200": {
                        "description": "",
                        "headers": {}
                    }
                }
            }
        },
        "/objects/": {
            "post": {
                "tags": [
                    "objectManagement"
                ],
                "summary": "Create a new Spirent TestCenter object.",
                "operationId": "createTestCenterObject",
                "parameters": [
                    {
                        "name": "X-STC-API-Session",
                        "in": "header",
                        "description": "test session id",
                        "required": false,
                        "schema": {
                            "type": "string"
                        }
                    }
                ],
                "requestBody": {
                    "content": {
                        "application/x-www-form-urlencoded": {
                            "encoding": {},
                            "schema": {
                                "type": "object",
                                "description": "Required: object_type. Other key val pairs optional"
                            }
                        }
                    },
                    "required": false
                },
                "responses": {
                    "200": {
                        "description": "",
                        "headers": {}
                    }
                }
            }
        },
        "/objects/{handle_or_DDN_path}": {
            "put": {
                "tags": [
                    "objectManagement"
                ],
                "summary": "Configure the specified Spirent TestCenter object.",
                "operationId": "configureTestCenterObject",
                "parameters": [
                    {
                        "name": "handle_or_DDN_path",
                        "in": "path",
                        "description": "The string value of the object handle that identifies the object to be modified, or DDNpath identifying the object.",
                        "required": true,
                        "schema": {
                            "type": "string"
                        }
                    },
                    {
                        "name": "X-STC-API-Session",
                        "in": "header",
                        "description": "test session id",
                        "required": false,
                        "schema": {
                            "type": "string"
                        }
                    }
                ],
                "requestBody": {
                    "content": {
                        "application/x-www-form-urlencoded": {
                            "encoding": {},
                            "schema": {
                                "type": "object",
                                "description": "optional key val pairs, eg name, DANpath"
                            }
                        }
                    },
                    "required": false
                },
                "responses": {
                    "200": {
                        "description": "",
                        "headers": {}
                    }
                }
            },
            "get": {
                "tags": [
                    "objectManagement"
                ],
                "summary": "",
                "operationId": "getAttributesOrObjectHandles",
                "parameters": [
                    {
                        "name": "handle_or_DDN_path",
                        "in": "path",
                        "description": "",
                        "required": true,
                        "schema": {
                            "type": "string"
                        }
                    },
                    {
                        "name": "attributes",
                        "in": "query",
                        "description": "Attrubute(s) to return",
                        "schema": {
                            "type": "string"
                        }
                    },
                    {
                        "name": "X-STC-API-Session",
                        "in": "header",
                        "description": "test session id",
                        "required": false,
                        "schema": {
                            "type": "string"
                        }
                    }
                ],
                "responses": {
                    "200": {
                        "description": "",
                        "headers": {}
                    }
                }
            }
        },
        "/objects/{handle}": {
            "delete": {
                "tags": [
                    "objectManagement"
                ],
                "summary": "",
                "operationId": "deleteObject",
                "parameters": [
                    {
                        "name": "handle",
                        "in": "path",
                        "description": "",
                        "required": true,
                        "schema": {
                            "type": "string"
                        }
                    },
                    {
                        "name": "X-STC-API-Session",
                        "in": "header",
                        "description": "test session id",
                        "required": false,
                        "schema": {
                            "type": "string"
                        }
                    }
                ],
                "responses": {
                    "200": {
                        "description": "",
                        "headers": {}
                    }
                }
            }
        },
        "/bulk/objects/": {
            "post": {
                "tags": [
                    "bulkObjectManagement"
                ],
                "summary": "",
                "operationId": "createOneOrMoreAutomationObjects",
                "parameters": [                    {
                    "name": "X-STC-API-Session",
                    "in": "header",
                    "description": "test session id",
                    "required": false,
                    "schema": {
                        "type": "string"
                    }
                }],
                "requestBody": {
                    "description": "Include under, object_type, and attributes in key value pairs",
                    "content": {
                        "application/json": {
                            "schema": {
                                "type": "object",
                                "properties": {
                                    "object_type": {
                                        "type": "string",
                                        "example": "jdoe"
                                    },
                                    "under": {
                                        "type": "string"
                                    }
                                }
                            }
                        }
                    }
                },
                "responses": {
                    "200": {
                        "description": "",
                        "headers": {}
                    }
                }
            }
        },
        "/bulk/objects/{object}": {
            "put": {
                "tags": [
                    "bulkObjectManagement"
                ],
                "summary": "",
                "operationId": "bulkConfigureObjectAttributes",
                "parameters": [
                    {
                        "name": "object",
                        "in": "path",
                        "description": "",
                        "required": true,
                        "schema": {
                            "type": "string"
                        }
                    },
                    {
                        "name": "X-STC-API-Session",
                        "in": "header",
                        "description": "test session id",
                        "required": false,
                        "schema": {
                            "type": "string"
                        }
                    }
                ],
                "requestBody": {
                    "description": "Attributes to modify in key val pairs",
                    "content": {
                        "application/json": {
                            "schema": {
                                "type": "object"
                            }
                        }
                    }
                },
                "responses": {
                    "200": {
                        "description": "",
                        "headers": {}
                    }
                }
            },
            "get": {
                "tags": [
                    "bulkObjectManagement"
                ],
                "summary": "Returns the value(s) of one or more object attributes.",
                "operationId": "getValueOfOneOrMoreAttributes",
                "parameters": [
                    {
                        "name": "object",
                        "in": "path",
                        "description": "objectxpath or objecthandle list",
                        "required": true,
                        "schema": {
                            "type": "string"
                        }
                    },
                    {
                        "name": "X-STC-API-Session",
                        "in": "header",
                        "description": "test session id",
                        "required": false,
                        "schema": {
                            "type": "string"
                        }
                    }
                ],
                "responses": {
                    "200": {
                        "description": "",
                        "headers": {}
                    }
                }
            },
            "delete": {
                "tags": [
                    "bulkObjectManagement"
                ],
                "summary": "Bulk Delete the specified objects. Note that this request accepts an object identified by its handle or xpath expression.",
                "operationId": "bulkDeleteObjects",
                "parameters": [
                    {
                        "name": "object",
                        "in": "path",
                        "description": "",
                        "required": true,
                        "schema": {
                            "type": "string",
                            "example": "emulateddevice[@name=\"mydev\"]/bgprouterconfig/bgpipv4routeconfig"
                        }
                    },
                    {
                        "name": "X-STC-API-Session",
                        "in": "header",
                        "description": "test session id",
                        "required": false,
                        "schema": {
                            "type": "string"
                        }
                    }
                ],
                "responses": {
                    "200": {
                        "description": "",
                        "headers": {}
                    }
                }
            }
        },
        "/connections/": {
            "post": {
                "tags": [
                    "chassisConnections"
                ],
                "summary": "Connect to the specified chassis, where chassis_addr is the chassis IP address or hostname string.OR Reconnect to all previously connected chassis",
                "operationId": "connectToChassis",
                "parameters": [                    {
                    "name": "X-STC-API-Session",
                    "in": "header",
                    "description": "test session id",
                    "required": false,
                    "schema": {
                        "type": "string"
                    }
                }],
                "requestBody": {
                    "content": {
                        "application/x-www-form-urlencoded": {
                            "encoding": {},
                            "schema": {
                                "type": "object",
                                "description": "Include action type"
                            }
                        }
                    },
                    "required": true
                },
                "responses": {
                    "200": {
                        "description": "",
                        "headers": {}
                    }
                }
            },
            "get": {
                "tags": [
                    "chassisConnections"
                ],
                "summary": "Get connection status of all known chassis.",
                "operationId": "getConnectionStatusAllChassis",
                "parameters": [                    {
                    "name": "X-STC-API-Session",
                    "in": "header",
                    "description": "test session id",
                    "required": false,
                    "schema": {
                        "type": "string"
                    }
                }],
                "responses": {
                    "200": {
                        "description": "",
                        "headers": {}
                    }
                }
            }
        },
        "/connections/{chassis_addr}": {
            "put": {
                "tags": [
                    "chassisConnections"
                ],
                "summary": "Connect to the specified chassis. The chassis is specified by IP address or hostname string.",
                "operationId": "connectToSpecifiedChassis",
                "parameters": [
                    {
                        "name": "chassis_addr",
                        "in": "path",
                        "description": "",
                        "required": true,
                        "schema": {
                            "type": "string"
                        }
                    },
                    {
                        "name": "X-STC-API-Session",
                        "in": "header",
                        "description": "test session id",
                        "required": false,
                        "schema": {
                            "type": "string"
                        }
                    }
                ],
                "responses": {
                    "200": {
                        "description": "",
                        "headers": {}
                    }
                }
            },
            "delete": {
                "tags": [
                    "chassisConnections"
                ],
                "summary": "Disconnect from the specified chassis",
                "operationId": "disconnectFromSpecifiedChassis",
                "parameters": [
                    {
                        "name": "chassis_addr",
                        "in": "path",
                        "description": "",
                        "required": true,
                        "schema": {
                            "type": "string"
                        }
                    },
                    {
                        "name": "X-STC-API-Session",
                        "in": "header",
                        "description": "test session id",
                        "required": false,
                        "schema": {
                            "type": "string"
                        }
                    }
                ],
                "responses": {
                    "200": {
                        "description": "",
                        "headers": {}
                    }
                }
            },
            "get": {
                "tags": [
                    "chassisConnections"
                ],
                "summary": "Get connection status of specified chassis.",
                "operationId": "getSpecifiedChassisStatus",
                "parameters": [
                    {
                        "name": "chassis_addr",
                        "in": "path",
                        "description": "",
                        "required": true,
                        "schema": {
                            "type": "string"
                        }
                    },
                    {
                        "name": "X-STC-API-Session",
                        "in": "header",
                        "description": "test session id",
                        "required": false,
                        "schema": {
                            "type": "string"
                        }
                    }
                ],
                "responses": {
                    "200": {
                        "description": "",
                        "headers": {}
                    }
                }
            }
        },
        "/apply": {
            "put": {
                "tags": [
                    "systemFunctions"
                ],
                "summary": "Apply configuration to all connected chassis.",
                "operationId": "sendTestConfiguration",
                "parameters": [                    {
                    "name": "X-STC-API-Session",
                    "in": "header",
                    "description": "test session id",
                    "required": false,
                    "schema": {
                        "type": "string"
                    }
                }],
                "responses": {
                    "200": {
                        "description": "",
                        "headers": {}
                    }
                }
            }
        },
        "/help": {
            "get": {
                "tags": [
                    "systemFunctions"
                ],
                "summary": "Get API usage help.",
                "operationId": "getApiHelp",
                "parameters": [],
                "responses": {
                    "200": {
                        "description": "",
                        "headers": {}
                    }
                }
            }
        },
        "/help/commands/": {
            "get": {
                "tags": [
                    "systemFunctions"
                ],
                "summary": "Get help describing all available commands.",
                "operationId": "getHelpAllCommands",
                "parameters": [],
                "responses": {
                    "200": {
                        "description": "",
                        "headers": {}
                    }
                }
            }
        },
        "/help/{command}": {
            "get": {
                "tags": [
                    "systemFunctions"
                ],
                "summary": "Get help on specified command.",
                "operationId": "getHelpSpecificCommand",
                "parameters": [
                    {
                        "name": "command",
                        "in": "path",
                        "description": "",
                        "required": true,
                        "schema": {
                            "type": "string"
                        }
                    }
                ],
                "responses": {
                    "200": {
                        "description": "",
                        "headers": {}
                    }
                }
            }
        },
        "/help/{object_type}": {
            "get": {
                "tags": [
                    "systemFunctions"
                ],
                "summary": "Get help on specified object type (requires session).",
                "operationId": "getHelpSpecificObject",
                "parameters": [
                    {
                        "name": "object_type",
                        "in": "path",
                        "description": "",
                        "required": true,
                        "schema": {
                            "type": "string"
                        }
                    },
                    {
                        "name": "X-STC-API-Session",
                        "in": "header",
                        "description": "test session id",
                        "required": false,
                        "schema": {
                            "type": "string"
                        }
                    }
                ],
                "responses": {
                    "200": {
                        "description": "",
                        "headers": {}
                    }
                }
            }
        },
        "/help/{handle}": {
            "get": {
                "tags": [
                    "systemFunctions"
                ],
                "summary": "Get help on specified object (requires session).",
                "operationId": "getHelpOnSpecificObjectHandle",
                "parameters": [
                    {
                        "name": "handle",
                        "in": "path",
                        "description": "",
                        "required": true,
                        "schema": {
                            "type": "string"
                        }
                    },
                    {
                        "name": "X-STC-API-Session",
                        "in": "header",
                        "description": "test session id",
                        "required": false,
                        "schema": {
                            "type": "string"
                        }
                    }
                ],
                "responses": {
                    "200": {
                        "description": "",
                        "headers": {}
                    }
                }
            }
        },
        "/help/list": {
            "get": {
                "tags": [
                    "systemFunctions"
                ],
                "summary": "Search for commands or config types (requires session). First query string parameter must be commands or configTypes, followed by optional wildcard pattern to match.",
                "operationId": "searchHelpInfo",
                "parameters": [
                    {
                        "name": "help_search_subject",
                        "in": "query",
                        "description": "commands or configTypes",
                        "required": true,
                        "schema": {
                            "type": "string"
                        }
                    },
                    {
                        "name": "pattern",
                        "in": "query",
                        "description": "wildcard pattern or stak",
                        "required": false,
                        "schema": {
                            "type": "string"
                        }
                    },
                    {
                        "name": "X-STC-API-Session",
                        "in": "header",
                        "description": "test session id",
                        "required": false,
                        "schema": {
                            "type": "string"
                        }
                    }
                ],
                "responses": {
                    "200": {
                        "description": "",
                        "headers": {}
                    }
                }
            }
        },
        "/log/": {
            "post": {
                "tags": [
                    "systemFunctions"
                ],
                "summary": "Tell Spirent TestCenter to write the given message to the BLL log file, using the optionally specified severity level.",
                "operationId": "writeMessageToLog",
                "parameters": [                    {
                    "name": "X-STC-API-Session",
                    "in": "header",
                    "description": "test session id",
                    "required": false,
                    "schema": {
                        "type": "string"
                    }
                }],
                "requestBody": {
                    "content": {
                        "application/x-www-form-urlencoded": {
                            "encoding": {},
                            "schema": {
                                "type": "object",
                                "description": "Required: message, optional: log_level"
                            }
                        }
                    },
                    "required": true
                },
                "responses": {
                    "200": {
                        "description": "",
                        "headers": {}
                    }
                }
            }
        },
        "/files/{file_name}": {
            "get": {
                "tags": [
                    "fileManagement"
                ],
                "summary": "Download the specified file from the files in the session.",
                "operationId": "downloadSpecifiedFile",
                "parameters": [
                    {
                        "name": "file_name",
                        "in": "path",
                        "description": "",
                        "required": true,
                        "schema": {
                            "type": "string"
                        }
                    },
                    {
                        "name": "X-STC-API-Session",
                        "in": "header",
                        "description": "test session id",
                        "required": false,
                        "schema": {
                            "type": "string"
                        }
                    }
                ],
                "responses": {
                    "200": {
                        "description": "",
                        "headers": {}
                    }
                }
            },
            "put": {
                "tags": [
                    "fileManagement"
                ],
                "summary": "Upload the specified file into the session. File name specified in URL",
                "operationId": "uploadFileToSession",
                "parameters": [
                    {
                        "name": "file_name",
                        "in": "path",
                        "description": "",
                        "required": true,
                        "schema": {
                            "type": "string"
                        }
                    },
                    {
                        "name": "content-disposition",
                        "in": "header",
                        "required": true,
                        "schema": {
                            "type": "string"
                        }
                    },                    {
                        "name": "X-STC-API-Session",
                        "in": "header",
                        "description": "test session id",
                        "required": false,
                        "schema": {
                            "type": "string"
                        }
                    }
                ],
                "requestBody": {
                    "content": {
                        "application/octet-stream": {
                            "encoding": {},
                            "schema": {
                                "type": "string",
                                "format": "binary"
                            }
                        }
                    },
                    "required": false
                },
                "responses": {
                    "200": {
                        "description": "",
                        "headers": {}
                    }
                }
            }
        },
        "/files/": {
            "get": {
                "tags": [
                    "fileManagement"
                ],
                "summary": "List files in sessions.",
                "operationId": "listSessionFiles",
                "parameters": [                    {
                    "name": "X-STC-API-Session",
                    "in": "header",
                    "description": "test session id",
                    "required": false,
                    "schema": {
                        "type": "string"
                    }
                }],
                "responses": {
                    "200": {
                        "description": "",
                        "headers": {}
                    }
                }
            },
            "post": {
                "tags": [
                    "fileManagement"
                ],
                "summary": "Upload the specified file into the session. The file name is expected to be in the “content-disposition” header of the request.",
                "operationId": "uploadFilePost",
                "parameters": [
                    {
                        "name": "content-disposition",
                        "in": "header",
                        "required": true,
                        "schema": {
                            "type": "string"
                        }
                    },
                    {
                        "name": "X-STC-API-Session",
                        "in": "header",
                        "description": "test session id",
                        "required": false,
                        "schema": {
                            "type": "string"
                        }
                    }
                ],
                "requestBody": {
                    "content": {
                        "application/octet-stream": {
                            "encoding": {},
                            "schema": {
                                "type": "string",
                                "format": "binary"
                            }
                        }
                    },
                    "required": true
                },
                "responses": {
                    "200": {
                        "description": "",
                        "headers": {}
                    }
                }
            }
        },
        "/perform/": {
            "post": {
                "tags": [
                    "systemFunctions"
                ],
                "summary": "Tell Spirent TestCenter to perform the specified command, passing it the specified parameters.",
                "operationId": "performApiMethod",
                "parameters": [                    {
                    "name": "X-STC-API-Session",
                    "in": "header",
                    "description": "test session id",
                    "required": false,
                    "schema": {
                        "type": "string"
                    }
                }],
                "requestBody": {
                    "content": {
                        "application/x-www-form-urlencoded": {
                            "encoding": {},
                            "schema": {
                                "type": "object",
                                "description": "required: command, optional: attributes in key:val pairs"
                            }
                        }
                    },
                    "required": false
                },
                "responses": {
                    "200": {
                        "description": "",
                        "headers": {}
                    }
                }
            }
        },
        "/bulk/perform/": {
            "post": {
                "tags": [
                    "systemFunctions"
                ],
                "summary": "Tell Spirent TestCenter to perform the specified command, passing it the specified parameters.",
                "operationId": "bulkPerformCommand",
                "parameters": [                    {
                    "name": "X-STC-API-Session",
                    "in": "header",
                    "description": "test session id",
                    "required": false,
                    "schema": {
                        "type": "string"
                    }
                }],
                "requestBody": {
                    "content": {
                        "application/x-www-form-urlencoded": {
                            "encoding": {},
                            "schema": {
                                "type": "object",
                                "description": "Required: command, optional: params in key:val pairs"
                            }
                        }
                    },
                    "required": false
                },
                "responses": {
                    "200": {
                        "description": "",
                        "headers": {}
                    }
                }
            }
        },
        "/system/": {
            "get": {
                "tags": [
                    "systemFunctions"
                ],
                "summary": "Get information about the Spirent TestCenter system.",
                "operationId": "getSystemInformation",
                "parameters": [                    {
                    "name": "X-STC-API-Session",
                    "in": "header",
                    "description": "test session id",
                    "required": false,
                    "schema": {
                        "type": "string"
                    }
                }],
                "responses": {
                    "200": {
                        "description": "",
                        "headers": {}
                    }
                }
            }
        }
    },
    "components": {},
    "security": [],
    "tags": []
}