{
  "actions": [
    {
      "name": "getAssetById",
      "protocol": "REST",
      "method": "GET",
      "entitypath": "{base_path}/{version}/other_assets/{pathv1}.json?{query}",
      "requestSchema": "schema.json",
      "responseSchema": "schema.json",
      "timeout": 0,
      "sendEmpty": false,
      "sendGetBody": false,
      "requestDatatype": "JSON",
      "responseDatatype": "JSON",
      "headers": {},
      "responseObjects": [
        {
          "type": "default",
          "key": "",
          "mockFile": "mockdatafiles/getAssetById-default.json"
        }
      ]
    },
    {
      "name": "updateAssetById",
      "protocol": "REST",
      "method": "PUT",
      "entitypath": "{base_path}/{version}/other_assets/{pathv1}.json?{query}",
      "requestSchema": "schema.json",
      "responseSchema": "schema.json",
      "timeout": 0,
      "sendEmpty": false,
      "requestDatatype": "JSON",
      "responseDatatype": "JSON",
      "headers": {},
      "responseObjects": [
        {
          "type": "default",
          "key": "",
          "mockFile": "mockdatafiles/updateAssetById-default.json"
        }
      ]
    },
    {
      "name": "deleteAssetById",
      "protocol": "REST",
      "method": "DELETE",
      "entitypath": "{base_path}/{version}/other_assets/{pathv1}.json?{query}",
      "requestSchema": "schema.json",
      "responseSchema": "schema.json",
      "timeout": 0,
      "sendEmpty": false,
      "requestDatatype": "JSON",
      "responseDatatype": "JSON",
      "headers": {},
      "responseObjects": [
        {
          "type": "default",
          "key": "",
          "mockFile": "mockdatafiles/deleteAssetById-default.json"
        }
      ]
    },
    {
      "name": "getAssets",
      "protocol": "REST",
      "method": "GET",
      "entitypath": "{base_path}/{version}/other_assets.json?{query}",
      "requestSchema": "schema.json",
      "responseSchema": "schema.json",
      "timeout": 0,
      "sendEmpty": false,
      "sendGetBody": false,
      "requestDatatype": "JSON",
      "responseDatatype": "JSON",
      "headers": {},
      "responseObjects": [
        {
          "type": "default",
          "key": "",
          "mockFile": "mockdatafiles/getAssets-default.json"
        }
      ]
    },
    {
      "name": "createAsset",
      "protocol": "REST",
      "method": "POST",
      "entitypath": "{base_path}/{version}/other_assets.json?{query}",
      "requestSchema": "schema.json",
      "responseSchema": "schema.json",
      "timeout": 0,
      "sendEmpty": false,
      "requestDatatype": "JSON",
      "responseDatatype": "JSON",
      "headers": {},
      "responseObjects": [
        {
          "type": "default",
          "key": "",
          "mockFile": "mockdatafiles/createAsset-default.json"
        }
      ]
    }
  ]
}