{
  "time_track": {
    "id": null,
    "name": "Time Track Name",
    "minutes": "120",
    "created_at": "2025-01-01T00:00:00.000+01:00",
    "updated_at": "2025-01-01T00:00:00.000+01:00",
    "creator": {
      "id": null,
      "account_id": null,
      "user_id": null,
      "email": "john.doe@email.com",
      "name": "John Doe",
      "disabled": true,
      "avatar": {
        "type": "initials",
        "color": "#1000",
        "initials": "JD"
      }
    },
    "parent": {
      "id": null,
      "class": "Incident"
    }
  }
}