{
  "actions": [
    {
      "name": "getGroupById",
      "protocol": "REST",
      "method": "GET",
      "entitypath": "{base_path}/{version}/groups/{pathv1}.json?{query}",
      "requestSchema": "schema.json",
      "responseSchema": "schema.json",
      "timeout": 0,
      "sendEmpty": false,
      "sendGetBody": false,
      "requestDatatype": "JSON",
      "responseDatatype": "JSON",
      "headers": {},
      "responseObjects": [
        {
          "type": "default",
          "key": "",
          "mockFile": "mockdatafiles/getGroupById-default.json"
        }
      ]
    },
    {
      "name": "updateGroupById",
      "protocol": "REST",
      "method": "PUT",
      "entitypath": "{base_path}/{version}/groups/{pathv1}.json?{query}",
      "requestSchema": "schema.json",
      "responseSchema": "schema.json",
      "timeout": 0,
      "sendEmpty": false,
      "requestDatatype": "JSON",
      "responseDatatype": "JSON",
      "headers": {},
      "responseObjects": [
        {
          "type": "default",
          "key": "",
          "mockFile": "mockdatafiles/updateGroupById-default.json"
        }
      ]
    },
    {
      "name": "deleteGroupById",
      "protocol": "REST",
      "method": "DELETE",
      "entitypath": "{base_path}/{version}/groups/{pathv1}.json?{query}",
      "requestSchema": "schema.json",
      "responseSchema": "schema.json",
      "timeout": 0,
      "sendEmpty": false,
      "requestDatatype": "JSON",
      "responseDatatype": "JSON",
      "headers": {},
      "responseObjects": [
        {
          "type": "default",
          "key": "",
          "mockFile": "mockdatafiles/deleteGroupById-default.json"
        }
      ]
    },
    {
      "name": "getGroups",
      "protocol": "REST",
      "method": "GET",
      "entitypath": "{base_path}/{version}/groups.json?{query}",
      "requestSchema": "schema.json",
      "responseSchema": "schema.json",
      "timeout": 0,
      "sendEmpty": false,
      "sendGetBody": false,
      "requestDatatype": "JSON",
      "responseDatatype": "JSON",
      "headers": {},
      "responseObjects": [
        {
          "type": "default",
          "key": "",
          "mockFile": "mockdatafiles/getGroups-default.json"
        }
      ]
    },
    {
      "name": "createGroup",
      "protocol": "REST",
      "method": "POST",
      "entitypath": "{base_path}/{version}/groups.json?{query}",
      "requestSchema": "schema.json",
      "responseSchema": "schema.json",
      "timeout": 0,
      "sendEmpty": false,
      "requestDatatype": "JSON",
      "responseDatatype": "JSON",
      "headers": {},
      "responseObjects": [
        {
          "type": "default",
          "key": "",
          "mockFile": "mockdatafiles/createGroup-default.json"
        }
      ]
    }
  ]
}