{
  "user": {
    "id": "10000",
    "name": "John Doe",
    "title": "Support Agent",
    "disabled": false,
    "email": "john.doe@email.com",
    "created_at": "2030-01-01T00:00:00.000+00:00",
    "phone": "+10000000",
    "mobile_phone": "+10000000",
    "site": {
      "id": "1",
      "name": "Austin TX, USA",
      "location": "AUS",
      "description": "",
      "time_zone": ""
    },
    "department": {
      "id": "1",
      "name": "Support",
      "description": "",
      "default_assignee_id": "1"
    },
    "role": {
      "id": 1,
      "name": "Requester",
      "description": "Requester role.",
      "portal": true,
      "show_my_tasks": true
    },
    "group_ids": [
      1
    ],
    "avatar": {
      "type": "initials",
      "color": "#fd4165",
      "initials": "JD"
    },
    "reports_to": {
      "group_id": "1",
      "is_user": "true",
      "id": "100",
      "name": "Jane Doe",
      "email": "jane.doe@email.com",
      "avatar": {
        "type": "initials",
        "color": "#fd4166",
        "initials": "JD"
      }
    },
    "custom_fields_values": [
      {
        "id": "10",
        "custom_field_id": "1",
        "name": "Text custom field",
        "value": "content",
        "options": "",
        "type_name": "Text"
      },
      {
        "id": "100",
        "custom_field_id": "2",
        "name": "User custom field",
        "value": "1",
        "options": "",
        "type_name": "User",
        "user": {
          "group_id": 1,
          "is_user": true,
          "id": 1,
          "name": "John Doe",
          "email": "john.doe@email.com"
        }
      }
    ]
  }
}