{
  "group": {
    "id": null,
    "name": "Group Name",
    "description": "Group Description",
    "is_user": true,
    "reports_to": {
      "group_id": null,
      "is_user": null,
      "id": null,
      "name": "John Doe",
      "email": "john.doe@email.com",
      "avatar": {
        "type": "initials",
        "color": "#1000",
        "initials": "JD"
      }
    },
    "avatar": {
      "type": "initials",
      "color": "#1000",
      "initials": "JD"
    },
    "send_notifications": true,
    "memberships": [
      {
        "id": null,
        "user": "John Doe"
      },
      {
        "id": null,
        "user": "John Doe"
      },
      {
        "id": null,
        "user": "John Doe"
      },
      {
        "id": null,
        "user": "John Doe"
      },
      {
        "id": null,
        "user": "John Doe"
      },
      {
        "id": null,
        "user": "John Doe"
      },
      {
        "id": null,
        "user": "John Doe"
      },
      {
        "id": null,
        "user": "John Doe"
      },
      {
        "id": null,
        "user": "John Doe"
      }
    ]
  }
}