[
  {
    "OrderNumber": "string",
    "PONumber": "string",
    "DocType": "string",
    "Status": "string",
    "Total": 8,
    "DateEntered": "string",
    "LastChanged": "string"
  },
  {
    "OrderNumber": "string",
    "PONumber": "string",
    "DocType": "string",
    "Status": "string",
    "Total": 3,
    "DateEntered": "string",
    "LastChanged": "string"
  }
]