{
  "getUpdatedResponse": {
    "result": {
      "ids": [
        "string",
        "string",
        "string",
        "string",
        "string",
        "string"
      ],
      "latestDateCovered": "string"
    }
  }
}