{
  "describeSObjectListViewsResponse": {
    "result": {
      "describeSoqlListViews": [
        {
          "columns": [
            {
              "ascendingLabel": "string",
              "descendingLabel": "string",
              "fieldNameOrPath": "string",
              "hidden": true,
              "label": "string",
              "searchable": true,
              "selectListItem": "string",
              "sortDirection": "ascending",
              "sortIndex": 4,
              "sortable": false,
              "type": "date"
            }
          ],
          "id": "string",
          "orderBy": [
            {
              "fieldNameOrPath": "string",
              "nullsPosition": "last",
              "sortDirection": "ascending"
            },
            {
              "fieldNameOrPath": "string",
              "nullsPosition": "last",
              "sortDirection": "ascending"
            },
            {
              "fieldNameOrPath": "string",
              "nullsPosition": "last",
              "sortDirection": "ascending"
            },
            {
              "fieldNameOrPath": "string",
              "nullsPosition": "first",
              "sortDirection": "ascending"
            },
            {
              "fieldNameOrPath": "string",
              "nullsPosition": "last",
              "sortDirection": "descending"
            },
            {
              "fieldNameOrPath": "string",
              "nullsPosition": "last",
              "sortDirection": "descending"
            },
            {
              "fieldNameOrPath": "string",
              "nullsPosition": "first",
              "sortDirection": "ascending"
            },
            {
              "fieldNameOrPath": "string",
              "nullsPosition": "last",
              "sortDirection": "descending"
            },
            {
              "fieldNameOrPath": "string",
              "nullsPosition": "first",
              "sortDirection": "ascending"
            },
            {
              "fieldNameOrPath": "string",
              "nullsPosition": "last",
              "sortDirection": "ascending"
            }
          ],
          "query": "string",
          "relatedEntityId": "string",
          "scope": "string",
          "scopeEntityId": "string",
          "sobjectType": "string",
          "whereCondition": {}
        },
        {
          "columns": [
            {
              "ascendingLabel": "string",
              "descendingLabel": "string",
              "fieldNameOrPath": "string",
              "hidden": false,
              "label": "string",
              "searchable": false,
              "selectListItem": "string",
              "sortDirection": "ascending",
              "sortIndex": 7,
              "sortable": true,
              "type": "combobox"
            },
            {
              "ascendingLabel": "string",
              "descendingLabel": "string",
              "fieldNameOrPath": "string",
              "hidden": false,
              "label": "string",
              "searchable": true,
              "selectListItem": "string",
              "sortDirection": "ascending",
              "sortIndex": 5,
              "sortable": true,
              "type": "long"
            },
            {
              "ascendingLabel": "string",
              "descendingLabel": "string",
              "fieldNameOrPath": "string",
              "hidden": true,
              "label": "string",
              "searchable": true,
              "selectListItem": "string",
              "sortDirection": "descending",
              "sortIndex": 1,
              "sortable": true,
              "type": "url"
            },
            {
              "ascendingLabel": "string",
              "descendingLabel": "string",
              "fieldNameOrPath": "string",
              "hidden": true,
              "label": "string",
              "searchable": true,
              "selectListItem": "string",
              "sortDirection": "ascending",
              "sortIndex": 4,
              "sortable": false,
              "type": "id"
            },
            {
              "ascendingLabel": "string",
              "descendingLabel": "string",
              "fieldNameOrPath": "string",
              "hidden": false,
              "label": "string",
              "searchable": false,
              "selectListItem": "string",
              "sortDirection": "descending",
              "sortIndex": 6,
              "sortable": false,
              "type": "datacategorygroupreference"
            },
            {
              "ascendingLabel": "string",
              "descendingLabel": "string",
              "fieldNameOrPath": "string",
              "hidden": true,
              "label": "string",
              "searchable": true,
              "selectListItem": "string",
              "sortDirection": "ascending",
              "sortIndex": 2,
              "sortable": false,
              "type": "string"
            },
            {
              "ascendingLabel": "string",
              "descendingLabel": "string",
              "fieldNameOrPath": "string",
              "hidden": true,
              "label": "string",
              "searchable": false,
              "selectListItem": "string",
              "sortDirection": "ascending",
              "sortIndex": 10,
              "sortable": true,
              "type": "int"
            },
            {
              "ascendingLabel": "string",
              "descendingLabel": "string",
              "fieldNameOrPath": "string",
              "hidden": true,
              "label": "string",
              "searchable": false,
              "selectListItem": "string",
              "sortDirection": "descending",
              "sortIndex": 4,
              "sortable": false,
              "type": "string"
            },
            {
              "ascendingLabel": "string",
              "descendingLabel": "string",
              "fieldNameOrPath": "string",
              "hidden": false,
              "label": "string",
              "searchable": true,
              "selectListItem": "string",
              "sortDirection": "ascending",
              "sortIndex": 3,
              "sortable": false,
              "type": "long"
            },
            {
              "ascendingLabel": "string",
              "descendingLabel": "string",
              "fieldNameOrPath": "string",
              "hidden": false,
              "label": "string",
              "searchable": true,
              "selectListItem": "string",
              "sortDirection": "ascending",
              "sortIndex": 2,
              "sortable": false,
              "type": "location"
            }
          ],
          "id": "string",
          "orderBy": [
            {
              "fieldNameOrPath": "string",
              "nullsPosition": "last",
              "sortDirection": "ascending"
            },
            {
              "fieldNameOrPath": "string",
              "nullsPosition": "first",
              "sortDirection": "ascending"
            },
            {
              "fieldNameOrPath": "string",
              "nullsPosition": "first",
              "sortDirection": "ascending"
            },
            {
              "fieldNameOrPath": "string",
              "nullsPosition": "last",
              "sortDirection": "descending"
            },
            {
              "fieldNameOrPath": "string",
              "nullsPosition": "first",
              "sortDirection": "descending"
            },
            {
              "fieldNameOrPath": "string",
              "nullsPosition": "last",
              "sortDirection": "descending"
            }
          ],
          "query": "string",
          "relatedEntityId": "string",
          "scope": "string",
          "scopeEntityId": "string",
          "sobjectType": "string",
          "whereCondition": {}
        },
        {
          "columns": [
            {
              "ascendingLabel": "string",
              "descendingLabel": "string",
              "fieldNameOrPath": "string",
              "hidden": true,
              "label": "string",
              "searchable": false,
              "selectListItem": "string",
              "sortDirection": "descending",
              "sortIndex": 4,
              "sortable": true,
              "type": "datetime"
            },
            {
              "ascendingLabel": "string",
              "descendingLabel": "string",
              "fieldNameOrPath": "string",
              "hidden": false,
              "label": "string",
              "searchable": true,
              "selectListItem": "string",
              "sortDirection": "ascending",
              "sortIndex": 1,
              "sortable": true,
              "type": "percent"
            },
            {
              "ascendingLabel": "string",
              "descendingLabel": "string",
              "fieldNameOrPath": "string",
              "hidden": false,
              "label": "string",
              "searchable": false,
              "selectListItem": "string",
              "sortDirection": "descending",
              "sortIndex": 7,
              "sortable": false,
              "type": "location"
            },
            {
              "ascendingLabel": "string",
              "descendingLabel": "string",
              "fieldNameOrPath": "string",
              "hidden": true,
              "label": "string",
              "searchable": true,
              "selectListItem": "string",
              "sortDirection": "descending",
              "sortIndex": 5,
              "sortable": false,
              "type": "address"
            },
            {
              "ascendingLabel": "string",
              "descendingLabel": "string",
              "fieldNameOrPath": "string",
              "hidden": true,
              "label": "string",
              "searchable": false,
              "selectListItem": "string",
              "sortDirection": "ascending",
              "sortIndex": 9,
              "sortable": true,
              "type": "datacategorygroupreference"
            },
            {
              "ascendingLabel": "string",
              "descendingLabel": "string",
              "fieldNameOrPath": "string",
              "hidden": false,
              "label": "string",
              "searchable": true,
              "selectListItem": "string",
              "sortDirection": "descending",
              "sortIndex": 5,
              "sortable": true,
              "type": "phone"
            },
            {
              "ascendingLabel": "string",
              "descendingLabel": "string",
              "fieldNameOrPath": "string",
              "hidden": false,
              "label": "string",
              "searchable": true,
              "selectListItem": "string",
              "sortDirection": "descending",
              "sortIndex": 3,
              "sortable": false,
              "type": "combobox"
            },
            {
              "ascendingLabel": "string",
              "descendingLabel": "string",
              "fieldNameOrPath": "string",
              "hidden": false,
              "label": "string",
              "searchable": true,
              "selectListItem": "string",
              "sortDirection": "ascending",
              "sortIndex": 1,
              "sortable": false,
              "type": "int"
            },
            {
              "ascendingLabel": "string",
              "descendingLabel": "string",
              "fieldNameOrPath": "string",
              "hidden": false,
              "label": "string",
              "searchable": false,
              "selectListItem": "string",
              "sortDirection": "descending",
              "sortIndex": 9,
              "sortable": true,
              "type": "anyType"
            }
          ],
          "id": "string",
          "orderBy": [
            {
              "fieldNameOrPath": "string",
              "nullsPosition": "first",
              "sortDirection": "descending"
            },
            {
              "fieldNameOrPath": "string",
              "nullsPosition": "first",
              "sortDirection": "descending"
            },
            {
              "fieldNameOrPath": "string",
              "nullsPosition": "last",
              "sortDirection": "descending"
            },
            {
              "fieldNameOrPath": "string",
              "nullsPosition": "last",
              "sortDirection": "ascending"
            },
            {
              "fieldNameOrPath": "string",
              "nullsPosition": "last",
              "sortDirection": "ascending"
            },
            {
              "fieldNameOrPath": "string",
              "nullsPosition": "last",
              "sortDirection": "ascending"
            },
            {
              "fieldNameOrPath": "string",
              "nullsPosition": "first",
              "sortDirection": "descending"
            }
          ],
          "query": "string",
          "relatedEntityId": "string",
          "scope": "string",
          "scopeEntityId": "string",
          "sobjectType": "string",
          "whereCondition": {}
        },
        {
          "columns": [
            {
              "ascendingLabel": "string",
              "descendingLabel": "string",
              "fieldNameOrPath": "string",
              "hidden": false,
              "label": "string",
              "searchable": true,
              "selectListItem": "string",
              "sortDirection": "ascending",
              "sortIndex": 2,
              "sortable": true,
              "type": "picklist"
            },
            {
              "ascendingLabel": "string",
              "descendingLabel": "string",
              "fieldNameOrPath": "string",
              "hidden": false,
              "label": "string",
              "searchable": false,
              "selectListItem": "string",
              "sortDirection": "descending",
              "sortIndex": 8,
              "sortable": true,
              "type": "email"
            },
            {
              "ascendingLabel": "string",
              "descendingLabel": "string",
              "fieldNameOrPath": "string",
              "hidden": false,
              "label": "string",
              "searchable": true,
              "selectListItem": "string",
              "sortDirection": "descending",
              "sortIndex": 6,
              "sortable": true,
              "type": "picklist"
            },
            {
              "ascendingLabel": "string",
              "descendingLabel": "string",
              "fieldNameOrPath": "string",
              "hidden": false,
              "label": "string",
              "searchable": false,
              "selectListItem": "string",
              "sortDirection": "ascending",
              "sortIndex": 8,
              "sortable": true,
              "type": "url"
            },
            {
              "ascendingLabel": "string",
              "descendingLabel": "string",
              "fieldNameOrPath": "string",
              "hidden": true,
              "label": "string",
              "searchable": true,
              "selectListItem": "string",
              "sortDirection": "descending",
              "sortIndex": 4,
              "sortable": false,
              "type": "email"
            },
            {
              "ascendingLabel": "string",
              "descendingLabel": "string",
              "fieldNameOrPath": "string",
              "hidden": false,
              "label": "string",
              "searchable": false,
              "selectListItem": "string",
              "sortDirection": "descending",
              "sortIndex": 2,
              "sortable": true,
              "type": "datacategorygroupreference"
            },
            {
              "ascendingLabel": "string",
              "descendingLabel": "string",
              "fieldNameOrPath": "string",
              "hidden": true,
              "label": "string",
              "searchable": true,
              "selectListItem": "string",
              "sortDirection": "descending",
              "sortIndex": 2,
              "sortable": false,
              "type": "date"
            },
            {
              "ascendingLabel": "string",
              "descendingLabel": "string",
              "fieldNameOrPath": "string",
              "hidden": false,
              "label": "string",
              "searchable": true,
              "selectListItem": "string",
              "sortDirection": "ascending",
              "sortIndex": 3,
              "sortable": false,
              "type": "phone"
            },
            {
              "ascendingLabel": "string",
              "descendingLabel": "string",
              "fieldNameOrPath": "string",
              "hidden": false,
              "label": "string",
              "searchable": true,
              "selectListItem": "string",
              "sortDirection": "ascending",
              "sortIndex": 9,
              "sortable": true,
              "type": "encryptedstring"
            }
          ],
          "id": "string",
          "orderBy": [
            {
              "fieldNameOrPath": "string",
              "nullsPosition": "last",
              "sortDirection": "ascending"
            },
            {
              "fieldNameOrPath": "string",
              "nullsPosition": "first",
              "sortDirection": "ascending"
            },
            {
              "fieldNameOrPath": "string",
              "nullsPosition": "first",
              "sortDirection": "descending"
            },
            {
              "fieldNameOrPath": "string",
              "nullsPosition": "first",
              "sortDirection": "ascending"
            },
            {
              "fieldNameOrPath": "string",
              "nullsPosition": "last",
              "sortDirection": "ascending"
            },
            {
              "fieldNameOrPath": "string",
              "nullsPosition": "first",
              "sortDirection": "ascending"
            },
            {
              "fieldNameOrPath": "string",
              "nullsPosition": "last",
              "sortDirection": "ascending"
            },
            {
              "fieldNameOrPath": "string",
              "nullsPosition": "first",
              "sortDirection": "descending"
            },
            {
              "fieldNameOrPath": "string",
              "nullsPosition": "last",
              "sortDirection": "descending"
            }
          ],
          "query": "string",
          "relatedEntityId": "string",
          "scope": "string",
          "scopeEntityId": "string",
          "sobjectType": "string",
          "whereCondition": {}
        }
      ]
    }
  }
}