{
  "updateResponse": {
    "result": [
      {
        "errors": [
          {
            "extendedErrorDetails": [
              {
                "extendedErrorCode": "SURVEY_RULE_INVALID_RIGHT_OPERAND"
              },
              {
                "extendedErrorCode": "SUBFLOW_INPUT_VALUE_INCOMPATIBLE_DATATYPES"
              },
              {
                "extendedErrorCode": "AUTOLAUNCHED_CHOICELOOKUP_NOT_SUPPORTED"
              },
              {
                "extendedErrorCode": "UNEXPECTED_ERROR"
              },
              {
                "extendedErrorCode": "ASSIGNMENTITEM_FIELD_INVALID_DATATYPE_WITH_ELEMENT"
              },
              {
                "extendedErrorCode": "VARIABLE_FIELD_NOT_SUPPORTED_FOR_DATATYPE_AND_COLLECTION"
              },
              {
                "extendedErrorCode": "START_ELEMENT_MISSING"
              },
              {
                "extendedErrorCode": "CHOICE_NOT_SUPPORTED_FOR_SCREENFIELDTYPE"
              },
              {
                "extendedErrorCode": "CONNECTOR_MISSING_TARGET"
              },
              {
                "extendedErrorCode": "SOBJECT_ELEMENT_MISMATCHED_OBJECTTYPE"
              }
            ],
            "fields": [
              "string",
              "string"
            ],
            "message": "string",
            "statusCode": "IP_RANGE_LIMIT_EXCEEDED"
          },
          {
            "extendedErrorDetails": [
              {
                "extendedErrorCode": "CHOICE_USED_MULTIPLE_TIMES_IN_SAME_FIELD"
              },
              {
                "extendedErrorCode": "FLEXIPAGE_COMPONENT_MAX_LIMIT_EXCEPTION"
              },
              {
                "extendedErrorCode": "SOBJECT_ELEMENT_MISMATCHED_OBJECTTYPE"
              },
              {
                "extendedErrorCode": "VISIBILITY_RULE_NOT_SUPPORTED_FOR_API_VERSION"
              },
              {
                "extendedErrorCode": "CONDITION_OPERATOR_INCOMPATIBLE"
              },
              {
                "extendedErrorCode": "OUTPUTPARAM_ASSIGNTOREFERENCE_NOTFOUND"
              },
              {
                "extendedErrorCode": "DATA_TYPE_NOT_SUPPORTED_FOR_PROCESSTYPE"
              },
              {
                "extendedErrorCode": "OUTPUTPARAM_MISMATCHED_OBJECTTYPE"
              },
              {
                "extendedErrorCode": "FIELDASSIGNMENT_INVALID_REFERENCE"
              }
            ],
            "fields": [
              "string",
              "string",
              "string",
              "string"
            ],
            "message": "string",
            "statusCode": "UNAVAILABLE_RECORDTYPE_EXCEPTION"
          },
          {
            "extendedErrorDetails": [
              {
                "extendedErrorCode": "SUBFLOW_INVALID_NAME"
              },
              {
                "extendedErrorCode": "SCREENFIELD_EXTENSION_NAME_MISSING"
              },
              {
                "extendedErrorCode": "PROCESSTYPE_COMPONENTTYPE_NOT_SUPPORTED"
              },
              {
                "extendedErrorCode": "WAITEVENT_MISSING"
              },
              {
                "extendedErrorCode": "SCREENFIELD_INVALID_DATATYPE"
              },
              {
                "extendedErrorCode": "ACTIONCALL_NOT_SUPPORTED_FOR_PROCESSTYPE"
              }
            ],
            "fields": [
              "string",
              "string",
              "string"
            ],
            "message": "string",
            "statusCode": "REQUIRE_CONNECTED_APP_SCS"
          }
        ],
        "id": "string",
        "success": true
      }
    ]
  }
}