{
  "sendEmailMessageResponse": {
    "result": [
      {
        "errors": [
          {
            "fields": [
              "string",
              "string",
              "string",
              "string",
              "string",
              "string"
            ],
            "message": "string",
            "statusCode": "MAXIMUM_SIZE_OF_ATTACHMENT",
            "targetObjectId": "string"
          },
          {
            "fields": [
              "string",
              "string",
              "string",
              "string",
              "string",
              "string",
              "string",
              "string"
            ],
            "message": "string",
            "statusCode": "INVALID_API_INPUT",
            "targetObjectId": "string"
          },
          {
            "fields": [
              "string"
            ],
            "message": "string",
            "statusCode": "STORAGE_LIMIT_EXCEEDED",
            "targetObjectId": "string"
          },
          {
            "fields": [
              "string",
              "string",
              "string",
              "string",
              "string"
            ],
            "message": "string",
            "statusCode": "CANNOT_REPARENT_RECORD",
            "targetObjectId": "string"
          },
          {
            "fields": [
              "string",
              "string",
              "string",
              "string",
              "string",
              "string"
            ],
            "message": "string",
            "statusCode": "ENTITY_IS_ARCHIVED",
            "targetObjectId": "string"
          }
        ],
        "success": true
      },
      {
        "errors": [
          {
            "fields": [
              "string",
              "string",
              "string",
              "string",
              "string"
            ],
            "message": "string",
            "statusCode": "TEXT_DATA_OUTSIDE_SUPPORTED_CHARSET",
            "targetObjectId": "string"
          },
          {
            "fields": [
              "string",
              "string",
              "string",
              "string",
              "string",
              "string",
              "string",
              "string",
              "string",
              "string"
            ],
            "message": "string",
            "statusCode": "INVALID_CURRENCY_CONV_RATE",
            "targetObjectId": "string"
          },
          {
            "fields": [
              "string",
              "string",
              "string",
              "string",
              "string",
              "string"
            ],
            "message": "string",
            "statusCode": "WEBLINK_URL_INVALID",
            "targetObjectId": "string"
          },
          {
            "fields": [
              "string",
              "string",
              "string",
              "string",
              "string",
              "string",
              "string",
              "string",
              "string"
            ],
            "message": "string",
            "statusCode": "CUSTOM_APEX_ERROR",
            "targetObjectId": "string"
          },
          {
            "fields": [
              "string",
              "string",
              "string",
              "string",
              "string",
              "string",
              "string",
              "string",
              "string",
              "string"
            ],
            "message": "string",
            "statusCode": "INVALID_AUTH_HEADER",
            "targetObjectId": "string"
          }
        ],
        "success": false
      },
      {
        "errors": [
          {
            "fields": [
              "string",
              "string"
            ],
            "message": "string",
            "statusCode": "UNABLE_TO_LOCK_ROW",
            "targetObjectId": "string"
          },
          {
            "fields": [
              "string",
              "string",
              "string",
              "string",
              "string",
              "string",
              "string",
              "string"
            ],
            "message": "string",
            "statusCode": "INVALID_QUERY_LOCATOR",
            "targetObjectId": "string"
          },
          {
            "fields": [
              "string",
              "string",
              "string",
              "string",
              "string",
              "string",
              "string",
              "string"
            ],
            "message": "string",
            "statusCode": "SHARE_NEEDED_FOR_CHILD_OWNER",
            "targetObjectId": "string"
          },
          {
            "fields": [
              "string",
              "string",
              "string"
            ],
            "message": "string",
            "statusCode": "UNKNOWN_TOKEN_ERROR",
            "targetObjectId": "string"
          },
          {
            "fields": [
              "string",
              "string",
              "string",
              "string",
              "string",
              "string",
              "string",
              "string"
            ],
            "message": "string",
            "statusCode": "CANNOT_CHANGE_FIELD_TYPE_OF_APEX_REFERENCED_FIELD",
            "targetObjectId": "string"
          },
          {
            "fields": [
              "string",
              "string",
              "string",
              "string",
              "string",
              "string"
            ],
            "message": "string",
            "statusCode": "ORDER_MANAGEMENT_ACTION_NOT_ALLOWED",
            "targetObjectId": "string"
          }
        ],
        "success": true
      }
    ]
  }
}