{
  "actions": [
    {
      "name": "postDescribeKnowledgeSettings",
      "protocol": "REST",
      "method": "POST",
      "entitypath": "{base_path}/{version}/describeKnowledgeSettings?{query}",
      "requestSchema": "schema.json",
      "responseSchema": "schema.json",
      "timeout": 0,
      "sendEmpty": false,
      "requestDatatype": "JSON",
      "responseDatatype": "JSON",
      "headers": {},
      "responseObjects": [
        {
          "type": "default",
          "key": "",
          "mockFile": "mockdatafiles/postDescribeKnowledgeSettings-default.json"
        }
      ]
    },
    {
      "name": "postDescribeSearchableEntities",
      "protocol": "REST",
      "method": "POST",
      "entitypath": "{base_path}/{version}/describeSearchableEntities?{query}",
      "requestSchema": "schema.json",
      "responseSchema": "schema.json",
      "timeout": 0,
      "sendEmpty": false,
      "requestDatatype": "JSON",
      "responseDatatype": "JSON",
      "headers": {},
      "responseObjects": [
        {
          "type": "default",
          "key": "",
          "mockFile": "mockdatafiles/postDescribeSearchableEntities-default.json"
        }
      ]
    },
    {
      "name": "postDescribeSearchScopeOrder",
      "protocol": "REST",
      "method": "POST",
      "entitypath": "{base_path}/{version}/describeSearchScopeOrder?{query}",
      "requestSchema": "schema.json",
      "responseSchema": "schema.json",
      "timeout": 0,
      "sendEmpty": false,
      "requestDatatype": "JSON",
      "responseDatatype": "JSON",
      "headers": {},
      "responseObjects": [
        {
          "type": "default",
          "key": "",
          "mockFile": "mockdatafiles/postDescribeSearchScopeOrder-default.json"
        }
      ]
    },
    {
      "name": "postDescribeSoqlListViews",
      "protocol": "REST",
      "method": "POST",
      "entitypath": "{base_path}/{version}/describeSoqlListViews?{query}",
      "requestSchema": "schema.json",
      "responseSchema": "schema.json",
      "timeout": 0,
      "sendEmpty": false,
      "requestDatatype": "JSON",
      "responseDatatype": "JSON",
      "headers": {},
      "responseObjects": [
        {
          "type": "default",
          "key": "",
          "mockFile": "mockdatafiles/postDescribeSoqlListViews-default.json"
        }
      ]
    },
    {
      "name": "postExecuteListView",
      "protocol": "REST",
      "method": "POST",
      "entitypath": "{base_path}/{version}/executeListView?{query}",
      "requestSchema": "schema.json",
      "responseSchema": "schema.json",
      "timeout": 0,
      "sendEmpty": false,
      "requestDatatype": "JSON",
      "responseDatatype": "JSON",
      "headers": {},
      "responseObjects": [
        {
          "type": "default",
          "key": "",
          "mockFile": "mockdatafiles/postExecuteListView-default.json"
        }
      ]
    },
    {
      "name": "postDescribeTabs",
      "protocol": "REST",
      "method": "POST",
      "entitypath": "{base_path}/{version}/describeTabs?{query}",
      "requestSchema": "schema.json",
      "responseSchema": "schema.json",
      "timeout": 0,
      "sendEmpty": false,
      "requestDatatype": "JSON",
      "responseDatatype": "JSON",
      "headers": {},
      "responseObjects": [
        {
          "type": "default",
          "key": "",
          "mockFile": "mockdatafiles/postDescribeTabs-default.json"
        }
      ]
    },
    {
      "name": "postDescribeAllTabs",
      "protocol": "REST",
      "method": "POST",
      "entitypath": "{base_path}/{version}/describeAllTabs?{query}",
      "requestSchema": "schema.json",
      "responseSchema": "schema.json",
      "timeout": 0,
      "sendEmpty": false,
      "requestDatatype": "JSON",
      "responseDatatype": "JSON",
      "headers": {},
      "responseObjects": [
        {
          "type": "default",
          "key": "",
          "mockFile": "mockdatafiles/postDescribeAllTabs-default.json"
        }
      ]
    },
    {
      "name": "postSetPassword",
      "protocol": "REST",
      "method": "POST",
      "entitypath": "{base_path}/{version}/setPassword?{query}",
      "requestSchema": "schema.json",
      "responseSchema": "schema.json",
      "timeout": 0,
      "sendEmpty": false,
      "requestDatatype": "JSON",
      "responseDatatype": "JSON",
      "headers": {},
      "responseObjects": [
        {
          "type": "default",
          "key": "",
          "mockFile": "mockdatafiles/postSetPassword-default.json"
        }
      ]
    },
    {
      "name": "postChangeOwnPassword",
      "protocol": "REST",
      "method": "POST",
      "entitypath": "{base_path}/{version}/changeOwnPassword?{query}",
      "requestSchema": "schema.json",
      "responseSchema": "schema.json",
      "timeout": 0,
      "sendEmpty": false,
      "requestDatatype": "JSON",
      "responseDatatype": "JSON",
      "headers": {},
      "responseObjects": [
        {
          "type": "default",
          "key": "",
          "mockFile": "mockdatafiles/postChangeOwnPassword-default.json"
        }
      ]
    },
    {
      "name": "postResetPassword",
      "protocol": "REST",
      "method": "POST",
      "entitypath": "{base_path}/{version}/resetPassword?{query}",
      "requestSchema": "schema.json",
      "responseSchema": "schema.json",
      "timeout": 0,
      "sendEmpty": false,
      "requestDatatype": "JSON",
      "responseDatatype": "JSON",
      "headers": {},
      "responseObjects": [
        {
          "type": "default",
          "key": "",
          "mockFile": "mockdatafiles/postResetPassword-default.json"
        }
      ]
    },
    {
      "name": "postGetUserInfo",
      "protocol": "REST",
      "method": "POST",
      "entitypath": "{base_path}/{version}/getUserInfo?{query}",
      "requestSchema": "schema.json",
      "responseSchema": "schema.json",
      "timeout": 0,
      "sendEmpty": false,
      "requestDatatype": "JSON",
      "responseDatatype": "JSON",
      "headers": {},
      "responseObjects": [
        {
          "type": "default",
          "key": "",
          "mockFile": "mockdatafiles/postGetUserInfo-default.json"
        }
      ]
    }
  ]
}