{
  "name": "adapter-remedy_actionrequest",
  "webName": "Adapter for Integration to BMC Remedy Action Request",
  "supportLevel": "community",
  "vendor": "BMC",
  "product": "Remedy Action Request",
  "techAlliance": true,
  "osVersion": [],
  "apiVersions": [],
  "iapVersions": [
    "2021.1.x",
    "2021.2.x",
    "2022.1.x",
    "2023.1.x"
  ],
  "method": "REST",
  "type": "Adapter",
  "domains": [
    "ITSM (Service Management)"
  ],
  "tags": [
    "Notifications & Ticket Management"
  ],
  "useCases": [
    "Create & Update Change Request",
    "Create & Update Incident Ticket",
    "Update Change Request state",
    "Create Issue"
  ],
  "deprecated": {
    "isDeprecated": false
  },
  "brokerSince": "",
  "authMethods": [
    {
      "type": "Token",
      "primary": true
    }
  ],
  "documentation": {
    "storeLink": "",
    "npmLink": "https://www.npmjs.com/package/@itentialopensource/adapter-remedy_actionrequest",
    "repoLink": "https://gitlab.com/itentialopensource/adapters/adapter-remedy_actionrequest",
    "docLink": "https://gitlab.com/itentialopensource/adapters/adapter-remedy_actionrequest/-/blob/master/README.md?ref_type=heads",
    "demoLinks": [],
    "trainingLinks": [
      {
        "title": "Itential Academy",
        "link": "https://www.itential.com/itential-academy/"
      }
    ],
    "faqLink": "https://docs.itential.com/opensource/docs/troubleshooting-an-adapter",
    "contributeLink": "https://gitlab.com/itentialopensource/adapters/contributing-guide",
    "issueLink": "https://itential.atlassian.net/servicedesk/customer/portals",
    "webLink": "https://www.itential.com/adapters/remedy-action-request-system/",
    "vendorLink": "https://www.bmc.com/",
    "productLink": "https://docs.bmc.com/docs/ars2002",
    "apiLinks": [
      {
        "title": "Overview of the REST API",
        "link": "https://docs.bmc.com/docs/itsm2002/overview-of-the-rest-api-932206744.html",
        "public": true
      },
      {
        "title": "Remedy Action Request System 20.02",
        "link": "https://docs.bmc.com/docs/ars2002/",
        "public": true
      }
    ],
    "workshopLinks": [],
    "workshopHomePage": "https://www.itential.com/get-started/"
  },
  "assets": [],
  "relatedItems": {
    "adapters": [],
    "integrations": [],
    "ecosystemApplications": [],
    "workflowProjects": [],
    "transformationProjects": [],
    "exampleProjects": []
  }
}