{
  "openapi": "3.0.0",
  "info": {
    "title": "Remedy",
    "description": "Integration API for Remedy - manually built from the documentation.",
    "contact": {},
    "version": "1.0"
  },
  "servers": [
    {
      "url": "http://remedy.com",
      "variables": {}
    }
  ],
  "paths": {
    "/api/arsys/v1/mergeEntry/{formName}": {
      "post": {
        "tags": [
          "Entry"
        ],
        "summary": "Merge Entry",
        "description": "Merge Entry",
        "operationId": "mergeEntry",
        "parameters": [
          {
            "name": "formName",
            "in": "path",
            "description": "the form name",
            "required": true,
            "schema": {
              "type": "string"
            }
          }
        ],
        "requestBody": {
          "description": "",
          "content": {
            "multipart/form-data": {
              "schema": {
                "title": "attachment",
                "type": "object"
              }
            }
          },
          "required": true
        },
        "responses": {
          "200": {
            "description": "Successful response",
            "content": {
              "application/json": {
                "schema": {
                  "type": "object"
                }
              }
            }
          }
        }
      }
    },
    "/api/arsys/v1.0/entry": {
      "get": {
        "tags": [
          "Entry"
        ],
        "summary": "Get Entry Status",
        "description": "Get Entry Status",
        "operationId": "getEntryStatus",
        "parameters": [],
        "responses": {
          "200": {
            "description": "Successful response",
            "content": {
              "application/json": {
                "schema": {
                  "type": "object"
                }
              }
            }
          }
        }
      }
    },
    "/api/arsys/v1.0/entry/{formName}": {
      "post": {
        "tags": [
          "Entry"
        ],
        "summary": "Create Entry",
        "description": "Create Entry",
        "operationId": "createEntry",
        "parameters": [
          {
            "name": "formName",
            "in": "path",
            "description": "the form name",
            "required": true,
            "schema": {
              "type": "string"
            }
          },
          {
            "name": "query",
            "in": "query",
            "description": "object of query/option data - fields, etc",
            "required": false,
            "schema": {
              "type": "object"
            }
          }
        ],
        "requestBody": {
          "description": "",
          "content": {
            "multipart/form-data": {
              "schema": {
                "title": "FormDataMultiPart",
                "type": "object"
              }
            }
          },
          "required": true
        },
        "responses": {
          "200": {
            "description": "Successful response",
            "content": {
              "application/json": {
                "schema": {
                  "type": "object"
                }
              }
            }
          }
        }
      },
      "get": {
        "tags": [
          "Entry"
        ],
        "summary": "Get Multiple Entries",
        "description": "Get Multiple Entries",
        "operationId": "getMultipleEntries",
        "parameters": [
          {
            "name": "formName",
            "in": "path",
            "description": "the form name",
            "required": true,
            "schema": {
              "type": "string"
            }
          },
          {
            "name": "query",
            "in": "query",
            "description": "object of query/option data - fields, sort, limit, offset, etc",
            "required": false,
            "schema": {
              "type": "object"
            }
          }
        ],
        "responses": {
          "200": {
            "description": "Successful response",
            "content": {
              "application/json": {
                "schema": {
                  "type": "object"
                }
              }
            }
          }
        }
      },
      "options": {
        "tags": [
          "Entry"
        ],
        "summary": "Get Options of Form Schema",
        "description": "Get Options of Form Schema",
        "operationId": "getFormSchemaOptions",
        "parameters": [
          {
            "name": "formName",
            "in": "path",
            "description": "the form name",
            "required": true,
            "schema": {
              "type": "string"
            }
          },
          {
            "name": "query",
            "in": "query",
            "description": "object of query/option data - fields, etc",
            "required": false,
            "schema": {
              "type": "object"
            }
          }
        ],
        "responses": {
          "200": {
            "description": "Successful response",
            "content": {
              "application/json": {
                "schema": {
                  "type": "object"
                }
              }
            }
          }
        }
      }
    },
    "/api/arsys/v1.0/entry/{formName}/{entryId}": {
      "put": {
        "tags": [
          "Entry"
        ],
        "summary": "Update Entry",
        "description": "Update Entry",
        "operationId": "updateEntry",
        "parameters": [
          {
            "name": "formName",
            "in": "path",
            "description": "the form name",
            "required": true,
            "schema": {
              "type": "string"
            }
          },
          {
            "name": "entryId",
            "in": "path",
            "description": "the entry id",
            "required": true,
            "schema": {
              "type": "string"
            }
          }
        ],
        "requestBody": {
          "description": "",
          "content": {
            "multipart/form-data": {
              "schema": {
                "title": "FormDataMultiPart",
                "type": "object"
              }
            }
          },
          "required": true
        },
        "responses": {
          "200": {
            "description": "Successful response",
            "content": {
              "application/json": {
                "schema": {
                  "type": "object"
                }
              }
            }
          }
        }
      },
      "get": {
        "tags": [
          "Entry"
        ],
        "summary": "Get Entry",
        "description": "Get Entry",
        "operationId": "getEntryById",
        "parameters": [
          {
            "name": "formName",
            "in": "path",
            "description": "the form name",
            "required": true,
            "schema": {
              "type": "string"
            }
          },
          {
            "name": "entryId",
            "in": "path",
            "description": "the entry id",
            "required": true,
            "schema": {
              "type": "string"
            }
          },
          {
            "name": "query",
            "in": "query",
            "description": "object of query/option data - fields, etc",
            "required": false,
            "schema": {
              "type": "object"
            }
          }
        ],
        "responses": {
          "200": {
            "description": "Successful response",
            "content": {
              "application/json": {
                "schema": {
                  "type": "object"
                }
              }
            }
          }
        }
      },
      "delete": {
        "tags": [
          "Entry"
        ],
        "summary": "Delete Entry",
        "description": "Delete Entry",
        "operationId": "deleteEntryById",
        "parameters": [
          {
            "name": "formName",
            "in": "path",
            "description": "the form name",
            "required": true,
            "schema": {
              "type": "string"
            }
          },
          {
            "name": "entryId",
            "in": "path",
            "description": "the entry id",
            "required": true,
            "schema": {
              "type": "string"
            }
          },
          {
            "name": "options",
            "in": "query",
            "description": "delete options",
            "required": false,
            "schema": {
              "type": "object"
            }
          }
        ],
        "responses": {
          "200": {
            "description": "Successful response",
            "content": {
              "application/json": {
                "schema": {
                  "type": "object"
                }
              }
            }
          }
        }
      },
      "options": {
        "tags": [
          "Entry"
        ],
        "summary": "Get Options of Entry Form Schema",
        "description": "Get Options of Entry Form Schema",
        "operationId": "getEntryFormSchemaOptions",
        "parameters": [
          {
            "name": "formName",
            "in": "path",
            "description": "the form name",
            "required": true,
            "schema": {
              "type": "string"
            }
          },
          {
            "name": "entryId",
            "in": "path",
            "description": "the entry id",
            "required": true,
            "schema": {
              "type": "string"
            }
          },
          {
            "name": "query",
            "in": "query",
            "description": "object of query/option data - fields, etc",
            "required": false,
            "schema": {
              "type": "object"
            }
          }
        ],
        "responses": {
          "200": {
            "description": "Successful response",
            "content": {
              "application/json": {
                "schema": {
                  "type": "object"
                }
              }
            }
          }
        }
      }
    },
    "/api/arsys/v1.0/entry/{formName}/{entryId}/assoc/{associationName}": {
      "get": {
        "tags": [
          "Entry"
        ],
        "summary": "Get Entry Association",
        "description": "Get Entry Association",
        "operationId": "getEntryAssociation",
        "parameters": [
          {
            "name": "formName",
            "in": "path",
            "description": "the form name",
            "required": true,
            "schema": {
              "type": "string"
            }
          },
          {
            "name": "entryId",
            "in": "path",
            "description": "the entry id",
            "required": true,
            "schema": {
              "type": "string"
            }
          },
          {
            "name": "associationName",
            "in": "path",
            "description": "association name",
            "required": true,
            "schema": {
              "type": "string"
            }
          }
        ],
        "responses": {
          "200": {
            "description": "Successful response",
            "content": {
              "application/json": {
                "schema": {
                  "type": "object"
                }
              }
            }
          }
        }
      },
      "options": {
        "tags": [
          "Entry"
        ],
        "summary": "Get Options of Entry Form Association",
        "description": "Get Options of Entry Form Association",
        "operationId": "getEntryFormAssociationOptions",
        "parameters": [
          {
            "name": "formName",
            "in": "path",
            "description": "the form name",
            "required": true,
            "schema": {
              "type": "string"
            }
          },
          {
            "name": "entryId",
            "in": "path",
            "description": "the entry id",
            "required": true,
            "schema": {
              "type": "string"
            }
          },
          {
            "name": "associationName",
            "in": "path",
            "description": "association name",
            "required": true,
            "schema": {
              "type": "string"
            }
          },
          {
            "name": "query",
            "in": "query",
            "description": "object of query/option data - fields, etc",
            "required": false,
            "schema": {
              "type": "object"
            }
          }
        ],
        "responses": {
          "200": {
            "description": "Successful response",
            "content": {
              "application/json": {
                "schema": {
                  "type": "object"
                }
              }
            }
          }
        }
      }
    },
    "/api/arsys/v1.0/entry/{formName}/{entryId}/attach/{fieldName}": {
      "get": {
        "tags": [
          "Entry"
        ],
        "summary": "Get Entry Attachment",
        "description": "Get Entry Attachment",
        "operationId": "getEntryAttachment",
        "parameters": [
          {
            "name": "formName",
            "in": "path",
            "description": "the form name",
            "required": true,
            "schema": {
              "type": "string"
            }
          },
          {
            "name": "entryId",
            "in": "path",
            "description": "the entry id",
            "required": true,
            "schema": {
              "type": "string"
            }
          },
          {
            "name": "fieldName",
            "in": "path",
            "description": "file name",
            "required": true,
            "schema": {
              "type": "string"
            }
          }
        ],
        "responses": {
          "200": {
            "description": "Successful response",
            "content": {
              "application/json": {
                "schema": {
                  "type": "object"
                }
              }
            }
          }
        }
      }
    },
    "/api/arsys/v1.0/fields/{formName}": {
      "get": {
        "tags": [
          "Field"
        ],
        "summary": "Get Form Fields",
        "description": "Get Form Fields",
        "operationId": "getFormFields",
        "parameters": [
          {
            "name": "formName",
            "in": "path",
            "description": "the form name",
            "required": true,
            "schema": {
              "type": "string"
            }
          },
          {
            "name": "query",
            "in": "query",
            "description": "object of query/option data - fields, etc",
            "required": false,
            "schema": {
              "type": "object"
            }
          }
        ],
        "responses": {
          "200": {
            "description": "Successful response",
            "content": {
              "application/json": {
                "schema": {
                  "type": "object"
                }
              }
            }
          }
        }
      }
    },
    "/api/arsys/v1.0/fields/{formName}/{fieldId}": {
      "get": {
        "tags": [
          "Field"
        ],
        "summary": "Get Form Field By Id",
        "description": "Get Form Field By Id",
        "operationId": "getFormFieldById",
        "parameters": [
          {
            "name": "formName",
            "in": "path",
            "description": "the form name",
            "required": true,
            "schema": {
              "type": "string"
            }
          },
          {
            "name": "fieldId",
            "in": "path",
            "description": "the field id",
            "required": true,
            "schema": {
              "type": "string"
            }
          },
          {
            "name": "query",
            "in": "query",
            "description": "object of query/option data - fields, etc",
            "required": false,
            "schema": {
              "type": "object"
            }
          }
        ],
        "responses": {
          "200": {
            "description": "Successful response",
            "content": {
              "application/json": {
                "schema": {
                  "type": "object"
                }
              }
            }
          }
        }
      }
    },
    "/api/jwt/login": {
      "post": {
        "tags": [
          "Auth"
        ],
        "summary": "Login",
        "description": "Login",
        "operationId": "login",
        "parameters": [],
        "requestBody": {
          "description": "",
          "content": {
            "multipart/form-data": {
              "schema": {
                "title": "credentials",
                "type": "object"
              }
            }
          },
          "required": true
        },
        "responses": {
          "200": {
            "description": "Successful response",
            "content": {
              "application/json": {
                "schema": {
                  "type": "object"
                }
              }
            }
          }
        }
      }
    },
    "/api/jwt/logout": {
      "post": {
        "tags": [
          "Auth"
        ],
        "summary": "Logout",
        "description": "Logout",
        "operationId": "logout",
        "parameters": [],
        "responses": {
          "200": {
            "description": "Successful response",
            "content": {
              "application/json": {
                "schema": {
                  "type": "object"
                }
              }
            }
          }
        }
      }
    },
    "/api/arsys/v1.0/menu/expand": {
      "post": {
        "tags": [
          "Menu"
        ],
        "summary": "Expand Menu",
        "description": "Expand Menu",
        "operationId": "expandMenu",
        "parameters": [],
        "requestBody": {
          "description": "",
          "content": {
            "multipart/form-data": {
              "schema": {
                "title": "RestExpandMenuRequestData",
                "type": "object"
              }
            }
          },
          "required": true
        },
        "responses": {
          "200": {
            "description": "Successful response",
            "content": {
              "application/json": {
                "schema": {
                  "type": "object"
                }
              }
            }
          }
        }
      }
    },
    "/api/arsys/v1.0/menu/{name}": {
      "get": {
        "tags": [
          "Menu"
        ],
        "summary": "Get Menu",
        "description": "Get Menu",
        "operationId": "getMenu",
        "parameters": [
          {
            "name": "name",
            "in": "path",
            "description": "the menu name",
            "required": true,
            "schema": {
              "type": "string"
            }
          },
          {
            "name": "query",
            "in": "query",
            "description": "object of query/option data - fields, etc",
            "required": false,
            "schema": {
              "type": "object"
            }
          }
        ],
        "responses": {
          "200": {
            "description": "Successful response",
            "content": {
              "application/json": {
                "schema": {
                  "type": "object"
                }
              }
            }
          }
        }
      }
    },
    "/api/arsys/v1.0/webhook": {
      "post": {
        "tags": [
          "Webhook"
        ],
        "summary": "Register a Webhook",
        "description": "Register a Webhook",
        "operationId": "registerWebhook",
        "parameters": [],
        "requestBody": {
          "description": "",
          "content": {
            "multipart/form-data": {
              "schema": {
                "title": "RestWebhook",
                "type": "object"
              }
            }
          },
          "required": true
        },
        "responses": {
          "200": {
            "description": "Successful response",
            "content": {
              "application/json": {
                "schema": {
                  "type": "object"
                }
              }
            }
          }
        }
      }
    },
    "/api/arsys/v1.0/webhook/{id}": {
      "put": {
        "tags": [
          "Webhook"
        ],
        "summary": "Update Webhook",
        "description": "Update Webhook",
        "operationId": "updateWebhook",
        "parameters": [
          {
            "name": "id",
            "in": "path",
            "description": "the webhook id",
            "required": true,
            "schema": {
              "type": "string"
            }
          }
        ],
        "requestBody": {
          "description": "",
          "content": {
            "multipart/form-data": {
              "schema": {
                "title": "RestWebhook",
                "type": "object"
              }
            }
          },
          "required": true
        },
        "responses": {
          "200": {
            "description": "Successful response",
            "content": {
              "application/json": {
                "schema": {
                  "type": "object"
                }
              }
            }
          }
        }
      },
      "get": {
        "tags": [
          "Webhook"
        ],
        "summary": "Get Webhook Details",
        "description": "Get Webhook Details",
        "operationId": "getWebhookDetails",
        "parameters": [
          {
            "name": "id",
            "in": "path",
            "description": "the webhook id",
            "required": true,
            "schema": {
              "type": "string"
            }
          }
        ],
        "responses": {
          "200": {
            "description": "Successful response",
            "content": {
              "application/json": {
                "schema": {
                  "type": "object"
                }
              }
            }
          }
        }
      },
      "delete": {
        "tags": [
          "Webhook"
        ],
        "summary": "Unregister Webhook",
        "description": "Unregister Webhook",
        "operationId": "unregisterWebhook",
        "parameters": [
          {
            "name": "id",
            "in": "path",
            "description": "the webhook id",
            "required": true,
            "schema": {
              "type": "string"
            }
          }
        ],
        "responses": {
          "200": {
            "description": "Successful response",
            "content": {
              "application/json": {
                "schema": {
                  "type": "object"
                }
              }
            }
          }
        }
      }
    }
  },
  "components": {
    "schemas": {}
  },
  "tags": [
    {
      "name": "Entry",
      "description": ""
    },
    {
      "name": "Field",
      "description": ""
    },
    {
      "name": "Auth",
      "description": ""
    },
    {
      "name": "Menu",
      "description": ""
    },
    {
      "name": "Webhook",
      "description": ""
    }
  ]
}