{
  "escalation_policy": {
    "id": "PT20YPA",
    "type": "escalation_policy",
    "summary": "Engineering Escalation Policy",
    "self": "https://api.pagerduty.com/escalation_policies/PT20YPA",
    "html_url": "https://subdomain.pagerduty.com/escalation_policies/PT20YPA",
    "name": "Engineering Escalation Policy",
    "escalation_rules": [
      {
        "id": "PT20YPA",
        "escalation_delay_in_minutes": 22,
        "targets": [
          {
            "id": "PXPGF42",
            "summary": "Earline Greenholt",
            "type": "user_reference",
            "self": "https://api.pagerduty.com/users/PXPGF42",
            "html_url": "https://subdomain.pagerduty.com/users/PXPGF42"
          },
          {
            "id": "PI7DH85",
            "summary": "Daily Engineering Rotation",
            "type": "schedule_reference",
            "self": "https://api.pagerduty.com/schedules/PI7DH85",
            "html_url": "https://subdomain.pagerduty.com/schedules/PI7DH85"
          }
        ]
      }
    ],
    "services": [
      {
        "id": "PIJ90N7",
        "type": "generic_email_reference",
        "summary": "My Mail Service",
        "self": "https://api.pagerduty.com/services/PIJ90N7",
        "html_url": "https://subdomain.pagerduty.com/services/PIJ90N7"
      }
    ],
    "num_loops": 2,
    "teams": [
      {
        "id": "PQ9K7I8",
        "type": "team_reference",
        "summary": "Engineering",
        "self": "https://api.pagerduty.com/teams/PQ9K7I8",
        "html_url": "https://subdomain.pagerduty.com/teams/PQ9K7I8"
      }
    ],
    "description": null
  }
}