{
  "$id": "schema.json",
  "type": "object",
  "schema": "http://json-schema.org/draft-07/schema#",
  "translate": true,
  "dynamicfields": true,
  "properties": {
    "ph_request_type": {
      "type": "string",
      "description": "type of request (internal to adapter)",
      "default": "getSchedules",
      "enum": [
        "getSchedules",
        "postSchedules",
        "postSchedulesPreview",
        "getSchedulesId",
        "deleteSchedulesId",
        "putSchedulesId",
        "getSchedulesIdOverrides",
        "postSchedulesIdOverrides",
        "deleteSchedulesIdOverridesOverrideId",
        "getSchedulesIdUsers"
      ],
      "external_name": "ph_request_type"
    },
    "timeZone": {
      "type": "string",
      "description": "Time zone in which dates in the result will be rendered.",
      "parse": false,
      "encode": false,
      "encrypt": {
        "type": "AES",
        "key": ""
      },
      "external_name": "time_zone"
    },
    "overrideId": {
      "type": "string",
      "description": "The override ID on the schedule.",
      "parse": false,
      "encode": false,
      "encrypt": {
        "type": "AES",
        "key": ""
      },
      "external_name": "override_id"
    }
  },
  "definitions": {}
}