{
  "$id": "schema.json",
  "type": "object",
  "schema": "http://json-schema.org/draft-07/schema#",
  "translate": true,
  "dynamicfields": true,
  "properties": {
    "ph_request_type": {
      "type": "string",
      "description": "type of request (internal to adapter)",
      "default": "getAddons",
      "enum": [
        "getAddons",
        "postAddons",
        "getAddonsId",
        "deleteAddonsId",
        "putAddonsId"
      ],
      "external_name": "ph_request_type"
    },
    "include": {
      "type": "array",
      "description": "Array of additional details to include.",
      "parse": false,
      "encode": false,
      "encrypt": {
        "type": "AES",
        "key": ""
      },
      "external_name": "include[]"
    },
    "serviceIds": {
      "type": "array",
      "description": "Filters the results, showing only add-ons for the given services",
      "parse": false,
      "encode": false,
      "encrypt": {
        "type": "AES",
        "key": ""
      },
      "external_name": "service_ids[]"
    }
  },
  "definitions": {}
}