{
  "actions": [
    {
      "name": "getTags",
      "protocol": "REST",
      "method": "GET",
      "entitypath": "{base_path}/{version}/tags?{query}",
      "requestSchema": "schema.json",
      "responseSchema": "schema.json",
      "timeout": 0,
      "sendEmpty": false,
      "sendGetBody": false,
      "requestDatatype": "JSON",
      "responseDatatype": "JSON",
      "headers": {},
      "responseObjects": [
        {
          "type": "default",
          "key": "",
          "mockFile": "mockdatafiles/getTags-default.json"
        }
      ]
    },
    {
      "name": "postTags",
      "protocol": "REST",
      "method": "POST",
      "entitypath": "{base_path}/{version}/tags?{query}",
      "requestSchema": "schema.json",
      "responseSchema": "schema.json",
      "timeout": 0,
      "sendEmpty": false,
      "sendGetBody": false,
      "requestDatatype": "JSON",
      "responseDatatype": "JSON",
      "headers": {},
      "responseObjects": [
        {
          "type": "default",
          "key": "",
          "mockFile": "mockdatafiles/postTags-default.json"
        }
      ]
    },
    {
      "name": "getTagsId",
      "protocol": "REST",
      "method": "GET",
      "entitypath": "{base_path}/{version}/tags/{pathv1}?{query}",
      "requestSchema": "schema.json",
      "responseSchema": "schema.json",
      "timeout": 0,
      "sendEmpty": false,
      "sendGetBody": false,
      "requestDatatype": "JSON",
      "responseDatatype": "JSON",
      "headers": {},
      "responseObjects": [
        {
          "type": "default",
          "key": "",
          "mockFile": "mockdatafiles/getTagsId-default.json"
        }
      ]
    },
    {
      "name": "deleteTagsId",
      "protocol": "REST",
      "method": "DELETE",
      "entitypath": "{base_path}/{version}/tags/{pathv1}?{query}",
      "requestSchema": "schema.json",
      "responseSchema": "schema.json",
      "timeout": 0,
      "sendEmpty": false,
      "sendGetBody": false,
      "requestDatatype": "JSON",
      "responseDatatype": "JSON",
      "headers": {},
      "responseObjects": [
        {
          "type": "default",
          "key": "",
          "mockFile": ""
        }
      ]
    },
    {
      "name": "getTagsIdEntityType",
      "protocol": "REST",
      "method": "GET",
      "entitypath": "{base_path}/{version}/tags/{pathv1}/{pathv2}?{query}",
      "requestSchema": "schema.json",
      "responseSchema": "schema.json",
      "timeout": 0,
      "sendEmpty": false,
      "sendGetBody": false,
      "requestDatatype": "JSON",
      "responseDatatype": "JSON",
      "headers": {},
      "responseObjects": [
        {
          "type": "default",
          "key": "",
          "mockFile": "mockdatafiles/getTagsIdEntityType-default.json"
        }
      ]
    },
    {
      "name": "getEntityTypeIdTags",
      "protocol": "REST",
      "method": "GET",
      "entitypath": "{base_path}/{version}/{pathv1}/{pathv2}/tags?{query}",
      "requestSchema": "schema.json",
      "responseSchema": "schema.json",
      "timeout": 0,
      "sendEmpty": false,
      "sendGetBody": false,
      "requestDatatype": "JSON",
      "responseDatatype": "JSON",
      "headers": {},
      "responseObjects": [
        {
          "type": "default",
          "key": "",
          "mockFile": "mockdatafiles/getEntityTypeIdTags-default.json"
        }
      ]
    },
    {
      "name": "postEntityTypeIdChangeTags",
      "protocol": "REST",
      "method": "POST",
      "entitypath": "{base_path}/{version}/{pathv1}/{pathv2}/change_tags?{query}",
      "requestSchema": "schema.json",
      "responseSchema": "schema.json",
      "timeout": 0,
      "sendEmpty": false,
      "sendGetBody": false,
      "requestDatatype": "JSON",
      "responseDatatype": "JSON",
      "headers": {},
      "responseObjects": [
        {
          "type": "default",
          "key": "",
          "mockFile": ""
        }
      ]
    }
  ]
}