{
  "actions": [
    {
      "name": "getExtensions",
      "protocol": "REST",
      "method": "GET",
      "entitypath": "{base_path}/{version}/extensions?{query}",
      "requestSchema": "schema.json",
      "responseSchema": "schema.json",
      "timeout": 0,
      "sendEmpty": false,
      "sendGetBody": false,
      "requestDatatype": "JSON",
      "responseDatatype": "JSON",
      "headers": {},
      "responseObjects": [
        {
          "type": "default",
          "key": "",
          "mockFile": "mockdatafiles/getExtensions-default.json"
        }
      ]
    },
    {
      "name": "postExtensions",
      "protocol": "REST",
      "method": "POST",
      "entitypath": "{base_path}/{version}/extensions?{query}",
      "requestSchema": "schema.json",
      "responseSchema": "schema.json",
      "timeout": 0,
      "sendEmpty": false,
      "sendGetBody": false,
      "requestDatatype": "JSON",
      "responseDatatype": "JSON",
      "headers": {},
      "responseObjects": [
        {
          "type": "default",
          "key": "",
          "mockFile": "mockdatafiles/postExtensions-default.json"
        }
      ]
    },
    {
      "name": "getExtensionsId",
      "protocol": "REST",
      "method": "GET",
      "entitypath": "{base_path}/{version}/extensions/{pathv1}?{query}",
      "requestSchema": "schema.json",
      "responseSchema": "schema.json",
      "timeout": 0,
      "sendEmpty": false,
      "sendGetBody": false,
      "requestDatatype": "JSON",
      "responseDatatype": "JSON",
      "headers": {},
      "responseObjects": [
        {
          "type": "default",
          "key": "",
          "mockFile": "mockdatafiles/getExtensionsId-default.json"
        }
      ]
    },
    {
      "name": "deleteExtensionsId",
      "protocol": "REST",
      "method": "DELETE",
      "entitypath": "{base_path}/{version}/extensions/{pathv1}?{query}",
      "requestSchema": "schema.json",
      "responseSchema": "schema.json",
      "timeout": 0,
      "sendEmpty": false,
      "sendGetBody": false,
      "requestDatatype": "JSON",
      "responseDatatype": "JSON",
      "headers": {},
      "responseObjects": [
        {
          "type": "default",
          "key": "",
          "mockFile": ""
        }
      ]
    },
    {
      "name": "putExtensionsId",
      "protocol": "REST",
      "method": "PUT",
      "entitypath": "{base_path}/{version}/extensions/{pathv1}?{query}",
      "requestSchema": "schema.json",
      "responseSchema": "schema.json",
      "timeout": 0,
      "sendEmpty": false,
      "sendGetBody": false,
      "requestDatatype": "JSON",
      "responseDatatype": "JSON",
      "headers": {},
      "responseObjects": [
        {
          "type": "default",
          "key": "",
          "mockFile": "mockdatafiles/putExtensionsId-default.json"
        }
      ]
    }
  ]
}