{
  "contact_method": {
    "id": "PXPGF42",
    "type": "contact_method",
    "summary": "Work",
    "self": "https://api.pagerduty.com/users/PXPGF42/contact_method/PXPGF42",
    "html_url": null,
    "label": "Work",
    "address": "grady.haylie.126@hickle.net",
    "send_short_email": false
  }
}