{
  "log_entries": [
    {
      "id": "Q02JTSNZWHSEKV",
      "type": "trigger_log_entry",
      "summary": "Triggered through the API",
      "self": "https://api.pagerduty.com/log_entries/Q02JTSNZWHSEKV?incident_id=PT4KHLK",
      "html_url": "https://subdomain.pagerduty.com/incidents/PT4KHLK/log_entries/Q02JTSNZWHSEKV",
      "created_at": "2015-11-07T00:14:20Z",
      "agent": {
        "id": "PIJ90N7",
        "type": "generic_email_reference",
        "summary": "My Mail Service",
        "self": "https://api.pagerduty.com/services/PIJ90N7",
        "html_url": "https://subdomain.pagerduty.com/services/PIJ90N7"
      },
      "channel": {
        "type": "api"
      },
      "incident": {
        "id": "PT4KHLK",
        "type": "incident_reference",
        "summary": "[#1234] The server is on fire.",
        "self": "https://api.pagerduty.com/incidents/PT4KHLK",
        "html_url": "https://subdomain.pagerduty.com/incidents/PT4KHLK"
      },
      "teams": [
        {
          "id": "PQ9K7I8",
          "type": "team_reference",
          "summary": "Engineering",
          "self": "https://api.pagerduty.com/teams/PQ9K7I8",
          "html_url": "https://subdomain.pagerduty.com/teams/PQ9K7I8"
        }
      ],
      "contexts": [],
      "event_details": {
        "description": "Tasks::SFDCValidator - PD_Data__c - duplicates"
      }
    }
  ]
}