{
  "actions": [
    {
      "name": "listSalesCreditMemos",
      "protocol": "REST",
      "method": "GET",
      "entitypath": "{base_path}/{version}/{pathv1}/salesCreditMemos?{query}",
      "requestSchema": "schema.json",
      "responseSchema": "schema.json",
      "timeout": 0,
      "sendEmpty": false,
      "sendGetBody": false,
      "requestDatatype": "JSON",
      "responseDatatype": "JSON",
      "headers": {},
      "responseObjects": [
        {
          "type": "default",
          "key": "",
          "mockFile": ""
        }
      ]
    },
    {
      "name": "postSalesCreditMemo",
      "protocol": "REST",
      "method": "POST",
      "entitypath": "{base_path}/{version}/{pathv1}/salesCreditMemos?{query}",
      "requestSchema": "schema.json",
      "responseSchema": "schema.json",
      "timeout": 0,
      "sendEmpty": false,
      "requestDatatype": "JSON",
      "responseDatatype": "JSON",
      "headers": {},
      "responseObjects": [
        {
          "type": "default",
          "key": "",
          "mockFile": ""
        }
      ]
    },
    {
      "name": "getSalesCreditMemo",
      "protocol": "REST",
      "method": "GET",
      "entitypath": "{base_path}/{version}/{pathv1}/{pathv2}?{query}",
      "requestSchema": "schema.json",
      "responseSchema": "schema.json",
      "timeout": 0,
      "sendEmpty": false,
      "sendGetBody": false,
      "requestDatatype": "JSON",
      "responseDatatype": "JSON",
      "headers": {},
      "responseObjects": [
        {
          "type": "default",
          "key": "",
          "mockFile": ""
        }
      ]
    },
    {
      "name": "deleteSalesCreditMemo",
      "protocol": "REST",
      "method": "DELETE",
      "entitypath": "{base_path}/{version}/{pathv1}/{pathv2}?{query}",
      "requestSchema": "schema.json",
      "responseSchema": "schema.json",
      "timeout": 0,
      "sendEmpty": false,
      "requestDatatype": "JSON",
      "responseDatatype": "JSON",
      "headers": {},
      "responseObjects": [
        {
          "type": "default",
          "key": "",
          "mockFile": ""
        }
      ]
    },
    {
      "name": "patchSalesCreditMemo",
      "protocol": "REST",
      "method": "PATCH",
      "entitypath": "{base_path}/{version}/{pathv1}/{pathv2}?{query}",
      "requestSchema": "schema.json",
      "responseSchema": "schema.json",
      "timeout": 0,
      "sendEmpty": false,
      "requestDatatype": "JSON",
      "responseDatatype": "JSON",
      "headers": {},
      "responseObjects": [
        {
          "type": "default",
          "key": "",
          "mockFile": ""
        }
      ]
    },
    {
      "name": "cancelAndSendActionSalesCreditMemos",
      "protocol": "REST",
      "method": "POST",
      "entitypath": "{base_path}/{version}/{pathv1}/{pathv2}/Microsoft.NAV.cancelAndSend?{query}",
      "requestSchema": "schema.json",
      "responseSchema": "schema.json",
      "timeout": 0,
      "sendEmpty": false,
      "requestDatatype": "JSON",
      "responseDatatype": "JSON",
      "headers": {},
      "responseObjects": [
        {
          "type": "default",
          "key": "",
          "mockFile": ""
        }
      ]
    },
    {
      "name": "cancelActionSalesCreditMemos",
      "protocol": "REST",
      "method": "POST",
      "entitypath": "{base_path}/{version}/{pathv1}/{pathv2}/Microsoft.NAV.cancel?{query}",
      "requestSchema": "schema.json",
      "responseSchema": "schema.json",
      "timeout": 0,
      "sendEmpty": false,
      "requestDatatype": "JSON",
      "responseDatatype": "JSON",
      "headers": {},
      "responseObjects": [
        {
          "type": "default",
          "key": "",
          "mockFile": ""
        }
      ]
    },
    {
      "name": "postAndSendActionSalesCreditMemos",
      "protocol": "REST",
      "method": "POST",
      "entitypath": "{base_path}/{version}/{pathv1}/{pathv2}/Microsoft.NAV.postAndSend?{query}",
      "requestSchema": "schema.json",
      "responseSchema": "schema.json",
      "timeout": 0,
      "sendEmpty": false,
      "requestDatatype": "JSON",
      "responseDatatype": "JSON",
      "headers": {},
      "responseObjects": [
        {
          "type": "default",
          "key": "",
          "mockFile": ""
        }
      ]
    },
    {
      "name": "postActionSalesCreditMemos",
      "protocol": "REST",
      "method": "POST",
      "entitypath": "{base_path}/{version}/{pathv1}/{pathv2}/Microsoft.NAV.post?{query}",
      "requestSchema": "schema.json",
      "responseSchema": "schema.json",
      "timeout": 0,
      "sendEmpty": false,
      "requestDatatype": "JSON",
      "responseDatatype": "JSON",
      "headers": {},
      "responseObjects": [
        {
          "type": "default",
          "key": "",
          "mockFile": ""
        }
      ]
    },
    {
      "name": "sendActionSalesCreditMemos",
      "protocol": "REST",
      "method": "POST",
      "entitypath": "{base_path}/{version}/{pathv1}/{pathv2}/Microsoft.NAV.send?{query}",
      "requestSchema": "schema.json",
      "responseSchema": "schema.json",
      "timeout": 0,
      "sendEmpty": false,
      "requestDatatype": "JSON",
      "responseDatatype": "JSON",
      "headers": {},
      "responseObjects": [
        {
          "type": "default",
          "key": "",
          "mockFile": ""
        }
      ]
    }
  ]
}