{
  "actions": [
    {
      "name": "getRestapi2filter",
      "protocol": "REST",
      "method": "GET",
      "entitypath": "{base_path}/{version}/filter?{query}",
      "requestSchema": "schema.json",
      "responseSchema": "schema.json",
      "timeout": 0,
      "sendEmpty": false,
      "sendGetBody": false,
      "requestDatatype": "JSON",
      "responseDatatype": "JSON",
      "headers": {},
      "responseObjects": [
        {
          "type": "default",
          "key": "",
          "mockFile": ""
        }
      ]
    },
    {
      "name": "postRestapi2filter",
      "protocol": "REST",
      "method": "POST",
      "entitypath": "{base_path}/{version}/filter?{query}",
      "requestSchema": "schema.json",
      "responseSchema": "schema.json",
      "timeout": 0,
      "sendEmpty": false,
      "sendGetBody": false,
      "requestDatatype": "JSON",
      "responseDatatype": "JSON",
      "headers": {},
      "responseObjects": [
        {
          "type": "default",
          "key": "",
          "mockFile": "mockdatafiles/postRestapi2filter-default.json"
        }
      ]
    },
    {
      "name": "getRestapi2filterfavourite",
      "protocol": "REST",
      "method": "GET",
      "entitypath": "{base_path}/{version}/filter/favourite?{query}",
      "requestSchema": "schema.json",
      "responseSchema": "schema.json",
      "timeout": 0,
      "sendEmpty": false,
      "sendGetBody": false,
      "requestDatatype": "JSON",
      "responseDatatype": "JSON",
      "headers": {},
      "responseObjects": [
        {
          "type": "default",
          "key": "",
          "mockFile": ""
        }
      ]
    },
    {
      "name": "getRestapi2filtermy",
      "protocol": "REST",
      "method": "GET",
      "entitypath": "{base_path}/{version}/filter/my?{query}",
      "requestSchema": "schema.json",
      "responseSchema": "schema.json",
      "timeout": 0,
      "sendEmpty": false,
      "sendGetBody": false,
      "requestDatatype": "JSON",
      "responseDatatype": "JSON",
      "headers": {},
      "responseObjects": [
        {
          "type": "default",
          "key": "",
          "mockFile": ""
        }
      ]
    },
    {
      "name": "getRestapi2filtersearch",
      "protocol": "REST",
      "method": "GET",
      "entitypath": "{base_path}/{version}/filter/search?{query}",
      "requestSchema": "schema.json",
      "responseSchema": "schema.json",
      "timeout": 0,
      "sendEmpty": false,
      "sendGetBody": false,
      "requestDatatype": "JSON",
      "responseDatatype": "JSON",
      "headers": {},
      "responseObjects": [
        {
          "type": "default",
          "key": "",
          "mockFile": "mockdatafiles/getRestapi2filtersearch-default.json"
        }
      ]
    },
    {
      "name": "getRestapi2filterid",
      "protocol": "REST",
      "method": "GET",
      "entitypath": "{base_path}/{version}/filter/{pathv1}?{query}",
      "requestSchema": "schema.json",
      "responseSchema": "schema.json",
      "timeout": 0,
      "sendEmpty": false,
      "sendGetBody": false,
      "requestDatatype": "JSON",
      "responseDatatype": "JSON",
      "headers": {},
      "responseObjects": [
        {
          "type": "default",
          "key": "",
          "mockFile": "mockdatafiles/getRestapi2filterid-default.json"
        }
      ]
    },
    {
      "name": "putRestapi2filterid",
      "protocol": "REST",
      "method": "PUT",
      "entitypath": "{base_path}/{version}/filter/{pathv1}?{query}",
      "requestSchema": "schema.json",
      "responseSchema": "schema.json",
      "timeout": 0,
      "sendEmpty": false,
      "sendGetBody": false,
      "requestDatatype": "JSON",
      "responseDatatype": "JSON",
      "headers": {},
      "responseObjects": [
        {
          "type": "default",
          "key": "",
          "mockFile": "mockdatafiles/putRestapi2filterid-default.json"
        }
      ]
    },
    {
      "name": "deleteRestapi2filterid",
      "protocol": "REST",
      "method": "DELETE",
      "entitypath": "{base_path}/{version}/filter/{pathv1}?{query}",
      "requestSchema": "schema.json",
      "responseSchema": "schema.json",
      "timeout": 0,
      "sendEmpty": false,
      "sendGetBody": false,
      "requestDatatype": "JSON",
      "responseDatatype": "JSON",
      "headers": {},
      "responseObjects": [
        {
          "type": "default",
          "key": "",
          "mockFile": ""
        }
      ]
    },
    {
      "name": "getRestapi2filteridcolumns",
      "protocol": "REST",
      "method": "GET",
      "entitypath": "{base_path}/{version}/filter/{pathv1}/columns?{query}",
      "requestSchema": "schema.json",
      "responseSchema": "schema.json",
      "timeout": 0,
      "sendEmpty": false,
      "sendGetBody": false,
      "requestDatatype": "JSON",
      "responseDatatype": "JSON",
      "headers": {},
      "responseObjects": [
        {
          "type": "default",
          "key": "",
          "mockFile": ""
        }
      ]
    },
    {
      "name": "putRestapi2filteridcolumns",
      "protocol": "REST",
      "method": "PUT",
      "entitypath": "{base_path}/{version}/filter/{pathv1}/columns?{query}",
      "requestSchema": "schema.json",
      "responseSchema": "schema.json",
      "timeout": 0,
      "sendEmpty": false,
      "sendGetBody": false,
      "requestDatatype": "JSON",
      "responseDatatype": "JSON",
      "headers": {},
      "responseObjects": [
        {
          "type": "default",
          "key": "",
          "mockFile": ""
        }
      ]
    },
    {
      "name": "deleteRestapi2filteridcolumns",
      "protocol": "REST",
      "method": "DELETE",
      "entitypath": "{base_path}/{version}/filter/{pathv1}/columns?{query}",
      "requestSchema": "schema.json",
      "responseSchema": "schema.json",
      "timeout": 0,
      "sendEmpty": false,
      "sendGetBody": false,
      "requestDatatype": "JSON",
      "responseDatatype": "JSON",
      "headers": {},
      "responseObjects": [
        {
          "type": "default",
          "key": "",
          "mockFile": ""
        }
      ]
    },
    {
      "name": "putRestapi2filteridfavourite",
      "protocol": "REST",
      "method": "PUT",
      "entitypath": "{base_path}/{version}/filter/{pathv1}/favourite?{query}",
      "requestSchema": "schema.json",
      "responseSchema": "schema.json",
      "timeout": 0,
      "sendEmpty": false,
      "sendGetBody": false,
      "requestDatatype": "JSON",
      "responseDatatype": "JSON",
      "headers": {},
      "responseObjects": [
        {
          "type": "default",
          "key": "",
          "mockFile": "mockdatafiles/putRestapi2filteridfavourite-default.json"
        }
      ]
    },
    {
      "name": "deleteRestapi2filteridfavourite",
      "protocol": "REST",
      "method": "DELETE",
      "entitypath": "{base_path}/{version}/filter/{pathv1}/favourite?{query}",
      "requestSchema": "schema.json",
      "responseSchema": "schema.json",
      "timeout": 0,
      "sendEmpty": false,
      "sendGetBody": false,
      "requestDatatype": "JSON",
      "responseDatatype": "JSON",
      "headers": {},
      "responseObjects": [
        {
          "type": "default",
          "key": "",
          "mockFile": "mockdatafiles/deleteRestapi2filteridfavourite-default.json"
        }
      ]
    },
    {
      "name": "changeFilterOwner",
      "protocol": "REST",
      "method": "PUT",
      "entitypath": "{base_path}/{version}/filter/{pathv1}/owner?{query}",
      "requestSchema": "schema.json",
      "responseSchema": "schema.json",
      "timeout": 0,
      "sendEmpty": false,
      "requestDatatype": "JSON",
      "responseDatatype": "JSON",
      "headers": {},
      "responseObjects": [
        {
          "type": "default",
          "key": "",
          "mockFile": ""
        }
      ]
    }
  ]
}