{
  "actions": [
    {
      "name": "getRestapi2fieldfieldKeyoption",
      "protocol": "REST",
      "method": "GET",
      "entitypath": "{base_path}/{version}/field/{pathv1}/option?{query}",
      "requestSchema": "schema.json",
      "responseSchema": "schema.json",
      "timeout": 0,
      "sendEmpty": false,
      "sendGetBody": false,
      "requestDatatype": "JSON",
      "responseDatatype": "JSON",
      "headers": {},
      "responseObjects": [
        {
          "type": "default",
          "key": "",
          "mockFile": "mockdatafiles/getRestapi2fieldfieldKeyoption-default.json"
        }
      ]
    },
    {
      "name": "postRestapi2fieldfieldKeyoption",
      "protocol": "REST",
      "method": "POST",
      "entitypath": "{base_path}/{version}/field/{pathv1}/option?{query}",
      "requestSchema": "schema.json",
      "responseSchema": "schema.json",
      "timeout": 0,
      "sendEmpty": false,
      "sendGetBody": false,
      "requestDatatype": "JSON",
      "responseDatatype": "JSON",
      "headers": {},
      "responseObjects": [
        {
          "type": "default",
          "key": "",
          "mockFile": "mockdatafiles/postRestapi2fieldfieldKeyoption-default.json"
        }
      ]
    },
    {
      "name": "getRestapi2fieldfieldKeyoptionsuggestionsedit",
      "protocol": "REST",
      "method": "GET",
      "entitypath": "{base_path}/{version}/field/{pathv1}/option/suggestions/edit?{query}",
      "requestSchema": "schema.json",
      "responseSchema": "schema.json",
      "timeout": 0,
      "sendEmpty": false,
      "sendGetBody": false,
      "requestDatatype": "JSON",
      "responseDatatype": "JSON",
      "headers": {},
      "responseObjects": [
        {
          "type": "default",
          "key": "",
          "mockFile": "mockdatafiles/getRestapi2fieldfieldKeyoptionsuggestionsedit-default.json"
        }
      ]
    },
    {
      "name": "getRestapi2fieldfieldKeyoptionsuggestionssearch",
      "protocol": "REST",
      "method": "GET",
      "entitypath": "{base_path}/{version}/field/{pathv1}/option/suggestions/search?{query}",
      "requestSchema": "schema.json",
      "responseSchema": "schema.json",
      "timeout": 0,
      "sendEmpty": false,
      "sendGetBody": false,
      "requestDatatype": "JSON",
      "responseDatatype": "JSON",
      "headers": {},
      "responseObjects": [
        {
          "type": "default",
          "key": "",
          "mockFile": "mockdatafiles/getRestapi2fieldfieldKeyoptionsuggestionssearch-default.json"
        }
      ]
    },
    {
      "name": "getRestapi2fieldfieldKeyoptionoptionId",
      "protocol": "REST",
      "method": "GET",
      "entitypath": "{base_path}/{version}/field/{pathv1}/option/{pathv2}?{query}",
      "requestSchema": "schema.json",
      "responseSchema": "schema.json",
      "timeout": 0,
      "sendEmpty": false,
      "sendGetBody": false,
      "requestDatatype": "JSON",
      "responseDatatype": "JSON",
      "headers": {},
      "responseObjects": [
        {
          "type": "default",
          "key": "",
          "mockFile": "mockdatafiles/getRestapi2fieldfieldKeyoptionoptionId-default.json"
        }
      ]
    },
    {
      "name": "putRestapi2fieldfieldKeyoptionoptionId",
      "protocol": "REST",
      "method": "PUT",
      "entitypath": "{base_path}/{version}/field/{pathv1}/option/{pathv2}?{query}",
      "requestSchema": "schema.json",
      "responseSchema": "schema.json",
      "timeout": 0,
      "sendEmpty": false,
      "sendGetBody": false,
      "requestDatatype": "JSON",
      "responseDatatype": "JSON",
      "headers": {},
      "responseObjects": [
        {
          "type": "default",
          "key": "",
          "mockFile": "mockdatafiles/putRestapi2fieldfieldKeyoptionoptionId-default.json"
        }
      ]
    },
    {
      "name": "deleteRestapi2fieldfieldKeyoptionoptionId",
      "protocol": "REST",
      "method": "DELETE",
      "entitypath": "{base_path}/{version}/field/{pathv1}/option/{pathv2}?{query}",
      "requestSchema": "schema.json",
      "responseSchema": "schema.json",
      "timeout": 0,
      "sendEmpty": false,
      "sendGetBody": false,
      "requestDatatype": "JSON",
      "responseDatatype": "JSON",
      "headers": {},
      "responseObjects": [
        {
          "type": "default",
          "key": "",
          "mockFile": ""
        }
      ]
    },
    {
      "name": "deleteRestapi2fieldfieldKeyoptionoptionIdissue",
      "protocol": "REST",
      "method": "DELETE",
      "entitypath": "{base_path}/{version}/field/{pathv1}/option/{pathv2}/issue?{query}",
      "requestSchema": "schema.json",
      "responseSchema": "schema.json",
      "timeout": 0,
      "sendEmpty": false,
      "sendGetBody": false,
      "requestDatatype": "JSON",
      "responseDatatype": "JSON",
      "headers": {},
      "responseObjects": [
        {
          "type": "default",
          "key": "",
          "mockFile": ""
        }
      ]
    }
  ]
}