{
  "actions": [
    {
      "name": "getRestapi2customFieldOptionid",
      "protocol": "REST",
      "method": "GET",
      "entitypath": "{base_path}/{version}/customFieldOption/{pathv1}?{query}",
      "requestSchema": "schema.json",
      "responseSchema": "schema.json",
      "timeout": 0,
      "sendEmpty": false,
      "sendGetBody": false,
      "requestDatatype": "JSON",
      "responseDatatype": "JSON",
      "headers": {},
      "responseObjects": [
        {
          "type": "default",
          "key": "",
          "mockFile": "mockdatafiles/getRestapi2customFieldOptionid-default.json"
        }
      ]
    },
    {
      "name": "getRestapi2field",
      "protocol": "REST",
      "method": "GET",
      "entitypath": "{base_path}/{version}/field?{query}",
      "requestSchema": "schema.json",
      "responseSchema": "schema.json",
      "timeout": 0,
      "sendEmpty": false,
      "sendGetBody": false,
      "requestDatatype": "JSON",
      "responseDatatype": "JSON",
      "headers": {},
      "responseObjects": [
        {
          "type": "default",
          "key": "",
          "mockFile": ""
        }
      ]
    },
    {
      "name": "postRestapi2field",
      "protocol": "REST",
      "method": "POST",
      "entitypath": "{base_path}/{version}/field?{query}",
      "requestSchema": "schema.json",
      "responseSchema": "schema.json",
      "timeout": 0,
      "sendEmpty": false,
      "sendGetBody": false,
      "requestDatatype": "JSON",
      "responseDatatype": "JSON",
      "headers": {},
      "responseObjects": [
        {
          "type": "default",
          "key": "",
          "mockFile": "mockdatafiles/postRestapi2field-default.json"
        }
      ]
    },
    {
      "name": "getFieldsPaginated",
      "protocol": "REST",
      "method": "GET",
      "entitypath": "{base_path}/{version}/field/search?{query}",
      "requestSchema": "schema.json",
      "responseSchema": "schema.json",
      "timeout": 0,
      "sendEmpty": false,
      "sendGetBody": false,
      "requestDatatype": "JSON",
      "responseDatatype": "JSON",
      "headers": {},
      "responseObjects": [
        {
          "type": "default",
          "key": "",
          "mockFile": "mockdatafiles/getFieldsPaginated-default.json"
        }
      ]
    },
    {
      "name": "updateCustomField",
      "protocol": "REST",
      "method": "PUT",
      "entitypath": "{base_path}/{version}/field/{pathv1}?{query}",
      "requestSchema": "schema.json",
      "responseSchema": "schema.json",
      "timeout": 0,
      "sendEmpty": false,
      "requestDatatype": "JSON",
      "responseDatatype": "JSON",
      "headers": {},
      "responseObjects": [
        {
          "type": "default",
          "key": "",
          "mockFile": ""
        }
      ]
    },
    {
      "name": "getContextsForFieldDeprecated",
      "protocol": "REST",
      "method": "GET",
      "entitypath": "{base_path}/{version}/field/{pathv1}/contexts?{query}",
      "requestSchema": "schema.json",
      "responseSchema": "schema.json",
      "timeout": 0,
      "sendEmpty": false,
      "sendGetBody": false,
      "requestDatatype": "JSON",
      "responseDatatype": "JSON",
      "headers": {},
      "responseObjects": [
        {
          "type": "default",
          "key": "",
          "mockFile": "mockdatafiles/getContextsForFieldDeprecated-default.json"
        }
      ]
    },
    {
      "name": "deleteCustomField",
      "protocol": "REST",
      "method": "DELETE",
      "entitypath": "{base_path}/{version}/field/{pathv1}?{query}",
      "requestSchema": "schema.json",
      "responseSchema": "schema.json",
      "timeout": 0,
      "sendEmpty": false,
      "requestDatatype": "JSON",
      "responseDatatype": "JSON",
      "headers": {},
      "responseObjects": [
        {
          "type": "default",
          "key": "",
          "mockFile": ""
        }
      ]
    },
    {
      "name": "restoreCustomField",
      "protocol": "REST",
      "method": "POST",
      "entitypath": "{base_path}/{version}/field/{pathv1}/restore?{query}",
      "requestSchema": "schema.json",
      "responseSchema": "schema.json",
      "timeout": 0,
      "sendEmpty": false,
      "requestDatatype": "JSON",
      "responseDatatype": "JSON",
      "headers": {},
      "responseObjects": [
        {
          "type": "default",
          "key": "",
          "mockFile": ""
        }
      ]
    },
    {
      "name": "trashCustomField",
      "protocol": "REST",
      "method": "POST",
      "entitypath": "{base_path}/{version}/field/{pathv1}/trash?{query}",
      "requestSchema": "schema.json",
      "responseSchema": "schema.json",
      "timeout": 0,
      "sendEmpty": false,
      "requestDatatype": "JSON",
      "responseDatatype": "JSON",
      "headers": {},
      "responseObjects": [
        {
          "type": "default",
          "key": "",
          "mockFile": ""
        }
      ]
    },
    {
      "name": "getTrashedFieldsPaginated",
      "protocol": "REST",
      "method": "GET",
      "entitypath": "{base_path}/{version}/field/search/trashed?{query}",
      "requestSchema": "schema.json",
      "responseSchema": "schema.json",
      "timeout": 0,
      "sendEmpty": false,
      "sendGetBody": false,
      "requestDatatype": "JSON",
      "responseDatatype": "JSON",
      "headers": {},
      "responseObjects": [
        {
          "type": "default",
          "key": "",
          "mockFile": "mockdatafiles/getTrashedFieldsPaginated-default.json"
        }
      ]
    }
  ]
}