{
  "id": -81588268,
  "name": "exercitation incididunt fugiat",
  "description": "enim ut laborum",
  "defaultWorkflow": "dolore",
  "issueTypeMappings": {},
  "originalDefaultWorkflow": "velit Dui",
  "originalIssueTypeMappings": {},
  "draft": true,
  "lastModifiedUser": {
    "self": "https://ZraWZTBlaNQXNdCiGjAZoe.quhsGQ7IceOP9ueqL9n6SBBQMOvwZGl4EO7vviFTLqDn81uvaM",
    "key": "et esse exercitation nisi",
    "accountId": "veniam ullamco",
    "accountType": "customer",
    "name": "ullam",
    "emailAddress": "sint",
    "avatarUrls": {
      "16x16": "http://RAYqAe.vplTd1lrH7dMO1+ax",
      "24x24": "https://qpHQebzBdSGIy.cwbtafU",
      "32x32": "https://jFqoxtDYUbVrbnjl.ygcW5pmiMLZYloe7-DoWJZbZM9Tn1HhgKgY2sSPfbFVzFO3HfTU8H9V,iLYpMfWpOH8TIEf",
      "48x48": "https://nyDpKfMQTXMlgZ.evqlXrRn86bNgk9JYRa"
    },
    "displayName": "est nostrud velit dolore",
    "active": true,
    "timeZone": "et",
    "locale": "cillum",
    "groups": {
      "size": -11854064,
      "items": [],
      "pagingCallback": {},
      "callback": {},
      "max-results": -29176614
    },
    "applicationRoles": {
      "size": -36524486,
      "items": [],
      "pagingCallback": {},
      "callback": {},
      "max-results": 49435952
    },
    "expand": "aliquip dolore Duis nulla adipisicing"
  },
  "lastModified": "",
  "self": "http://CnhNihzPPjlopaer.dsg5mvF9F4y2Js4h9+",
  "updateDraftIfNeeded": true,
  "issueTypes": {}
}