{
  "id": 66512285,
  "name": "sunt est dolor",
  "description": "Excepteur",
  "defaultWorkflow": "mollit nisi tempor",
  "issueTypeMappings": {},
  "originalDefaultWorkflow": "dolor in laborum consequat incididunt",
  "originalIssueTypeMappings": {},
  "draft": true,
  "lastModifiedUser": {
    "self": "http://XPeacXqadATPhPo.fdglb0J,AeY6A",
    "key": "dolore ut do",
    "accountId": "dolor nisi",
    "accountType": "atlassian",
    "name": "est irure laboris nulla",
    "emailAddress": "enim esse",
    "avatarUrls": {
      "16x16": "https://NsDLxgHqLGjStLonCtJfUvJPI.qlvuVF,fBiojxu3",
      "24x24": "https://TfdEkq.xefDJfKmSCdFw5W-HmVvkCODcw0fnnXji45l63.uOtyuQJks8ujoHDrB",
      "32x32": "https://PU.sjqCx",
      "48x48": "http://ntiGizhcXNvJhTXOAWnYL.boBX0wH0QEN71b76FrLgbE9MpGJcdNnNcTUbJ,15iEXxgS2w9FkwTyppNKMaSsRueQggGWl7i9d9DVy"
    },
    "displayName": "velit Excepteur ",
    "active": true,
    "timeZone": "cupidatat in",
    "locale": "laboris voluptate quis ullamco veniam",
    "groups": {
      "size": -92061534,
      "items": [],
      "pagingCallback": {},
      "callback": {},
      "max-results": -57032040
    },
    "applicationRoles": {
      "size": 66087656,
      "items": [],
      "pagingCallback": {},
      "callback": {},
      "max-results": 46233954
    },
    "expand": "pariatur sed quis Lorem"
  },
  "lastModified": "nostrud veniam",
  "self": "https://rlEQqRyAILcczn.lspbCdd-Sqlicdech0h,fwylsOlp",
  "updateDraftIfNeeded": true,
  "issueTypes": {}
}