{
  "key": "in",
  "groups": [],
  "name": "Duis eiusmod",
  "defaultGroups": [],
  "selectedByDefault": false,
  "defined": true,
  "numberOfSeats": -543742,
  "remainingSeats": 97353986,
  "userCount": 55713618,
  "userCountDescription": "mollit",
  "hasUnlimitedSeats": true,
  "platform": true
}