{
  "actions": [
    {
      "name": "getRestapi2projectvalidatekey",
      "protocol": "REST",
      "method": "GET",
      "entitypath": "{base_path}/{version}/projectvalidate/key?{query}",
      "requestSchema": "schema.json",
      "responseSchema": "schema.json",
      "timeout": 0,
      "sendEmpty": false,
      "sendGetBody": false,
      "requestDatatype": "JSON",
      "responseDatatype": "JSON",
      "headers": {},
      "responseObjects": [
        {
          "type": "default",
          "key": "",
          "mockFile": "mockdatafiles/getRestapi2projectvalidatekey-default.json"
        }
      ]
    },
    {
      "name": "getRestapi2projectvalidatevalidProjectKey",
      "protocol": "REST",
      "method": "GET",
      "entitypath": "{base_path}/{version}/projectvalidate/validProjectKey?{query}",
      "requestSchema": "schema.json",
      "responseSchema": "schema.json",
      "timeout": 0,
      "sendEmpty": false,
      "sendGetBody": false,
      "requestDatatype": "JSON",
      "responseDatatype": "JSON",
      "headers": {},
      "responseObjects": [
        {
          "type": "default",
          "key": "",
          "mockFile": ""
        }
      ]
    },
    {
      "name": "getRestapi2projectvalidatevalidProjectName",
      "protocol": "REST",
      "method": "GET",
      "entitypath": "{base_path}/{version}/projectvalidate/validProjectName?{query}",
      "requestSchema": "schema.json",
      "responseSchema": "schema.json",
      "timeout": 0,
      "sendEmpty": false,
      "sendGetBody": false,
      "requestDatatype": "JSON",
      "responseDatatype": "JSON",
      "headers": {},
      "responseObjects": [
        {
          "type": "default",
          "key": "",
          "mockFile": ""
        }
      ]
    }
  ]
}