{
  "self": "http://Pr.xvEvLgYhgjqFNnta-muCupcSkpDcDiTlZO3q7fe52VUp1cuBuly,XUK4DiM4,mPQyop",
  "author": {
    "self": "laborum",
    "name": "dolor ad",
    "key": "amet Duis",
    "accountId": "exercitation ea labore incididunt Duis",
    "emailAddress": "proident fugiat voluptate tempor",
    "avatarUrls": {
      "16x16": "https://vMczsyrVngzGabpMjemHAMbyiL.zsrbJZF5rkB+zzI",
      "24x24": "https://bNRpaQ.urzYqOVB5dyFd95-xNq5LRS-d13GGhIulVRaqsb0IcUB",
      "32x32": "http://CLbiaZGYeMZpuJCQneDshMyFJadQY.fangHBqLN9lfdGthSwiOOaDcPVPT5",
      "48x48": "https://UtaAtTIKkU.aaryhVLR2s63Em."
    },
    "displayName": "magna culpa pariatur",
    "active": true,
    "timeZone": "pariatur",
    "accountType": "minim dolore esse sed"
  },
  "updateAuthor": {
    "self": "consectetur adipisicing culpa est quis",
    "name": "culpa",
    "key": "dolor reprehenderit laboris do dolore",
    "accountId": "nost",
    "emailAddress": "dolor aliquip laborum",
    "avatarUrls": {
      "16x16": "https://kiwxzT.hclcdIrb3mWuJf4hMoCcJcUOnQXY8JP.fqNvzfotmmupfUNx6afGZWbHmqE4nQdgNmjx3gp6EHkabbb",
      "24x24": "http://TJXSoIcTUbfMAzgBISXLznNLLkDzyHkUd.odqYvqDxfVURyje,hYDYCQOS+tvtEusc",
      "32x32": "https://fwnQOAfxYvhzwIFBsrflwx.vomykeSe,KLr",
      "48x48": "http://dperOhQhTKwrxKXgkpiOZpptAaOEj.yimgpwOz9WMk4,A0p.aSHdBvB.RsfCXYe9Nr"
    },
    "displayName": "adipisicing tempor",
    "active": false,
    "timeZone": "ipsum",
    "accountType": "dolor id eiusmod ipsum cupidatat"
  },
  "comment": "nisi ad",
  "created": "2017-06-18T21:19:14.561Z",
  "updated": "1956-07-13T02:12:29.835Z",
  "visibility": {
    "type": "group",
    "value": "eiusmod et elit esse anim"
  },
  "started": "1971-02-11T23:09:38.524Z",
  "timeSpent": "est nisi veniam do",
  "timeSpentSeconds": 94065525,
  "id": "ut consectetur deserunt",
  "issueId": "ad esse",
  "properties": []
}