{
  "maxResults": 50,
  "startAt": 0,
  "total": 1,
  "isLast": true,
  "values": [
    {
      "id": "10001",
      "description": "This is what it is supposed to do.",
      "name": "Works as designed",
      "isDefault": true
    }
  ]
}