{
  "maxResults": 100,
  "startAt": 0,
  "total": 1,
  "isLast": true,
  "values": [
    {
      "id": "10000",
      "value": "issue in (TEST-1, TEST-2, TEST-3)",
      "functionKey": "ari:cloud:ecosystem::extension/00000000-1111-2222-3333-4444444/111111-2222-3333-4444-55555/static/issuesWithText",
      "field": "issue",
      "operator": "in",
      "functionName": "issuesWithText",
      "arguments": [
        "Test"
      ],
      "created": "2023-05-05T16:47:47.110+0000",
      "updated": "2023-05-05T16:47:47.110+0000",
      "used": "2023-05-05T16:47:47.110+0000"
    }
  ]
}