{
  "self": "dolore",
  "id": "sed elit nisi tempor",
  "description": "sint proident",
  "iconUrl": "sunt sint",
  "name": "consequat deserunt commodo nostrud eiusmod",
  "subtask": true,
  "avatarId": -3372010,
  "scope": {
    "type": "PROJECT",
    "project": {
      "self": "incididunt",
      "id": "ipsum exerc",
      "key": "do",
      "name": "labore elit qui Ut",
      "projectTypeKey": "software",
      "avatarUrls": {
        "16x16": "https://fmwhrKoXyIrUdoVpIHvBLjVGWPrhEj.ojttRXrXIs36Ixko5jk-pizYADKafydKZ7iWFErQA8BAy.LCzUPpXcskG+fw",
        "24x24": "https://SSvTZUuHwFJc.farvhbIOe0X6LJ7GUBLOsuYXzgiMQgKcEI4H8TRbRy",
        "32x32": "http://eegnJrMjOxwGHPx.gurlkGKQr-2QisQUjRtQZsiVOAMhO7OKEyfhpHTUzTumOyc3.B,h2",
        "48x48": "http://WcxEGKLenYDIIhAFCzifxgOawx.gjJxWl05Ym-TaBdi1F1QmrODbBLcc.tgju8eG7utYN86AcHpPTp-3l,L"
      },
      "projectCategory": {
        "self": "ut quis ullamco anim",
        "id": "est sed",
        "description": "reprehenderit occaecat incididunt consequat qui",
        "name": "cupidatat id"
      }
    }
  }
}