{
  "actions": [
    {
      "name": "getRestapi2jqlautocompletedata",
      "protocol": "REST",
      "method": "GET",
      "entitypath": "{base_path}/{version}/jql/autocompletedata?{query}",
      "requestSchema": "schema.json",
      "responseSchema": "schema.json",
      "timeout": 0,
      "sendEmpty": false,
      "sendGetBody": false,
      "requestDatatype": "JSON",
      "responseDatatype": "JSON",
      "headers": {},
      "responseObjects": [
        {
          "type": "default",
          "key": "",
          "mockFile": "mockdatafiles/getRestapi2jqlautocompletedata-default.json"
        }
      ]
    },
    {
      "name": "getRestapi2jqlautocompletedatasuggestions",
      "protocol": "REST",
      "method": "GET",
      "entitypath": "{base_path}/{version}/jql/autocompletedata/suggestions?{query}",
      "requestSchema": "schema.json",
      "responseSchema": "schema.json",
      "timeout": 0,
      "sendEmpty": false,
      "sendGetBody": false,
      "requestDatatype": "JSON",
      "responseDatatype": "JSON",
      "headers": {},
      "responseObjects": [
        {
          "type": "default",
          "key": "",
          "mockFile": "mockdatafiles/getRestapi2jqlautocompletedatasuggestions-default.json"
        }
      ]
    },
    {
      "name": "postRestapi2jqlpdcleaner",
      "protocol": "REST",
      "method": "POST",
      "entitypath": "{base_path}/{version}/jql/pdcleaner?{query}",
      "requestSchema": "schema.json",
      "responseSchema": "schema.json",
      "timeout": 0,
      "sendEmpty": false,
      "sendGetBody": false,
      "requestDatatype": "JSON",
      "responseDatatype": "JSON",
      "headers": {},
      "responseObjects": [
        {
          "type": "default",
          "key": "",
          "mockFile": "mockdatafiles/postRestapi2jqlpdcleaner-default.json"
        }
      ]
    },
    {
      "name": "getAutoCompletePost",
      "protocol": "REST",
      "method": "POST",
      "entitypath": "{base_path}/{version}/jql/autocompletedata?{query}",
      "requestSchema": "schema.json",
      "responseSchema": "schema.json",
      "timeout": 0,
      "sendEmpty": false,
      "requestDatatype": "JSON",
      "responseDatatype": "JSON",
      "headers": {},
      "responseObjects": [
        {
          "type": "default",
          "key": "",
          "mockFile": "mockdatafiles/getAutoCompletePost-default.json"
        }
      ]
    },
    {
      "name": "parseJqlQueries",
      "protocol": "REST",
      "method": "POST",
      "entitypath": "{base_path}/{version}/jql/parse?{query}",
      "requestSchema": "schema.json",
      "responseSchema": "schema.json",
      "timeout": 0,
      "sendEmpty": false,
      "requestDatatype": "JSON",
      "responseDatatype": "JSON",
      "headers": {},
      "responseObjects": [
        {
          "type": "default",
          "key": "",
          "mockFile": "mockdatafiles/parseJqlQueries-default.json"
        }
      ]
    },
    {
      "name": "sanitiseJqlQueries",
      "protocol": "REST",
      "method": "POST",
      "entitypath": "{base_path}/{version}/jql/sanitize?{query}",
      "requestSchema": "schema.json",
      "responseSchema": "schema.json",
      "timeout": 0,
      "sendEmpty": false,
      "requestDatatype": "JSON",
      "responseDatatype": "JSON",
      "headers": {},
      "responseObjects": [
        {
          "type": "default",
          "key": "",
          "mockFile": "mockdatafiles/sanitiseJqlQueries-default.json"
        }
      ]
    }
  ]
}