{
  "id": 43214452,
  "name": "esse",
  "description": "est Duis",
  "defaultWorkflow": "minim culpa",
  "issueTypeMappings": {},
  "originalDefaultWorkflow": "dolor esse laborum",
  "originalIssueTypeMappings": {},
  "draft": false,
  "lastModifiedUser": {
    "self": "https://pjHLWQHUdibKUVkPDICQju.khntwNDF82+syNfB03V2+O,legcedb9gNtNKMmzAJc0e9Pj,Ib.ZLRxh+aieHbQBZLqFHrk",
    "key": "Ut",
    "accountId": "ullamco",
    "accountType": "customer",
    "name": "adipisicing aliquip non",
    "emailAddress": "ad",
    "avatarUrls": {
      "16x16": "http://AJnSazwiEqW.bfov,FJ2fKeCkik-uETFIUUGqNUNzDvvqJYIRyAiMy+hy3uCAV",
      "24x24": "http://LfiawEu.jcsQeybmLmB,TepMu+mOkYpZ3Cr8Z",
      "32x32": "http://zixdcpiY.bkqmpZf",
      "48x48": "https://A.caccyM.2.-NYFmhyKRVSl"
    },
    "displayName": "velit Excepteur commodo",
    "active": false,
    "timeZone": "in aliqua Excepteur",
    "locale": "eiusmod amet proident exercitation",
    "groups": {
      "size": 9585377,
      "items": [],
      "pagingCallback": {},
      "callback": {},
      "max-results": 71983137
    },
    "applicationRoles": {
      "size": -76789097,
      "items": [],
      "pagingCallback": {},
      "callback": {},
      "max-results": 75268297
    },
    "expand": "proident eu officia dolor"
  },
  "lastModified": "aliquip Excepteur",
  "self": "https://MBya.fitu8pMhRQh7T",
  "updateDraftIfNeeded": false,
  "issueTypes": {}
}