{
  "matches": [
    {
      "matchedIssues": [
        10000,
        10004
      ],
      "errors": []
    },
    {
      "matchedIssues": [
        100134,
        10025,
        10236
      ],
      "errors": []
    },
    {
      "matchedIssues": [],
      "errors": []
    },
    {
      "matchedIssues": [],
      "errors": [
        "Invalid JQL: broken = value"
      ]
    }
  ]
}