{
  "actions": [
    {
      "name": "postRestapi2workflowscheme",
      "protocol": "REST",
      "method": "POST",
      "entitypath": "{base_path}/{version}/workflowscheme?{query}",
      "requestSchema": "schema.json",
      "responseSchema": "schema.json",
      "timeout": 0,
      "sendEmpty": false,
      "sendGetBody": false,
      "requestDatatype": "JSON",
      "responseDatatype": "JSON",
      "headers": {},
      "responseObjects": [
        {
          "type": "default",
          "key": "",
          "mockFile": "mockdatafiles/postRestapi2workflowscheme-default.json"
        }
      ]
    },
    {
      "name": "getRestapi2workflowschemeid",
      "protocol": "REST",
      "method": "GET",
      "entitypath": "{base_path}/{version}/workflowscheme/{pathv1}?{query}",
      "requestSchema": "schema.json",
      "responseSchema": "schema.json",
      "timeout": 0,
      "sendEmpty": false,
      "sendGetBody": false,
      "requestDatatype": "JSON",
      "responseDatatype": "JSON",
      "headers": {},
      "responseObjects": [
        {
          "type": "default",
          "key": "",
          "mockFile": "mockdatafiles/getRestapi2workflowschemeid-default.json"
        }
      ]
    },
    {
      "name": "putRestapi2workflowschemeid",
      "protocol": "REST",
      "method": "PUT",
      "entitypath": "{base_path}/{version}/workflowscheme/{pathv1}?{query}",
      "requestSchema": "schema.json",
      "responseSchema": "schema.json",
      "timeout": 0,
      "sendEmpty": false,
      "sendGetBody": false,
      "requestDatatype": "JSON",
      "responseDatatype": "JSON",
      "headers": {},
      "responseObjects": [
        {
          "type": "default",
          "key": "",
          "mockFile": "mockdatafiles/putRestapi2workflowschemeid-default.json"
        }
      ]
    },
    {
      "name": "deleteRestapi2workflowschemeid",
      "protocol": "REST",
      "method": "DELETE",
      "entitypath": "{base_path}/{version}/workflowscheme/{pathv1}?{query}",
      "requestSchema": "schema.json",
      "responseSchema": "schema.json",
      "timeout": 0,
      "sendEmpty": false,
      "sendGetBody": false,
      "requestDatatype": "JSON",
      "responseDatatype": "JSON",
      "headers": {},
      "responseObjects": [
        {
          "type": "default",
          "key": "",
          "mockFile": ""
        }
      ]
    },
    {
      "name": "getRestapi2workflowschemeiddefault",
      "protocol": "REST",
      "method": "GET",
      "entitypath": "{base_path}/{version}/workflowscheme/{pathv1}/default?{query}",
      "requestSchema": "schema.json",
      "responseSchema": "schema.json",
      "timeout": 0,
      "sendEmpty": false,
      "sendGetBody": false,
      "requestDatatype": "JSON",
      "responseDatatype": "JSON",
      "headers": {},
      "responseObjects": [
        {
          "type": "default",
          "key": "",
          "mockFile": "mockdatafiles/getRestapi2workflowschemeiddefault-default.json"
        }
      ]
    },
    {
      "name": "putRestapi2workflowschemeiddefault",
      "protocol": "REST",
      "method": "PUT",
      "entitypath": "{base_path}/{version}/workflowscheme/{pathv1}/default?{query}",
      "requestSchema": "schema.json",
      "responseSchema": "schema.json",
      "timeout": 0,
      "sendEmpty": false,
      "sendGetBody": false,
      "requestDatatype": "JSON",
      "responseDatatype": "JSON",
      "headers": {},
      "responseObjects": [
        {
          "type": "default",
          "key": "",
          "mockFile": "mockdatafiles/putRestapi2workflowschemeiddefault-default.json"
        }
      ]
    },
    {
      "name": "deleteRestapi2workflowschemeiddefault",
      "protocol": "REST",
      "method": "DELETE",
      "entitypath": "{base_path}/{version}/workflowscheme/{pathv1}/default?{query}",
      "requestSchema": "schema.json",
      "responseSchema": "schema.json",
      "timeout": 0,
      "sendEmpty": false,
      "sendGetBody": false,
      "requestDatatype": "JSON",
      "responseDatatype": "JSON",
      "headers": {},
      "responseObjects": [
        {
          "type": "default",
          "key": "",
          "mockFile": "mockdatafiles/deleteRestapi2workflowschemeiddefault-default.json"
        }
      ]
    },
    {
      "name": "getRestapi2workflowschemeidissuetypeissueType",
      "protocol": "REST",
      "method": "GET",
      "entitypath": "{base_path}/{version}/workflowscheme/{pathv1}/issuetype/{pathv2}?{query}",
      "requestSchema": "schema.json",
      "responseSchema": "schema.json",
      "timeout": 0,
      "sendEmpty": false,
      "sendGetBody": false,
      "requestDatatype": "JSON",
      "responseDatatype": "JSON",
      "headers": {},
      "responseObjects": [
        {
          "type": "default",
          "key": "",
          "mockFile": "mockdatafiles/getRestapi2workflowschemeidissuetypeissueType-default.json"
        }
      ]
    },
    {
      "name": "putRestapi2workflowschemeidissuetypeissueType",
      "protocol": "REST",
      "method": "PUT",
      "entitypath": "{base_path}/{version}/workflowscheme/{pathv1}/issuetype/{pathv2}?{query}",
      "requestSchema": "schema.json",
      "responseSchema": "schema.json",
      "timeout": 0,
      "sendEmpty": false,
      "sendGetBody": false,
      "requestDatatype": "JSON",
      "responseDatatype": "JSON",
      "headers": {},
      "responseObjects": [
        {
          "type": "default",
          "key": "",
          "mockFile": "mockdatafiles/putRestapi2workflowschemeidissuetypeissueType-default.json"
        }
      ]
    },
    {
      "name": "deleteRestapi2workflowschemeidissuetypeissueType",
      "protocol": "REST",
      "method": "DELETE",
      "entitypath": "{base_path}/{version}/workflowscheme/{pathv1}/issuetype/{pathv2}?{query}",
      "requestSchema": "schema.json",
      "responseSchema": "schema.json",
      "timeout": 0,
      "sendEmpty": false,
      "sendGetBody": false,
      "requestDatatype": "JSON",
      "responseDatatype": "JSON",
      "headers": {},
      "responseObjects": [
        {
          "type": "default",
          "key": "",
          "mockFile": "mockdatafiles/deleteRestapi2workflowschemeidissuetypeissueType-default.json"
        }
      ]
    },
    {
      "name": "getRestapi2workflowschemeidworkflow",
      "protocol": "REST",
      "method": "GET",
      "entitypath": "{base_path}/{version}/workflowscheme/{pathv1}/workflow?{query}",
      "requestSchema": "schema.json",
      "responseSchema": "schema.json",
      "timeout": 0,
      "sendEmpty": false,
      "sendGetBody": false,
      "requestDatatype": "JSON",
      "responseDatatype": "JSON",
      "headers": {},
      "responseObjects": [
        {
          "type": "default",
          "key": "",
          "mockFile": "mockdatafiles/getRestapi2workflowschemeidworkflow-default.json"
        }
      ]
    },
    {
      "name": "putRestapi2workflowschemeidworkflow",
      "protocol": "REST",
      "method": "PUT",
      "entitypath": "{base_path}/{version}/workflowscheme/{pathv1}/workflow?{query}",
      "requestSchema": "schema.json",
      "responseSchema": "schema.json",
      "timeout": 0,
      "sendEmpty": false,
      "sendGetBody": false,
      "requestDatatype": "JSON",
      "responseDatatype": "JSON",
      "headers": {},
      "responseObjects": [
        {
          "type": "default",
          "key": "",
          "mockFile": "mockdatafiles/putRestapi2workflowschemeidworkflow-default.json"
        }
      ]
    },
    {
      "name": "deleteRestapi2workflowschemeidworkflow",
      "protocol": "REST",
      "method": "DELETE",
      "entitypath": "{base_path}/{version}/workflowscheme/{pathv1}/workflow?{query}",
      "requestSchema": "schema.json",
      "responseSchema": "schema.json",
      "timeout": 0,
      "sendEmpty": false,
      "sendGetBody": false,
      "requestDatatype": "JSON",
      "responseDatatype": "JSON",
      "headers": {},
      "responseObjects": [
        {
          "type": "default",
          "key": "",
          "mockFile": ""
        }
      ]
    },
    {
      "name": "getAllWorkflowSchemes",
      "protocol": "REST",
      "method": "GET",
      "entitypath": "{base_path}/{version}/workflowscheme?{query}",
      "requestSchema": "schema.json",
      "responseSchema": "schema.json",
      "timeout": 0,
      "sendEmpty": false,
      "sendGetBody": false,
      "requestDatatype": "JSON",
      "responseDatatype": "JSON",
      "headers": {},
      "responseObjects": [
        {
          "type": "default",
          "key": "",
          "mockFile": "mockdatafiles/getAllWorkflowSchemes-default.json"
        }
      ]
    }
  ]
}