{
  "self": "https://yJihQinYGPSKUxmuyqZHrHyEXVpkOAZM.tqofqtF.e45",
  "nextPage": "https://NPIHReiLiTjNQiIqlpc.xhwMv+-rvuaKPVC1SaMAR0uNcMsJAGX.ww,fhle",
  "maxResults": -30980114,
  "startAt": 85027301,
  "total": -80944909,
  "isLast": true,
  "values": []
}