{
  "$id": "schema.json",
  "type": "object",
  "schema": "http://json-schema.org/draft-07/schema#",
  "translate": false,
  "dynamicfields": true,
  "properties": {
    "ph_request_type": {
      "type": "string",
      "description": "type of request (internal to adapter)",
      "default": "postRestapi2workflowscheme",
      "enum": [
        "postRestapi2workflowscheme",
        "getRestapi2workflowschemeid",
        "putRestapi2workflowschemeid",
        "deleteRestapi2workflowschemeid",
        "getRestapi2workflowschemeiddefault",
        "putRestapi2workflowschemeiddefault",
        "deleteRestapi2workflowschemeiddefault",
        "getRestapi2workflowschemeidissuetypeissueType",
        "putRestapi2workflowschemeidissuetypeissueType",
        "deleteRestapi2workflowschemeidissuetypeissueType",
        "getRestapi2workflowschemeidworkflow",
        "putRestapi2workflowschemeidworkflow",
        "deleteRestapi2workflowschemeidworkflow",
        "getAllWorkflowSchemes"
      ],
      "external_name": "ph_request_type"
    }
  },
  "definitions": {}
}