{
  "actions": [
    {
      "name": "getRestapi2issueissueIdOrKeywatchers",
      "protocol": "REST",
      "method": "GET",
      "entitypath": "{base_path}/{version}/issue/{pathv1}/watchers?{query}",
      "requestSchema": "schema.json",
      "responseSchema": "schema.json",
      "timeout": 0,
      "sendEmpty": false,
      "sendGetBody": false,
      "requestDatatype": "JSON",
      "responseDatatype": "JSON",
      "headers": {},
      "responseObjects": [
        {
          "type": "default",
          "key": "",
          "mockFile": "mockdatafiles/getRestapi2issueissueIdOrKeywatchers-default.json"
        }
      ]
    },
    {
      "name": "postRestapi2issueissueIdOrKeywatchers",
      "protocol": "REST",
      "method": "POST",
      "entitypath": "{base_path}/{version}/issue/{pathv1}/watchers?{query}",
      "requestSchema": "schema.json",
      "responseSchema": "schema.json",
      "timeout": 0,
      "sendEmpty": false,
      "sendGetBody": false,
      "requestDatatype": "JSON",
      "responseDatatype": "JSON",
      "headers": {},
      "responseObjects": [
        {
          "type": "default",
          "key": "",
          "mockFile": ""
        }
      ]
    },
    {
      "name": "deleteRestapi2issueissueIdOrKeywatchers",
      "protocol": "REST",
      "method": "DELETE",
      "entitypath": "{base_path}/{version}/issue/{pathv1}/watchers?{query}",
      "requestSchema": "schema.json",
      "responseSchema": "schema.json",
      "timeout": 0,
      "sendEmpty": false,
      "sendGetBody": false,
      "requestDatatype": "JSON",
      "responseDatatype": "JSON",
      "headers": {},
      "responseObjects": [
        {
          "type": "default",
          "key": "",
          "mockFile": ""
        }
      ]
    },
    {
      "name": "getIsWatchingIssueBulk",
      "protocol": "REST",
      "method": "POST",
      "entitypath": "{base_path}/{version}/issue/watching?{query}",
      "requestSchema": "schema.json",
      "responseSchema": "schema.json",
      "timeout": 0,
      "sendEmpty": false,
      "requestDatatype": "JSON",
      "responseDatatype": "JSON",
      "headers": {},
      "responseObjects": [
        {
          "type": "default",
          "key": "",
          "mockFile": "mockdatafiles/getIsWatchingIssueBulk-default.json"
        }
      ]
    }
  ]
}