{
  "id": 82447186,
  "name": "sint ex sed",
  "description": "aute officia",
  "defaultWorkflow": "cupidatat consequat consectetur",
  "issueTypeMappings": {},
  "originalDefaultWorkflow": "sit esse eiusmod",
  "originalIssueTypeMappings": {},
  "draft": false,
  "lastModifiedUser": {
    "self": "https://XeKbSQKZUiHRuuDRGBsXk.xyvyfBNdGPi9dg",
    "key": "tempor non nostrud Ut cillum",
    "accountId": "et labore sunt",
    "accountType": "customer",
    "name": "irure",
    "emailAddress": "ipsum occaecat anim non",
    "avatarUrls": {
      "16x16": "http://XikOUlWfpJcgfdSS.dfrApT6y,3RiVBwB.lZ8emh.VQoiwtYOi301C,1ChUbw46BXk0DV-yeEMi40bDYogFUd",
      "24x24": "http://faLsbQ.dxISw,tz+4L4d3JctRgykri-lhko2+FM",
      "32x32": "http://cmyreHktVkaTWbqspWZZhBG.clzOSSbiu1rE7",
      "48x48": "https://xzokCgOrADizYyddmxovakvKSHLwiLfY.xrxQwzoazbPR3SmbDYTB6gBmSDQkK0oYnPBHbCcBv6,wQv7ItzR49kXvJ,Xf25"
    },
    "displayName": "ex aute",
    "active": false,
    "timeZone": "nulla occaecat",
    "locale": "do",
    "groups": {
      "size": 40043552,
      "items": [],
      "pagingCallback": {},
      "callback": {},
      "max-results": 3234911
    },
    "applicationRoles": {
      "size": 75676010,
      "items": [],
      "pagingCallback": {},
      "callback": {},
      "max-results": 51165756
    },
    "expand": "sint in ad adipisicing et"
  },
  "lastModified": "et",
  "self": "http://PnLYx.qxrZWuaOMtw.c,xN7l3DWfhM7oZAvMGSOLQ2g41uNnyIo4Lzn9D8jFTt",
  "updateDraftIfNeeded": true,
  "issueTypes": {}
}