[
  {
    "Code": "TVD",
    "Description": "TV AND DATA",
    "Balance": -2.34
  },
  {
    "Code": "TVD",
    "Description": "TV AND DATA",
    "Balance": -2.34
  },
  {
    "Code": "TVD",
    "Description": "TV AND DATA",
    "Balance": -2.34
  }
]