[
  {
    "WOnumber": "2147486937",
    "WOStatus": "Open",
    "CreatedBy": {
      "Code": "CSD",
      "Name": "Mark Lawman"
    },
    "CreatedWhen": "string",
    "WOType": {
      "Code": "COS",
      "Name": "Change of Service",
      "BaseType": {
        "Code": "COS",
        "Name": "Change of Service"
      }
    },
    "ScheduledDate": "string",
    "ScheduledPeriod": {
      "Period": 354,
      "PeriodStart": "2020-10-30T12:00:00.000Z",
      "PeriodEnd": "2020-10-30T17:00:00.000Z",
      "PeriodDescription": "12PM-5PM"
    },
    "Technician": {
      "Code": "1VD",
      "Name": "John Black"
    },
    "ClosedBy": {
      "Code": "CSD",
      "Name": "Mark Lawman"
    },
    "Reasons": [
      {
        "type": "Initial",
        "Reason": {
          "Code": "201",
          "Name": "Too expensive"
        }
      },
      {
        "type": "Secondary",
        "Reason": {
          "Code": "202",
          "Name": "Slow Speed"
        }
      },
      {
        "type": "Secondary",
        "Reason": {
          "Code": "203",
          "Name": "Can't afford"
        }
      },
      {
        "type": "Final",
        "Reason": {
          "Code": "204",
          "Name": "Downgrade"
        }
      }
    ]
  },
  {
    "WOnumber": "2147486937",
    "WOStatus": "Open",
    "CreatedBy": {
      "Code": "CSD",
      "Name": "Mark Lawman"
    },
    "CreatedWhen": "string",
    "WOType": {
      "Code": "COS",
      "Name": "Change of Service",
      "BaseType": {
        "Code": "COS",
        "Name": "Change of Service"
      }
    },
    "ScheduledDate": "string",
    "ScheduledPeriod": {
      "Period": 354,
      "PeriodStart": "2020-10-30T12:00:00.000Z",
      "PeriodEnd": "2020-10-30T17:00:00.000Z",
      "PeriodDescription": "12PM-5PM"
    },
    "Technician": {
      "Code": "1VD",
      "Name": "John Black"
    },
    "ClosedBy": {
      "Code": "CSD",
      "Name": "Mark Lawman"
    },
    "Reasons": [
      {
        "type": "Initial",
        "Reason": {
          "Code": "201",
          "Name": "Too expensive"
        }
      },
      {
        "type": "Secondary",
        "Reason": {
          "Code": "202",
          "Name": "Slow Speed"
        }
      },
      {
        "type": "Secondary",
        "Reason": {
          "Code": "203",
          "Name": "Can't afford"
        }
      },
      {
        "type": "Final",
        "Reason": {
          "Code": "204",
          "Name": "Downgrade"
        }
      }
    ]
  },
  {
    "WOnumber": "2147486937",
    "WOStatus": "Open",
    "CreatedBy": {
      "Code": "CSD",
      "Name": "Mark Lawman"
    },
    "CreatedWhen": "string",
    "WOType": {
      "Code": "COS",
      "Name": "Change of Service",
      "BaseType": {
        "Code": "COS",
        "Name": "Change of Service"
      }
    },
    "ScheduledDate": "string",
    "ScheduledPeriod": {
      "Period": 354,
      "PeriodStart": "2020-10-30T12:00:00.000Z",
      "PeriodEnd": "2020-10-30T17:00:00.000Z",
      "PeriodDescription": "12PM-5PM"
    },
    "Technician": {
      "Code": "1VD",
      "Name": "John Black"
    },
    "ClosedBy": {
      "Code": "CSD",
      "Name": "Mark Lawman"
    },
    "Reasons": [
      {
        "type": "Initial",
        "Reason": {
          "Code": "201",
          "Name": "Too expensive"
        }
      },
      {
        "type": "Secondary",
        "Reason": {
          "Code": "202",
          "Name": "Slow Speed"
        }
      },
      {
        "type": "Secondary",
        "Reason": {
          "Code": "203",
          "Name": "Can't afford"
        }
      },
      {
        "type": "Final",
        "Reason": {
          "Code": "204",
          "Name": "Downgrade"
        }
      }
    ]
  }
]