{
  "$id": "schema.json",
  "type": "object",
  "schema": "http://json-schema.org/draft-07/schema#",
  "translate": true,
  "dynamicfields": true,
  "properties": {
    "ph_request_type": {
      "type": "string",
      "description": "type of request (internal to adapter)",
      "default": "subscriberLookup",
      "enum": [
        "subscriberLookup",
        "getSubscriber",
        "getBalance",
        "getSubBucketBalances",
        "getSubscriberPackages",
        "getSIS",
        "getSubscriberPackageSummary",
        "getLastSubscriberTransactions"
      ],
      "external_name": "ph_request_type"
    },
    "externalID": {
      "type": "string",
      "description": "External ID",
      "parse": false,
      "encode": false,
      "encrypt": {
        "type": "AES",
        "key": ""
      },
      "external_name": "ExternalID"
    },
    "phoneNumber": {
      "type": "string",
      "description": "Unformated phone number without country code",
      "parse": false,
      "encode": false,
      "encrypt": {
        "type": "AES",
        "key": ""
      },
      "external_name": "PhoneNumber"
    },
    "dL": {
      "type": "string",
      "description": "Driver&#39;s license",
      "parse": false,
      "encode": false,
      "encrypt": {
        "type": "AES",
        "key": ""
      },
      "external_name": "DL"
    },
    "sSN": {
      "type": "string",
      "description": "Social security number",
      "parse": false,
      "encode": false,
      "encrypt": {
        "type": "AES",
        "key": ""
      },
      "external_name": "SSN"
    },
    "lookupCode": {
      "type": "string",
      "description": "PPV Lookup Code, unique per subscriber record",
      "parse": false,
      "encode": false,
      "encrypt": {
        "type": "AES",
        "key": ""
      },
      "external_name": "LookupCode"
    },
    "aCCOUNT": {
      "type": "string",
      "description": "Subscriber Account #",
      "parse": false,
      "encode": false,
      "encrypt": {
        "type": "AES",
        "key": ""
      },
      "external_name": "ACCOUNT"
    },
    "x": {
      "type": "number",
      "description": "Last X transactions",
      "parse": false,
      "encode": false,
      "encrypt": {
        "type": "AES",
        "key": ""
      },
      "external_name": "X"
    }
  },
  "definitions": {}
}