{
  "errors": [],
  "statistics": [
    {
      "owner": "errorJson",
      "description": "New adapter errors available for use",
      "value": 1
    },
    {
      "owner": "errorJson",
      "description": "Adapter errors no longer available for use",
      "value": 0
    },
    {
      "owner": "errorJson",
      "description": "Adapter errors that have been updated (e.g. recommendation changes)",
      "value": 30
    },
    {
      "owner": "packageJson",
      "description": "Number of production dependencies",
      "value": 14
    },
    {
      "owner": "packageJson",
      "description": "Number of development dependencies",
      "value": 7
    },
    {
      "owner": "packageJson",
      "description": "Number of npm scripts",
      "value": 22
    },
    {
      "owner": "packageJson",
      "description": "Runtime Library dependency",
      "value": "^4.45.4"
    },
    {
      "owner": "propertiesSchemaJson",
      "description": "Adapter properties defined in the propertiesSchema file",
      "value": 70
    },
    {
      "owner": "markdown",
      "description": "Number of lines in the README.md",
      "value": 338
    },
    {
      "owner": "markdown",
      "description": "Number of lines in the SUMMARY.md",
      "value": 9
    },
    {
      "owner": "markdown",
      "description": "Number of lines in the PROPERTIES.md",
      "value": 642
    },
    {
      "owner": "markdown",
      "description": "Number of lines in the TROUBLESHOOT.md",
      "value": 48
    },
    {
      "owner": "markdown",
      "description": "Number of lines in the ENHANCE.md",
      "value": 70
    },
    {
      "owner": "markdown",
      "description": "Number of lines in the BROKER.md",
      "value": 70
    },
    {
      "owner": "unitTestJS",
      "description": "Number of lines of code in unit tests",
      "value": 4926
    },
    {
      "owner": "unitTestJS",
      "description": "Number of unit tests",
      "value": 308
    },
    {
      "owner": "integrationTestJS",
      "description": "Number of lines of code in integration tests",
      "value": 3901
    },
    {
      "owner": "integrationTestJS",
      "description": "Number of integration tests",
      "value": 140
    },
    {
      "owner": "staticFile",
      "description": "Number of lines of code in adapterBase.js",
      "value": 1783
    },
    {
      "owner": "staticFile",
      "description": "Number of static files added",
      "value": 36
    },
    {
      "owner": "Overall",
      "description": "Total lines of Code",
      "value": 10610
    },
    {
      "owner": "Overall",
      "description": "Total Tests",
      "value": 448
    },
    {
      "owner": "Overall",
      "description": "Total Files",
      "value": 6
    }
  ]
}