{
  "$id": "schema.json",
  "type": "object",
  "schema": "http://json-schema.org/draft-07/schema#",
  "translate": true,
  "dynamicfields": true,
  "properties": {
    "ph_request_type": {
      "type": "string",
      "description": "type of request (internal to adapter)",
      "default": "simpleUiHttpHandlersImageDefinitionsForNdIdGet",
      "enum": [
        "simpleUiHttpHandlersImageDefinitionsForNdIdGet",
        "simpleUiHttpHandlersImageDefinitionDropfolderListGet",
        "simpleUiHttpHandlersImageDefinitionsList",
        "simpleUiHttpHandlersImageDefinitionsPost",
        "simpleUiHttpHandlersImageDefinitionsPut",
        "simpleUiHttpHandlersImageDefinitionsGet",
        "simpleUiHttpHandlersImageDefinitionsDelete",
        "simpleUiHttpHandlersDiskImageUpload",
        "simpleUiHttpHandlersImageDefinitionDropfolderRemove"
      ],
      "external_name": "ph_request_type"
    },
    "defId": {
      "type": "string",
      "description": "ID of the requested Image Definition",
      "parse": false,
      "encode": false,
      "encrypt": {
        "type": "AES",
        "key": ""
      },
      "external_name": "def_id"
    }
  },
  "definitions": {}
}