{
  "actions": [
    {
      "name": "getUsers",
      "protocol": "REST",
      "method": "GET",
      "entitypath": "{base_path}/{version}/users?{query}",
      "requestSchema": "schema.json",
      "responseSchema": "schema.json",
      "timeout": 0,
      "sendEmpty": false,
      "sendGetBody": false,
      "requestDatatype": "JSON",
      "responseDatatype": "JSON",
      "headers": {},
      "responseObjects": [
        {
          "type": "default",
          "key": "",
          "mockFile": "mockdatafiles/getUsers-default.json"
        }
      ]
    },
    {
      "name": "postUser",
      "protocol": "REST",
      "method": "POST",
      "entitypath": "{base_path}/{version}/users?{query}",
      "requestSchema": "schema.json",
      "responseSchema": "schema.json",
      "timeout": 0,
      "sendEmpty": false,
      "requestDatatype": "JSON",
      "responseDatatype": "JSON",
      "headers": {},
      "responseObjects": [
        {
          "type": "default",
          "key": "",
          "mockFile": "mockdatafiles/postUser-default.json"
        }
      ]
    },
    {
      "name": "getUser",
      "protocol": "REST",
      "method": "GET",
      "entitypath": "{base_path}/{version}/users/{pathv1}?{query}",
      "requestSchema": "schema.json",
      "responseSchema": "schema.json",
      "timeout": 0,
      "sendEmpty": false,
      "sendGetBody": false,
      "requestDatatype": "JSON",
      "responseDatatype": "JSON",
      "headers": {},
      "responseObjects": [
        {
          "type": "default",
          "key": "",
          "mockFile": "mockdatafiles/getUser-default.json"
        }
      ]
    },
    {
      "name": "patchUser",
      "protocol": "REST",
      "method": "PATCH",
      "entitypath": "{base_path}/{version}/users/{pathv1}?{query}",
      "requestSchema": "schema.json",
      "responseSchema": "schema.json",
      "timeout": 0,
      "sendEmpty": false,
      "requestDatatype": "JSON",
      "responseDatatype": "JSON",
      "headers": {},
      "responseObjects": [
        {
          "type": "default",
          "key": "",
          "mockFile": "mockdatafiles/patchUser-default.json"
        }
      ]
    },
    {
      "name": "deleteUser",
      "protocol": "REST",
      "method": "DELETE",
      "entitypath": "{base_path}/{version}/users/{pathv1}?{query}",
      "requestSchema": "schema.json",
      "responseSchema": "schema.json",
      "timeout": 0,
      "sendEmpty": false,
      "requestDatatype": "JSON",
      "responseDatatype": "JSON",
      "headers": {},
      "responseObjects": [
        {
          "type": "default",
          "key": "",
          "mockFile": ""
        }
      ]
    }
  ]
}