{
  "pools": [
    {
      "name": "string",
      "slots": 2,
      "occupied_slots": 8,
      "used_slots": 4,
      "queued_slots": 5,
      "open_slots": 5
    },
    {
      "name": "string",
      "slots": 1,
      "occupied_slots": 7,
      "used_slots": 7,
      "queued_slots": 4,
      "open_slots": 4
    },
    {
      "name": "string",
      "slots": 3,
      "occupied_slots": 3,
      "used_slots": 10,
      "queued_slots": 1,
      "open_slots": 4
    },
    {
      "name": "string",
      "slots": 10,
      "occupied_slots": 7,
      "used_slots": 9,
      "queued_slots": 7,
      "open_slots": 5
    },
    {
      "name": "string",
      "slots": 7,
      "occupied_slots": 8,
      "used_slots": 8,
      "queued_slots": 4,
      "open_slots": 9
    },
    {
      "name": "string",
      "slots": 6,
      "occupied_slots": 6,
      "used_slots": 4,
      "queued_slots": 1,
      "open_slots": 7
    },
    {
      "name": "string",
      "slots": 2,
      "occupied_slots": 1,
      "used_slots": 9,
      "queued_slots": 8,
      "open_slots": 6
    },
    {
      "name": "string",
      "slots": 9,
      "occupied_slots": 2,
      "used_slots": 10,
      "queued_slots": 7,
      "open_slots": 2
    },
    {
      "name": "string",
      "slots": 5,
      "occupied_slots": 5,
      "used_slots": 4,
      "queued_slots": 4,
      "open_slots": 1
    },
    {
      "name": "string",
      "slots": 6,
      "occupied_slots": 4,
      "used_slots": 7,
      "queued_slots": 4,
      "open_slots": 4
    }
  ],
  "total_entries": 7
}