{
  "extra_links": [
    {
      "class_ref": {
        "module_path": "string",
        "class_name": "string"
      },
      "name": "string",
      "href": "string"
    },
    {
      "class_ref": {
        "module_path": "string",
        "class_name": "string"
      },
      "name": "string",
      "href": "string"
    }
  ]
}