{
  "actions": [
    {
      "name": "getRoles",
      "protocol": "REST",
      "method": "GET",
      "entitypath": "{base_path}/{version}/roles?{query}",
      "requestSchema": "schema.json",
      "responseSchema": "schema.json",
      "timeout": 0,
      "sendEmpty": false,
      "sendGetBody": false,
      "requestDatatype": "JSON",
      "responseDatatype": "JSON",
      "headers": {},
      "responseObjects": [
        {
          "type": "default",
          "key": "",
          "mockFile": "mockdatafiles/getRoles-default.json"
        }
      ]
    },
    {
      "name": "postRole",
      "protocol": "REST",
      "method": "POST",
      "entitypath": "{base_path}/{version}/roles?{query}",
      "requestSchema": "schema.json",
      "responseSchema": "schema.json",
      "timeout": 0,
      "sendEmpty": false,
      "requestDatatype": "JSON",
      "responseDatatype": "JSON",
      "headers": {},
      "responseObjects": [
        {
          "type": "default",
          "key": "",
          "mockFile": "mockdatafiles/postRole-default.json"
        }
      ]
    },
    {
      "name": "getRole",
      "protocol": "REST",
      "method": "GET",
      "entitypath": "{base_path}/{version}/roles/{pathv1}?{query}",
      "requestSchema": "schema.json",
      "responseSchema": "schema.json",
      "timeout": 0,
      "sendEmpty": false,
      "sendGetBody": false,
      "requestDatatype": "JSON",
      "responseDatatype": "JSON",
      "headers": {},
      "responseObjects": [
        {
          "type": "default",
          "key": "",
          "mockFile": "mockdatafiles/getRole-default.json"
        }
      ]
    },
    {
      "name": "patchRole",
      "protocol": "REST",
      "method": "PATCH",
      "entitypath": "{base_path}/{version}/roles/{pathv1}?{query}",
      "requestSchema": "schema.json",
      "responseSchema": "schema.json",
      "timeout": 0,
      "sendEmpty": false,
      "requestDatatype": "JSON",
      "responseDatatype": "JSON",
      "headers": {},
      "responseObjects": [
        {
          "type": "default",
          "key": "",
          "mockFile": "mockdatafiles/patchRole-default.json"
        }
      ]
    },
    {
      "name": "deleteRole",
      "protocol": "REST",
      "method": "DELETE",
      "entitypath": "{base_path}/{version}/roles/{pathv1}?{query}",
      "requestSchema": "schema.json",
      "responseSchema": "schema.json",
      "timeout": 0,
      "sendEmpty": false,
      "requestDatatype": "JSON",
      "responseDatatype": "JSON",
      "headers": {},
      "responseObjects": [
        {
          "type": "default",
          "key": "",
          "mockFile": ""
        }
      ]
    }
  ]
}