[
  {
    "id": 84,
    "name": "Bind Auth Appliance Template",
    "server_type_id": 128,
    "server_type_code": "BIND AUTH",
    "email_id": "Stephen.martin@gmail.com",
    "enable_dnstap": true,
    "enable_dynamic_updates": true,
    "created_by": 2017,
    "created_by_name": "Stephen",
    "created_time": "3/18/2016 3:39",
    "updated_by": 2019,
    "updated_by_name": "John",
    "updated_time": "3/18/2016 4:37",
    "description": "DNS Appliance Template for BIND Auth Appliance type.",
    "acls": "1.0.0.0, 2.0.0.0, any",
    "algos": "[(bitSize: 512, code: \"HMAC-SHA512\", dnssec :false, id: 24, mandatory: false, max: 512, min: 1)]",
    "loggers": "category: default, channel: queries",
    "new_name": "BIND CACHE Appliance Template",
    "forwarders": [
      {
        "id": 121,
        "name": "Google",
        "description": "Google Forwarders",
        "created_by": "raina",
        "cretaed_time": "3/18/2016 3:39",
        "updated_by": "raina",
        "updated_time": "3/18/2016 4:37"
      },
      {
        "id": 121,
        "name": "Google",
        "description": "Google Forwarders",
        "created_by": "raina",
        "cretaed_time": "3/18/2016 3:39",
        "updated_by": "raina",
        "updated_time": "3/18/2016 4:37"
      }
    ],
    "addedforwarders": [
      {
        "id": 121,
        "name": "Google",
        "description": "Google Forwarders",
        "created_by": "raina",
        "cretaed_time": "3/18/2016 3:39",
        "updated_by": "raina",
        "updated_time": "3/18/2016 4:37"
      }
    ],
    "deletedforwarders": [
      {
        "id": 121,
        "name": "Google",
        "description": "Google Forwarders",
        "created_by": "raina",
        "cretaed_time": "3/18/2016 3:39",
        "updated_by": "raina",
        "updated_time": "3/18/2016 4:37"
      },
      {
        "id": 121,
        "name": "Google",
        "description": "Google Forwarders",
        "created_by": "raina",
        "cretaed_time": "3/18/2016 3:39",
        "updated_by": "raina",
        "updated_time": "3/18/2016 4:37"
      },
      {
        "id": 121,
        "name": "Google",
        "description": "Google Forwarders",
        "created_by": "raina",
        "cretaed_time": "3/18/2016 3:39",
        "updated_by": "raina",
        "updated_time": "3/18/2016 4:37"
      },
      {
        "id": 121,
        "name": "Google",
        "description": "Google Forwarders",
        "created_by": "raina",
        "cretaed_time": "3/18/2016 3:39",
        "updated_by": "raina",
        "updated_time": "3/18/2016 4:37"
      },
      {
        "id": 121,
        "name": "Google",
        "description": "Google Forwarders",
        "created_by": "raina",
        "cretaed_time": "3/18/2016 3:39",
        "updated_by": "raina",
        "updated_time": "3/18/2016 4:37"
      },
      {
        "id": 121,
        "name": "Google",
        "description": "Google Forwarders",
        "created_by": "raina",
        "cretaed_time": "3/18/2016 3:39",
        "updated_by": "raina",
        "updated_time": "3/18/2016 4:37"
      },
      {
        "id": 121,
        "name": "Google",
        "description": "Google Forwarders",
        "created_by": "raina",
        "cretaed_time": "3/18/2016 3:39",
        "updated_by": "raina",
        "updated_time": "3/18/2016 4:37"
      },
      {
        "id": 121,
        "name": "Google",
        "description": "Google Forwarders",
        "created_by": "raina",
        "cretaed_time": "3/18/2016 3:39",
        "updated_by": "raina",
        "updated_time": "3/18/2016 4:37"
      },
      {
        "id": 121,
        "name": "Google",
        "description": "Google Forwarders",
        "created_by": "raina",
        "cretaed_time": "3/18/2016 3:39",
        "updated_by": "raina",
        "updated_time": "3/18/2016 4:37"
      }
    ],
    "updated_time_string": "3/18/2016 4:37",
    "created_time_string": "3/18/2016 3:39",
    "created_by_login_name": "Stephen",
    "updated_by_login_name": "John"
  },
  {
    "id": 84,
    "name": "Bind Auth Appliance Template",
    "server_type_id": 128,
    "server_type_code": "BIND AUTH",
    "email_id": "Stephen.martin@gmail.com",
    "enable_dnstap": true,
    "enable_dynamic_updates": true,
    "created_by": 2017,
    "created_by_name": "Stephen",
    "created_time": "3/18/2016 3:39",
    "updated_by": 2019,
    "updated_by_name": "John",
    "updated_time": "3/18/2016 4:37",
    "description": "DNS Appliance Template for BIND Auth Appliance type.",
    "acls": "1.0.0.0, 2.0.0.0, any",
    "algos": "[(bitSize: 512, code: \"HMAC-SHA512\", dnssec :false, id: 24, mandatory: false, max: 512, min: 1)]",
    "loggers": "category: default, channel: queries",
    "new_name": "BIND CACHE Appliance Template",
    "forwarders": [
      {
        "id": 121,
        "name": "Google",
        "description": "Google Forwarders",
        "created_by": "raina",
        "cretaed_time": "3/18/2016 3:39",
        "updated_by": "raina",
        "updated_time": "3/18/2016 4:37"
      },
      {
        "id": 121,
        "name": "Google",
        "description": "Google Forwarders",
        "created_by": "raina",
        "cretaed_time": "3/18/2016 3:39",
        "updated_by": "raina",
        "updated_time": "3/18/2016 4:37"
      },
      {
        "id": 121,
        "name": "Google",
        "description": "Google Forwarders",
        "created_by": "raina",
        "cretaed_time": "3/18/2016 3:39",
        "updated_by": "raina",
        "updated_time": "3/18/2016 4:37"
      },
      {
        "id": 121,
        "name": "Google",
        "description": "Google Forwarders",
        "created_by": "raina",
        "cretaed_time": "3/18/2016 3:39",
        "updated_by": "raina",
        "updated_time": "3/18/2016 4:37"
      },
      {
        "id": 121,
        "name": "Google",
        "description": "Google Forwarders",
        "created_by": "raina",
        "cretaed_time": "3/18/2016 3:39",
        "updated_by": "raina",
        "updated_time": "3/18/2016 4:37"
      },
      {
        "id": 121,
        "name": "Google",
        "description": "Google Forwarders",
        "created_by": "raina",
        "cretaed_time": "3/18/2016 3:39",
        "updated_by": "raina",
        "updated_time": "3/18/2016 4:37"
      },
      {
        "id": 121,
        "name": "Google",
        "description": "Google Forwarders",
        "created_by": "raina",
        "cretaed_time": "3/18/2016 3:39",
        "updated_by": "raina",
        "updated_time": "3/18/2016 4:37"
      },
      {
        "id": 121,
        "name": "Google",
        "description": "Google Forwarders",
        "created_by": "raina",
        "cretaed_time": "3/18/2016 3:39",
        "updated_by": "raina",
        "updated_time": "3/18/2016 4:37"
      },
      {
        "id": 121,
        "name": "Google",
        "description": "Google Forwarders",
        "created_by": "raina",
        "cretaed_time": "3/18/2016 3:39",
        "updated_by": "raina",
        "updated_time": "3/18/2016 4:37"
      }
    ],
    "addedforwarders": [
      {
        "id": 121,
        "name": "Google",
        "description": "Google Forwarders",
        "created_by": "raina",
        "cretaed_time": "3/18/2016 3:39",
        "updated_by": "raina",
        "updated_time": "3/18/2016 4:37"
      },
      {
        "id": 121,
        "name": "Google",
        "description": "Google Forwarders",
        "created_by": "raina",
        "cretaed_time": "3/18/2016 3:39",
        "updated_by": "raina",
        "updated_time": "3/18/2016 4:37"
      },
      {
        "id": 121,
        "name": "Google",
        "description": "Google Forwarders",
        "created_by": "raina",
        "cretaed_time": "3/18/2016 3:39",
        "updated_by": "raina",
        "updated_time": "3/18/2016 4:37"
      },
      {
        "id": 121,
        "name": "Google",
        "description": "Google Forwarders",
        "created_by": "raina",
        "cretaed_time": "3/18/2016 3:39",
        "updated_by": "raina",
        "updated_time": "3/18/2016 4:37"
      },
      {
        "id": 121,
        "name": "Google",
        "description": "Google Forwarders",
        "created_by": "raina",
        "cretaed_time": "3/18/2016 3:39",
        "updated_by": "raina",
        "updated_time": "3/18/2016 4:37"
      },
      {
        "id": 121,
        "name": "Google",
        "description": "Google Forwarders",
        "created_by": "raina",
        "cretaed_time": "3/18/2016 3:39",
        "updated_by": "raina",
        "updated_time": "3/18/2016 4:37"
      },
      {
        "id": 121,
        "name": "Google",
        "description": "Google Forwarders",
        "created_by": "raina",
        "cretaed_time": "3/18/2016 3:39",
        "updated_by": "raina",
        "updated_time": "3/18/2016 4:37"
      },
      {
        "id": 121,
        "name": "Google",
        "description": "Google Forwarders",
        "created_by": "raina",
        "cretaed_time": "3/18/2016 3:39",
        "updated_by": "raina",
        "updated_time": "3/18/2016 4:37"
      },
      {
        "id": 121,
        "name": "Google",
        "description": "Google Forwarders",
        "created_by": "raina",
        "cretaed_time": "3/18/2016 3:39",
        "updated_by": "raina",
        "updated_time": "3/18/2016 4:37"
      },
      {
        "id": 121,
        "name": "Google",
        "description": "Google Forwarders",
        "created_by": "raina",
        "cretaed_time": "3/18/2016 3:39",
        "updated_by": "raina",
        "updated_time": "3/18/2016 4:37"
      }
    ],
    "deletedforwarders": [
      {
        "id": 121,
        "name": "Google",
        "description": "Google Forwarders",
        "created_by": "raina",
        "cretaed_time": "3/18/2016 3:39",
        "updated_by": "raina",
        "updated_time": "3/18/2016 4:37"
      },
      {
        "id": 121,
        "name": "Google",
        "description": "Google Forwarders",
        "created_by": "raina",
        "cretaed_time": "3/18/2016 3:39",
        "updated_by": "raina",
        "updated_time": "3/18/2016 4:37"
      },
      {
        "id": 121,
        "name": "Google",
        "description": "Google Forwarders",
        "created_by": "raina",
        "cretaed_time": "3/18/2016 3:39",
        "updated_by": "raina",
        "updated_time": "3/18/2016 4:37"
      },
      {
        "id": 121,
        "name": "Google",
        "description": "Google Forwarders",
        "created_by": "raina",
        "cretaed_time": "3/18/2016 3:39",
        "updated_by": "raina",
        "updated_time": "3/18/2016 4:37"
      },
      {
        "id": 121,
        "name": "Google",
        "description": "Google Forwarders",
        "created_by": "raina",
        "cretaed_time": "3/18/2016 3:39",
        "updated_by": "raina",
        "updated_time": "3/18/2016 4:37"
      }
    ],
    "updated_time_string": "3/18/2016 4:37",
    "created_time_string": "3/18/2016 3:39",
    "created_by_login_name": "Stephen",
    "updated_by_login_name": "John"
  }
]