{
  "id": 7,
  "organization_id": 2,
  "organization_name": "string",
  "first_name": "string",
  "last_name": "string",
  "middle_name": "string",
  "email_id": "string",
  "phone_num": "string",
  "full_name": "string",
  "old_first_name": "string",
  "old_last_name": "string",
  "old_middle_name": "string",
  "old_email_id": "string",
  "roles": "string",
  "updated_by_name": "string",
  "created_by_name": "string",
  "updated_time_string": "string",
  "created_time_string": "string"
}