[
  {
    "total_objects_added": 5,
    "total_objects_deleted": 8,
    "static_objects_added": 7,
    "static_objects_deleted": 2,
    "dynamic_objects_added": 10,
    "dynamic_objects_deleted": 4,
    "date": "3/18/2019",
    "count": 10,
    "day_count": 3
  }
]