{
  "$id": "schema.json",
  "type": "object",
  "schema": "http://json-schema.org/draft-07/schema#",
  "translate": false,
  "dynamicfields": true,
  "properties": {
    "ph_request_type": {
      "type": "string",
      "description": "type of request (internal to adapter)",
      "default": "getServerDebugSetting",
      "enum": [
        "getServerDebugSetting",
        "getServerGetProcessorsCount",
        "getConfigForClone",
        "getAllServerAddresses",
        "getIPDetails",
        "sameSubnetCheck",
        "isDNSDHCP",
        "getDuplexSetting",
        "getRtTables",
        "getRoutes",
        "getAttachedNICs",
        "dnsTunnelDetection",
        "getPatchHistory",
        "syncNics",
        "changeRemoteNIC",
        "getServerGet"
      ],
      "external_name": "ph_request_type"
    }
  },
  "definitions": {}
}