{
  "recordsTotal": 40,
  "recordsFiltered": 40,
  "data": [
    {
      "start_time": "3/15/2019 10:29:03",
      "host_name": "dhcp-appliance-2.test.com. ",
      "host_address": "196.168.10.101",
      "host_type": "DHCP",
      "output": "CRITICAL - Secure communication between the IPAM and the remote appliance is not functional. ",
      "status": 5
    },
    {
      "start_time": "3/15/2019 10:29:03",
      "host_name": "dhcp-appliance-2.test.com. ",
      "host_address": "196.168.10.101",
      "host_type": "DHCP",
      "output": "CRITICAL - Secure communication between the IPAM and the remote appliance is not functional. ",
      "status": 8
    },
    {
      "start_time": "3/15/2019 10:29:03",
      "host_name": "dhcp-appliance-2.test.com. ",
      "host_address": "196.168.10.101",
      "host_type": "DHCP",
      "output": "CRITICAL - Secure communication between the IPAM and the remote appliance is not functional. ",
      "status": 1
    },
    {
      "start_time": "3/15/2019 10:29:03",
      "host_name": "dhcp-appliance-2.test.com. ",
      "host_address": "196.168.10.101",
      "host_type": "DHCP",
      "output": "CRITICAL - Secure communication between the IPAM and the remote appliance is not functional. ",
      "status": 5
    },
    {
      "start_time": "3/15/2019 10:29:03",
      "host_name": "dhcp-appliance-2.test.com. ",
      "host_address": "196.168.10.101",
      "host_type": "DHCP",
      "output": "CRITICAL - Secure communication between the IPAM and the remote appliance is not functional. ",
      "status": 2
    },
    {
      "start_time": "3/15/2019 10:29:03",
      "host_name": "dhcp-appliance-2.test.com. ",
      "host_address": "196.168.10.101",
      "host_type": "DHCP",
      "output": "CRITICAL - Secure communication between the IPAM and the remote appliance is not functional. ",
      "status": 7
    },
    {
      "start_time": "3/15/2019 10:29:03",
      "host_name": "dhcp-appliance-2.test.com. ",
      "host_address": "196.168.10.101",
      "host_type": "DHCP",
      "output": "CRITICAL - Secure communication between the IPAM and the remote appliance is not functional. ",
      "status": 4
    },
    {
      "start_time": "3/15/2019 10:29:03",
      "host_name": "dhcp-appliance-2.test.com. ",
      "host_address": "196.168.10.101",
      "host_type": "DHCP",
      "output": "CRITICAL - Secure communication between the IPAM and the remote appliance is not functional. ",
      "status": 7
    },
    {
      "start_time": "3/15/2019 10:29:03",
      "host_name": "dhcp-appliance-2.test.com. ",
      "host_address": "196.168.10.101",
      "host_type": "DHCP",
      "output": "CRITICAL - Secure communication between the IPAM and the remote appliance is not functional. ",
      "status": 8
    },
    {
      "start_time": "3/15/2019 10:29:03",
      "host_name": "dhcp-appliance-2.test.com. ",
      "host_address": "196.168.10.101",
      "host_type": "DHCP",
      "output": "CRITICAL - Secure communication between the IPAM and the remote appliance is not functional. ",
      "status": 7
    }
  ]
}