{
  "id": 1,
  "name": "test_template1",
  "oldName": "test_template1",
  "organizationId": 1,
  "organizationName": "Internal",
  "primaryDomainId": 1,
  "primaryDomain": "tcpwave.com",
  "dhcpServerId": 1,
  "dhcpServerName": "DHCPAppliance1",
  "dhcpServerAddress": "192.0.0.32",
  "dhcpOptionTemplateId": 1,
  "dhcpOptionTemplateName": "Template1",
  "subnetType": 1,
  "cloudProviderId": 1,
  "cloudProvider": "testAWS",
  "routerOption": "first",
  "description": "string",
  "createdBy": 1234,
  "createdByUser": "admin",
  "createdTime": "3/18/2018 4:37",
  "updatedBy": 1234,
  "updatedByUser": "admin",
  "updatedTime": "3/18/2018 4:37",
  "contact_name": "string",
  "first_name": "string",
  "middle_name": "string",
  "last_name": "string",
  "contact_email_id": "string",
  "contact_id": 7,
  "location_name": "string",
  "street1": "string",
  "street2": "string",
  "city": "string",
  "state": "string",
  "country": "string",
  "zip": "string",
  "addressAllocationList": [
    {
      "id": 1,
      "startOffset": 10,
      "endOffset": 20,
      "v6StartOffset": 10,
      "v6EndOffset": 20,
      "classCodeId": 1,
      "classCode": "3G Phone",
      "allocationType": 1,
      "domainId": 1,
      "domain": "tcpwave.com",
      "clientClassAllowId": 1,
      "clientClassAllow": "ClientClass1",
      "clientClassDenyId": 1,
      "clientClassDeny": "ClientClass2",
      "userClassAllowId": 1,
      "userClassAllow": "Userclass1",
      "userClassDenyId": 1,
      "userClassDeny": "Userclass2",
      "vendorClassAllowId": 1,
      "vendorClassAllow": "vendorclass1",
      "vendorClassDenyId": 1,
      "vendorClassDeny": "vendorclass2",
      "ttl": 1200,
      "resExpiryDate": "3/18/2018 4:37"
    },
    {
      "id": 1,
      "startOffset": 10,
      "endOffset": 20,
      "v6StartOffset": 10,
      "v6EndOffset": 20,
      "classCodeId": 1,
      "classCode": "3G Phone",
      "allocationType": 1,
      "domainId": 1,
      "domain": "tcpwave.com",
      "clientClassAllowId": 1,
      "clientClassAllow": "ClientClass1",
      "clientClassDenyId": 1,
      "clientClassDeny": "ClientClass2",
      "userClassAllowId": 1,
      "userClassAllow": "Userclass1",
      "userClassDenyId": 1,
      "userClassDeny": "Userclass2",
      "vendorClassAllowId": 1,
      "vendorClassAllow": "vendorclass1",
      "vendorClassDenyId": 1,
      "vendorClassDeny": "vendorclass2",
      "ttl": 1200,
      "resExpiryDate": "3/18/2018 4:37"
    },
    {
      "id": 1,
      "startOffset": 10,
      "endOffset": 20,
      "v6StartOffset": 10,
      "v6EndOffset": 20,
      "classCodeId": 1,
      "classCode": "3G Phone",
      "allocationType": 1,
      "domainId": 1,
      "domain": "tcpwave.com",
      "clientClassAllowId": 1,
      "clientClassAllow": "ClientClass1",
      "clientClassDenyId": 1,
      "clientClassDeny": "ClientClass2",
      "userClassAllowId": 1,
      "userClassAllow": "Userclass1",
      "userClassDenyId": 1,
      "userClassDeny": "Userclass2",
      "vendorClassAllowId": 1,
      "vendorClassAllow": "vendorclass1",
      "vendorClassDenyId": 1,
      "vendorClassDeny": "vendorclass2",
      "ttl": 1200,
      "resExpiryDate": "3/18/2018 4:37"
    },
    {
      "id": 1,
      "startOffset": 10,
      "endOffset": 20,
      "v6StartOffset": 10,
      "v6EndOffset": 20,
      "classCodeId": 1,
      "classCode": "3G Phone",
      "allocationType": 1,
      "domainId": 1,
      "domain": "tcpwave.com",
      "clientClassAllowId": 1,
      "clientClassAllow": "ClientClass1",
      "clientClassDenyId": 1,
      "clientClassDeny": "ClientClass2",
      "userClassAllowId": 1,
      "userClassAllow": "Userclass1",
      "userClassDenyId": 1,
      "userClassDeny": "Userclass2",
      "vendorClassAllowId": 1,
      "vendorClassAllow": "vendorclass1",
      "vendorClassDenyId": 1,
      "vendorClassDeny": "vendorclass2",
      "ttl": 1200,
      "resExpiryDate": "3/18/2018 4:37"
    },
    {
      "id": 1,
      "startOffset": 10,
      "endOffset": 20,
      "v6StartOffset": 10,
      "v6EndOffset": 20,
      "classCodeId": 1,
      "classCode": "3G Phone",
      "allocationType": 1,
      "domainId": 1,
      "domain": "tcpwave.com",
      "clientClassAllowId": 1,
      "clientClassAllow": "ClientClass1",
      "clientClassDenyId": 1,
      "clientClassDeny": "ClientClass2",
      "userClassAllowId": 1,
      "userClassAllow": "Userclass1",
      "userClassDenyId": 1,
      "userClassDeny": "Userclass2",
      "vendorClassAllowId": 1,
      "vendorClassAllow": "vendorclass1",
      "vendorClassDenyId": 1,
      "vendorClassDeny": "vendorclass2",
      "ttl": 1200,
      "resExpiryDate": "3/18/2018 4:37"
    }
  ]
}