{
  "total": 20,
  "recordsTotal": 40,
  "recordsFiltered": 40,
  "data": [
    {
      "id": 1,
      "name": "string",
      "description": "string",
      "mask_length": 8,
      "network_id": 5,
      "network_name": "string",
      "network_address": "string",
      "subnet_group_id": 9,
      "subnet_group_name": "string",
      "contact_id": 10,
      "first_name": "string",
      "last_name": "string",
      "email_id": "string",
      "organization_id": 9,
      "organization_name": "string",
      "location_id": 8,
      "location_name": "string",
      "street1": "string",
      "street2": "string",
      "city": "string",
      "state": "string",
      "country": "spain",
      "zip": "string",
      "template_id": 6,
      "template_name": "string",
      "primary_domain": "string",
      "domains": [
        "string",
        "string",
        "string",
        "string",
        "string",
        "string",
        "string",
        "string",
        "string"
      ],
      "primary_dhcp_server": "string",
      "router_name": "string",
      "routerAddress": "string",
      "router_option": "string",
      "percent_full": 5,
      "object_count": 1,
      "created_time": "string",
      "updated_time": "string",
      "vlan_id": "string",
      "subnet_template": "testTemplate1",
      "primary_dhcp_server_address": "20182018000000000000000000000020",
      "v4_primary_dhcp_server_address": "192.168.0.145",
      "created_by_name": "Stephen",
      "updated_by_name": "John",
      "updated_time_string": "string",
      "created_time_string": "string"
    },
    {
      "id": 7,
      "name": "string",
      "description": "string",
      "mask_length": 7,
      "network_id": 8,
      "network_name": "string",
      "network_address": "string",
      "subnet_group_id": 2,
      "subnet_group_name": "string",
      "contact_id": 2,
      "first_name": "string",
      "last_name": "string",
      "email_id": "string",
      "organization_id": 4,
      "organization_name": "string",
      "location_id": 6,
      "location_name": "string",
      "street1": "string",
      "street2": "string",
      "city": "string",
      "state": "string",
      "country": "spain",
      "zip": "string",
      "template_id": 6,
      "template_name": "string",
      "primary_domain": "string",
      "domains": [
        "string",
        "string",
        "string",
        "string",
        "string",
        "string",
        "string",
        "string",
        "string"
      ],
      "primary_dhcp_server": "string",
      "router_name": "string",
      "routerAddress": "string",
      "router_option": "string",
      "percent_full": 4,
      "object_count": 6,
      "created_time": "string",
      "updated_time": "string",
      "vlan_id": "string",
      "subnet_template": "testTemplate1",
      "primary_dhcp_server_address": "20182018000000000000000000000020",
      "v4_primary_dhcp_server_address": "192.168.0.145",
      "created_by_name": "Stephen",
      "updated_by_name": "John",
      "updated_time_string": "string",
      "created_time_string": "string"
    },
    {
      "id": 7,
      "name": "string",
      "description": "string",
      "mask_length": 8,
      "network_id": 5,
      "network_name": "string",
      "network_address": "string",
      "subnet_group_id": 3,
      "subnet_group_name": "string",
      "contact_id": 3,
      "first_name": "string",
      "last_name": "string",
      "email_id": "string",
      "organization_id": 3,
      "organization_name": "string",
      "location_id": 4,
      "location_name": "string",
      "street1": "string",
      "street2": "string",
      "city": "string",
      "state": "string",
      "country": "spain",
      "zip": "string",
      "template_id": 1,
      "template_name": "string",
      "primary_domain": "string",
      "domains": [
        "string",
        "string",
        "string",
        "string",
        "string",
        "string",
        "string"
      ],
      "primary_dhcp_server": "string",
      "router_name": "string",
      "routerAddress": "string",
      "router_option": "string",
      "percent_full": 5,
      "object_count": 4,
      "created_time": "string",
      "updated_time": "string",
      "vlan_id": "string",
      "subnet_template": "testTemplate1",
      "primary_dhcp_server_address": "20182018000000000000000000000020",
      "v4_primary_dhcp_server_address": "192.168.0.145",
      "created_by_name": "Stephen",
      "updated_by_name": "John",
      "updated_time_string": "string",
      "created_time_string": "string"
    },
    {
      "id": 7,
      "name": "string",
      "description": "string",
      "mask_length": 1,
      "network_id": 4,
      "network_name": "string",
      "network_address": "string",
      "subnet_group_id": 1,
      "subnet_group_name": "string",
      "contact_id": 6,
      "first_name": "string",
      "last_name": "string",
      "email_id": "string",
      "organization_id": 4,
      "organization_name": "string",
      "location_id": 5,
      "location_name": "string",
      "street1": "string",
      "street2": "string",
      "city": "string",
      "state": "string",
      "country": "spain",
      "zip": "string",
      "template_id": 4,
      "template_name": "string",
      "primary_domain": "string",
      "domains": [
        "string",
        "string",
        "string",
        "string",
        "string",
        "string",
        "string",
        "string",
        "string"
      ],
      "primary_dhcp_server": "string",
      "router_name": "string",
      "routerAddress": "string",
      "router_option": "string",
      "percent_full": 5,
      "object_count": 5,
      "created_time": "string",
      "updated_time": "string",
      "vlan_id": "string",
      "subnet_template": "testTemplate1",
      "primary_dhcp_server_address": "20182018000000000000000000000020",
      "v4_primary_dhcp_server_address": "192.168.0.145",
      "created_by_name": "Stephen",
      "updated_by_name": "John",
      "updated_time_string": "string",
      "created_time_string": "string"
    },
    {
      "id": 4,
      "name": "string",
      "description": "string",
      "mask_length": 10,
      "network_id": 1,
      "network_name": "string",
      "network_address": "string",
      "subnet_group_id": 5,
      "subnet_group_name": "string",
      "contact_id": 4,
      "first_name": "string",
      "last_name": "string",
      "email_id": "string",
      "organization_id": 3,
      "organization_name": "string",
      "location_id": 5,
      "location_name": "string",
      "street1": "string",
      "street2": "string",
      "city": "string",
      "state": "string",
      "country": "spain",
      "zip": "string",
      "template_id": 7,
      "template_name": "string",
      "primary_domain": "string",
      "domains": [
        "string",
        "string"
      ],
      "primary_dhcp_server": "string",
      "router_name": "string",
      "routerAddress": "string",
      "router_option": "string",
      "percent_full": 1,
      "object_count": 5,
      "created_time": "string",
      "updated_time": "string",
      "vlan_id": "string",
      "subnet_template": "testTemplate1",
      "primary_dhcp_server_address": "20182018000000000000000000000020",
      "v4_primary_dhcp_server_address": "192.168.0.145",
      "created_by_name": "Stephen",
      "updated_by_name": "John",
      "updated_time_string": "string",
      "created_time_string": "string"
    },
    {
      "id": 1,
      "name": "string",
      "description": "string",
      "mask_length": 7,
      "network_id": 4,
      "network_name": "string",
      "network_address": "string",
      "subnet_group_id": 6,
      "subnet_group_name": "string",
      "contact_id": 2,
      "first_name": "string",
      "last_name": "string",
      "email_id": "string",
      "organization_id": 5,
      "organization_name": "string",
      "location_id": 9,
      "location_name": "string",
      "street1": "string",
      "street2": "string",
      "city": "string",
      "state": "string",
      "country": "spain",
      "zip": "string",
      "template_id": 9,
      "template_name": "string",
      "primary_domain": "string",
      "domains": [
        "string",
        "string"
      ],
      "primary_dhcp_server": "string",
      "router_name": "string",
      "routerAddress": "string",
      "router_option": "string",
      "percent_full": 6,
      "object_count": 4,
      "created_time": "string",
      "updated_time": "string",
      "vlan_id": "string",
      "subnet_template": "testTemplate1",
      "primary_dhcp_server_address": "20182018000000000000000000000020",
      "v4_primary_dhcp_server_address": "192.168.0.145",
      "created_by_name": "Stephen",
      "updated_by_name": "John",
      "updated_time_string": "string",
      "created_time_string": "string"
    },
    {
      "id": 8,
      "name": "string",
      "description": "string",
      "mask_length": 2,
      "network_id": 1,
      "network_name": "string",
      "network_address": "string",
      "subnet_group_id": 8,
      "subnet_group_name": "string",
      "contact_id": 10,
      "first_name": "string",
      "last_name": "string",
      "email_id": "string",
      "organization_id": 4,
      "organization_name": "string",
      "location_id": 6,
      "location_name": "string",
      "street1": "string",
      "street2": "string",
      "city": "string",
      "state": "string",
      "country": "spain",
      "zip": "string",
      "template_id": 1,
      "template_name": "string",
      "primary_domain": "string",
      "domains": [
        "string",
        "string",
        "string",
        "string"
      ],
      "primary_dhcp_server": "string",
      "router_name": "string",
      "routerAddress": "string",
      "router_option": "string",
      "percent_full": 10,
      "object_count": 8,
      "created_time": "string",
      "updated_time": "string",
      "vlan_id": "string",
      "subnet_template": "testTemplate1",
      "primary_dhcp_server_address": "20182018000000000000000000000020",
      "v4_primary_dhcp_server_address": "192.168.0.145",
      "created_by_name": "Stephen",
      "updated_by_name": "John",
      "updated_time_string": "string",
      "created_time_string": "string"
    },
    {
      "id": 6,
      "name": "string",
      "description": "string",
      "mask_length": 7,
      "network_id": 2,
      "network_name": "string",
      "network_address": "string",
      "subnet_group_id": 2,
      "subnet_group_name": "string",
      "contact_id": 6,
      "first_name": "string",
      "last_name": "string",
      "email_id": "string",
      "organization_id": 5,
      "organization_name": "string",
      "location_id": 9,
      "location_name": "string",
      "street1": "string",
      "street2": "string",
      "city": "string",
      "state": "string",
      "country": "spain",
      "zip": "string",
      "template_id": 1,
      "template_name": "string",
      "primary_domain": "string",
      "domains": [
        "string",
        "string"
      ],
      "primary_dhcp_server": "string",
      "router_name": "string",
      "routerAddress": "string",
      "router_option": "string",
      "percent_full": 8,
      "object_count": 3,
      "created_time": "string",
      "updated_time": "string",
      "vlan_id": "string",
      "subnet_template": "testTemplate1",
      "primary_dhcp_server_address": "20182018000000000000000000000020",
      "v4_primary_dhcp_server_address": "192.168.0.145",
      "created_by_name": "Stephen",
      "updated_by_name": "John",
      "updated_time_string": "string",
      "created_time_string": "string"
    }
  ]
}