[
  {
    "id": 54567,
    "type": "TCP-VMWare"
  },
  {
    "id": 54567,
    "type": "TCP-VMWare"
  },
  {
    "id": 54567,
    "type": "TCP-VMWare"
  },
  {
    "id": 54567,
    "type": "TCP-VMWare"
  }
]