[
  {
    "id": 6,
    "server_id": 10,
    "package_id": 9,
    "patch_id": 8,
    "patch_schedule_id": 8,
    "status": 4,
    "created_by": 10,
    "created_time": "string",
    "updated_by": 10,
    "updated_time": "string",
    "message": "string",
    "server_name": "string",
    "server_ipaddress": "string",
    "server_type": "string",
    "package_name": "string",
    "package_major_version": "string",
    "package_minor_version": "string",
    "package_server_type": "string",
    "package_description": "string",
    "patch_name": "string",
    "patch_level": 7,
    "patch_description": "string",
    "patchSchedule_job_id": "string",
    "created_by_name": "string",
    "updated_by_name": "string",
    "created_time_string": "string",
    "updated_time_string": "string",
    "description": "string",
    "status_string": "string",
    "package_version": "string",
    "workflowId": 6,
    "stepId": 2,
    "componentCode": "string"
  },
  {
    "id": 9,
    "server_id": 5,
    "package_id": 3,
    "patch_id": 4,
    "patch_schedule_id": 4,
    "status": 6,
    "created_by": 1,
    "created_time": "string",
    "updated_by": 2,
    "updated_time": "string",
    "message": "string",
    "server_name": "string",
    "server_ipaddress": "string",
    "server_type": "string",
    "package_name": "string",
    "package_major_version": "string",
    "package_minor_version": "string",
    "package_server_type": "string",
    "package_description": "string",
    "patch_name": "string",
    "patch_level": 4,
    "patch_description": "string",
    "patchSchedule_job_id": "string",
    "created_by_name": "string",
    "updated_by_name": "string",
    "created_time_string": "string",
    "updated_time_string": "string",
    "description": "string",
    "status_string": "string",
    "package_version": "string",
    "workflowId": 3,
    "stepId": 4,
    "componentCode": "string"
  },
  {
    "id": 5,
    "server_id": 9,
    "package_id": 3,
    "patch_id": 8,
    "patch_schedule_id": 9,
    "status": 4,
    "created_by": 8,
    "created_time": "string",
    "updated_by": 10,
    "updated_time": "string",
    "message": "string",
    "server_name": "string",
    "server_ipaddress": "string",
    "server_type": "string",
    "package_name": "string",
    "package_major_version": "string",
    "package_minor_version": "string",
    "package_server_type": "string",
    "package_description": "string",
    "patch_name": "string",
    "patch_level": 5,
    "patch_description": "string",
    "patchSchedule_job_id": "string",
    "created_by_name": "string",
    "updated_by_name": "string",
    "created_time_string": "string",
    "updated_time_string": "string",
    "description": "string",
    "status_string": "string",
    "package_version": "string",
    "workflowId": 7,
    "stepId": 1,
    "componentCode": "string"
  }
]