{
  "recordsTotal": 40,
  "recordsFiltered": 40,
  "data": [
    {
      "ipAddress": "10.2.2.3",
      "sysDesc": "string",
      "sysUpTime": "2hrs",
      "sysContact": "John",
      "sysName": "Switch",
      "sysLocation": "TCPWave",
      "ifNumber": "001",
      "mac": "string",
      "cmdId": 23,
      "subnetIP": "string",
      "discoveredElements": 4,
      "startTime": "string",
      "endTime": "string",
      "discoveredBy": "sadm"
    },
    {
      "ipAddress": "10.2.2.3",
      "sysDesc": "string",
      "sysUpTime": "2hrs",
      "sysContact": "John",
      "sysName": "Switch",
      "sysLocation": "TCPWave",
      "ifNumber": "001",
      "mac": "string",
      "cmdId": 23,
      "subnetIP": "string",
      "discoveredElements": 3,
      "startTime": "string",
      "endTime": "string",
      "discoveredBy": "sadm"
    },
    {
      "ipAddress": "10.2.2.3",
      "sysDesc": "string",
      "sysUpTime": "2hrs",
      "sysContact": "John",
      "sysName": "Switch",
      "sysLocation": "TCPWave",
      "ifNumber": "001",
      "mac": "string",
      "cmdId": 23,
      "subnetIP": "string",
      "discoveredElements": 4,
      "startTime": "string",
      "endTime": "string",
      "discoveredBy": "sadm"
    },
    {
      "ipAddress": "10.2.2.3",
      "sysDesc": "string",
      "sysUpTime": "2hrs",
      "sysContact": "John",
      "sysName": "Switch",
      "sysLocation": "TCPWave",
      "ifNumber": "001",
      "mac": "string",
      "cmdId": 23,
      "subnetIP": "string",
      "discoveredElements": 3,
      "startTime": "string",
      "endTime": "string",
      "discoveredBy": "sadm"
    },
    {
      "ipAddress": "10.2.2.3",
      "sysDesc": "string",
      "sysUpTime": "2hrs",
      "sysContact": "John",
      "sysName": "Switch",
      "sysLocation": "TCPWave",
      "ifNumber": "001",
      "mac": "string",
      "cmdId": 23,
      "subnetIP": "string",
      "discoveredElements": 10,
      "startTime": "string",
      "endTime": "string",
      "discoveredBy": "sadm"
    },
    {
      "ipAddress": "10.2.2.3",
      "sysDesc": "string",
      "sysUpTime": "2hrs",
      "sysContact": "John",
      "sysName": "Switch",
      "sysLocation": "TCPWave",
      "ifNumber": "001",
      "mac": "string",
      "cmdId": 23,
      "subnetIP": "string",
      "discoveredElements": 1,
      "startTime": "string",
      "endTime": "string",
      "discoveredBy": "sadm"
    },
    {
      "ipAddress": "10.2.2.3",
      "sysDesc": "string",
      "sysUpTime": "2hrs",
      "sysContact": "John",
      "sysName": "Switch",
      "sysLocation": "TCPWave",
      "ifNumber": "001",
      "mac": "string",
      "cmdId": 23,
      "subnetIP": "string",
      "discoveredElements": 8,
      "startTime": "string",
      "endTime": "string",
      "discoveredBy": "sadm"
    },
    {
      "ipAddress": "10.2.2.3",
      "sysDesc": "string",
      "sysUpTime": "2hrs",
      "sysContact": "John",
      "sysName": "Switch",
      "sysLocation": "TCPWave",
      "ifNumber": "001",
      "mac": "string",
      "cmdId": 23,
      "subnetIP": "string",
      "discoveredElements": 2,
      "startTime": "string",
      "endTime": "string",
      "discoveredBy": "sadm"
    },
    {
      "ipAddress": "10.2.2.3",
      "sysDesc": "string",
      "sysUpTime": "2hrs",
      "sysContact": "John",
      "sysName": "Switch",
      "sysLocation": "TCPWave",
      "ifNumber": "001",
      "mac": "string",
      "cmdId": 23,
      "subnetIP": "string",
      "discoveredElements": 5,
      "startTime": "string",
      "endTime": "string",
      "discoveredBy": "sadm"
    }
  ]
}