{
  "$id": "schema.json",
  "type": "object",
  "schema": "http://json-schema.org/draft-07/schema#",
  "translate": true,
  "dynamicfields": true,
  "properties": {
    "ph_request_type": {
      "type": "string",
      "description": "type of request (internal to adapter)",
      "default": "postWsdhcpserverDelete",
      "enum": [
        "postWsdhcpserverDelete",
        "getWsdhcpserverPage",
        "getWsdhcpserverDhcpActiveLeases",
        "restartDHCPService",
        "syncConfig",
        "listServers",
        "getApplianceDetails",
        "updateDHCPappliance",
        "postWsdhcpserverAdd"
      ],
      "external_name": "ph_request_type"
    },
    "organizationName": {
      "type": "string",
      "description": "Organization Name",
      "parse": false,
      "encode": false,
      "encrypt": {
        "type": "AES",
        "key": ""
      },
      "external_name": "organization_name"
    },
    "serverIp": {
      "type": "string",
      "description": "IP address",
      "parse": false,
      "encode": false,
      "encrypt": {
        "type": "AES",
        "key": ""
      },
      "external_name": "server_ip"
    },
    "orgName": {
      "type": "string",
      "description": "Required Organization Name",
      "parse": false,
      "encode": false,
      "encrypt": {
        "type": "AES",
        "key": ""
      },
      "external_name": "org_name"
    }
  },
  "definitions": {}
}