[
  {
    "jobId": "string",
    "jobType": "string",
    "jobData": "string",
    "scheduleType": "string",
    "runDay": 1,
    "repeatInterval": 4,
    "repeatCount": 5,
    "description": "string",
    "startDate": "3/18/2019 4:37",
    "endDate": "4/18/2019 4:37",
    "id": 101,
    "createdBy": 2226,
    "createdTime": "3/18/2016 4:37",
    "updatedBy": 2226,
    "updatedTime": "5/18/2016 4:37",
    "createdByName": "Smith",
    "updatedByName": "string",
    "operation": "Add",
    "target_instance": "Object",
    "sysjob": 112,
    "jobpaused": 4,
    "startDateString": "3/18/2016 4:50",
    "endDateString": "3/18/2017 4:50",
    "runTimeString": "string",
    "runDayDisplayString": "string",
    "repeatIntervalString": "string"
  },
  {
    "jobId": "string",
    "jobType": "string",
    "jobData": "string",
    "scheduleType": "string",
    "runDay": 2,
    "repeatInterval": 8,
    "repeatCount": 7,
    "description": "string",
    "startDate": "3/18/2019 4:37",
    "endDate": "4/18/2019 4:37",
    "id": 101,
    "createdBy": 2226,
    "createdTime": "3/18/2016 4:37",
    "updatedBy": 2226,
    "updatedTime": "5/18/2016 4:37",
    "createdByName": "Smith",
    "updatedByName": "string",
    "operation": "Add",
    "target_instance": "Object",
    "sysjob": 112,
    "jobpaused": 7,
    "startDateString": "3/18/2016 4:50",
    "endDateString": "3/18/2017 4:50",
    "runTimeString": "string",
    "runDayDisplayString": "string",
    "repeatIntervalString": "string"
  },
  {
    "jobId": "string",
    "jobType": "string",
    "jobData": "string",
    "scheduleType": "string",
    "runDay": 7,
    "repeatInterval": 8,
    "repeatCount": 10,
    "description": "string",
    "startDate": "3/18/2019 4:37",
    "endDate": "4/18/2019 4:37",
    "id": 101,
    "createdBy": 2226,
    "createdTime": "3/18/2016 4:37",
    "updatedBy": 2226,
    "updatedTime": "5/18/2016 4:37",
    "createdByName": "Smith",
    "updatedByName": "string",
    "operation": "Add",
    "target_instance": "Object",
    "sysjob": 112,
    "jobpaused": 9,
    "startDateString": "3/18/2016 4:50",
    "endDateString": "3/18/2017 4:50",
    "runTimeString": "string",
    "runDayDisplayString": "string",
    "repeatIntervalString": "string"
  }
]