{
  "recordsTotal": 40,
  "recordsFiltered": 40,
  "data": [
    {
      "change_ticket": "string",
      "id": 10,
      "user_id": 6,
      "login_name": "string",
      "remote_ip": "string",
      "target": "string",
      "operation": "string",
      "audit_time": "string",
      "audit_time_string": "string",
      "action_status": "string",
      "action": "string",
      "description": "string",
      "error_msg": "string",
      "role_id": 5,
      "role_code": "string"
    },
    {
      "change_ticket": "string",
      "id": 9,
      "user_id": 6,
      "login_name": "string",
      "remote_ip": "string",
      "target": "string",
      "operation": "string",
      "audit_time": "string",
      "audit_time_string": "string",
      "action_status": "string",
      "action": "string",
      "description": "string",
      "error_msg": "string",
      "role_id": 10,
      "role_code": "string"
    },
    {
      "change_ticket": "string",
      "id": 6,
      "user_id": 7,
      "login_name": "string",
      "remote_ip": "string",
      "target": "string",
      "operation": "string",
      "audit_time": "string",
      "audit_time_string": "string",
      "action_status": "string",
      "action": "string",
      "description": "string",
      "error_msg": "string",
      "role_id": 7,
      "role_code": "string"
    },
    {
      "change_ticket": "string",
      "id": 6,
      "user_id": 9,
      "login_name": "string",
      "remote_ip": "string",
      "target": "string",
      "operation": "string",
      "audit_time": "string",
      "audit_time_string": "string",
      "action_status": "string",
      "action": "string",
      "description": "string",
      "error_msg": "string",
      "role_id": 9,
      "role_code": "string"
    },
    {
      "change_ticket": "string",
      "id": 5,
      "user_id": 9,
      "login_name": "string",
      "remote_ip": "string",
      "target": "string",
      "operation": "string",
      "audit_time": "string",
      "audit_time_string": "string",
      "action_status": "string",
      "action": "string",
      "description": "string",
      "error_msg": "string",
      "role_id": 3,
      "role_code": "string"
    },
    {
      "change_ticket": "string",
      "id": 2,
      "user_id": 9,
      "login_name": "string",
      "remote_ip": "string",
      "target": "string",
      "operation": "string",
      "audit_time": "string",
      "audit_time_string": "string",
      "action_status": "string",
      "action": "string",
      "description": "string",
      "error_msg": "string",
      "role_id": 9,
      "role_code": "string"
    },
    {
      "change_ticket": "string",
      "id": 4,
      "user_id": 5,
      "login_name": "string",
      "remote_ip": "string",
      "target": "string",
      "operation": "string",
      "audit_time": "string",
      "audit_time_string": "string",
      "action_status": "string",
      "action": "string",
      "description": "string",
      "error_msg": "string",
      "role_id": 2,
      "role_code": "string"
    }
  ]
}