{
  "$id": "schema.json",
  "type": "object",
  "schema": "http://json-schema.org/draft-07/schema#",
  "translate": true,
  "dynamicfields": true,
  "properties": {
    "ph_request_type": {
      "type": "string",
      "description": "type of request (internal to adapter)",
      "default": "licenseCheck",
      "enum": [
        "licenseCheck",
        "updateRemoteLicense",
        "postServerLicenseAdd",
        "getServerLicenseList"
      ],
      "external_name": "ph_request_type"
    },
    "serverType": {
      "description": "Server Type",
      "parse": false,
      "encode": false,
      "encrypt": {
        "type": "AES",
        "key": ""
      },
      "external_name": "server_type"
    },
    "serverName": {
      "type": "string",
      "description": "Server Name",
      "parse": false,
      "encode": false,
      "encrypt": {
        "type": "AES",
        "key": ""
      },
      "external_name": "server_name"
    }
  },
  "definitions": {}
}