{
  "id": 3,
  "name": "string",
  "description": "string",
  "mask_length": 4,
  "network_id": 5,
  "network_name": "string",
  "network_address": "string",
  "subnet_group_id": 9,
  "subnet_group_name": "string",
  "contact_id": 8,
  "first_name": "string",
  "last_name": "string",
  "email_id": "string",
  "organization_id": 9,
  "organization_name": "string",
  "location_id": 3,
  "location_name": "string",
  "street1": "string",
  "street2": "string",
  "city": "string",
  "state": "string",
  "country": "spain",
  "zip": "string",
  "template_id": 9,
  "template_name": "string",
  "primary_domain": "string",
  "domains": [
    "string",
    "string",
    "string"
  ],
  "primary_dhcp_server": "string",
  "router_name": "string",
  "routerAddress": "string",
  "router_option": "string",
  "percent_full": 1,
  "object_count": 1,
  "created_time": "string",
  "updated_time": "string",
  "vlan_id": "string",
  "subnet_template": "testTemplate1",
  "primary_dhcp_server_address": "20182018000000000000000000000020",
  "v4_primary_dhcp_server_address": "192.168.0.145",
  "created_by_name": "Stephen",
  "updated_by_name": "John",
  "updated_time_string": "string",
  "created_time_string": "string"
}