{
  "actions": [
    {
      "name": "deleteForwarders",
      "protocol": "REST",
      "method": "GET",
      "entitypath": "{base_path}/{version}/forwarders/dnsforwarders/delete?{query}",
      "requestSchema": "schema.json",
      "responseSchema": "schema.json",
      "timeout": 0,
      "sendEmpty": false,
      "sendGetBody": false,
      "requestDatatype": "JSON",
      "responseDatatype": "JSON",
      "headers": {},
      "responseObjects": [
        {
          "type": "default",
          "key": "",
          "mockFile": ""
        }
      ]
    },
    {
      "name": "createDNSForwarders",
      "protocol": "REST",
      "method": "POST",
      "entitypath": "{base_path}/{version}/forwarders/dnsforwarders/add?{query}",
      "requestSchema": "schema.json",
      "responseSchema": "schema.json",
      "timeout": 0,
      "sendEmpty": false,
      "sendGetBody": false,
      "requestDatatype": "JSON",
      "responseDatatype": "JSON",
      "headers": {},
      "responseObjects": [
        {
          "type": "default",
          "key": "",
          "mockFile": ""
        }
      ]
    },
    {
      "name": "updateDNSForwarders",
      "protocol": "REST",
      "method": "POST",
      "entitypath": "{base_path}/{version}/forwarders/dnsforwarders/update?{query}",
      "requestSchema": "schema.json",
      "responseSchema": "schema.json",
      "timeout": 0,
      "sendEmpty": false,
      "sendGetBody": false,
      "requestDatatype": "JSON",
      "responseDatatype": "JSON",
      "headers": {},
      "responseObjects": [
        {
          "type": "default",
          "key": "",
          "mockFile": ""
        }
      ]
    },
    {
      "name": "listDNSForwarders",
      "protocol": "REST",
      "method": "GET",
      "entitypath": "{base_path}/{version}/forwarders/dnsforwarders/list?{query}",
      "requestSchema": "schema.json",
      "responseSchema": "schema.json",
      "timeout": 0,
      "sendEmpty": false,
      "sendGetBody": false,
      "requestDatatype": "JSON",
      "responseDatatype": "JSON",
      "headers": {},
      "responseObjects": [
        {
          "type": "default",
          "key": "",
          "mockFile": "mockdatafiles/listDNSForwarders-default.json"
        }
      ]
    },
    {
      "name": "listDNSForwardersCategory",
      "protocol": "REST",
      "method": "GET",
      "entitypath": "{base_path}/{version}/forwarders/dnsforwarders/majorlist?{query}",
      "requestSchema": "schema.json",
      "responseSchema": "schema.json",
      "timeout": 0,
      "sendEmpty": false,
      "sendGetBody": false,
      "requestDatatype": "JSON",
      "responseDatatype": "JSON",
      "headers": {},
      "responseObjects": [
        {
          "type": "default",
          "key": "",
          "mockFile": "mockdatafiles/listDNSForwardersCategory-default.json"
        }
      ]
    },
    {
      "name": "listDNSServersAssociateForForwarders",
      "protocol": "REST",
      "method": "GET",
      "entitypath": "{base_path}/{version}/forwarders/dnsforwarders/associateForwarders?{query}",
      "requestSchema": "schema.json",
      "responseSchema": "schema.json",
      "timeout": 0,
      "sendEmpty": false,
      "sendGetBody": false,
      "requestDatatype": "JSON",
      "responseDatatype": "JSON",
      "headers": {},
      "responseObjects": [
        {
          "type": "default",
          "key": "",
          "mockFile": "mockdatafiles/listDNSServersAssociateForForwarders-default.json"
        }
      ]
    },
    {
      "name": "dnsForwardersSearch",
      "protocol": "REST",
      "method": "GET",
      "entitypath": "{base_path}/{version}/forwarders/dnsforwarders/search?{query}",
      "requestSchema": "schema.json",
      "responseSchema": "schema.json",
      "timeout": 0,
      "sendEmpty": false,
      "sendGetBody": false,
      "requestDatatype": "JSON",
      "responseDatatype": "JSON",
      "headers": {},
      "responseObjects": [
        {
          "type": "default",
          "key": "",
          "mockFile": "mockdatafiles/dnsForwardersSearch-default.json"
        }
      ]
    },
    {
      "name": "searchDNSForwarderReferences",
      "protocol": "REST",
      "method": "GET",
      "entitypath": "{base_path}/{version}/forwarders/dnsforwarders/references?{query}",
      "requestSchema": "schema.json",
      "responseSchema": "schema.json",
      "timeout": 0,
      "sendEmpty": false,
      "sendGetBody": false,
      "requestDatatype": "JSON",
      "responseDatatype": "JSON",
      "headers": {},
      "responseObjects": [
        {
          "type": "default",
          "key": "",
          "mockFile": ""
        }
      ]
    }
  ]
}