[
  {
    "id": 10,
    "code": "HMAC-SHA512",
    "min": 1,
    "max": 512,
    "dnssec": true,
    "mandatory": false,
    "bitSize": 312
  },
  {
    "id": 10,
    "code": "HMAC-SHA512",
    "min": 1,
    "max": 512,
    "dnssec": true,
    "mandatory": true,
    "bitSize": 312
  }
]