{
  "total": 20,
  "recordsTotal": 40,
  "recordsFiltered": 40,
  "data": [
    {
      "id": 4,
      "oldName": "string",
      "name": "string",
      "addr1": 10,
      "addr2": 1,
      "addr3": 9,
      "addr4": 7,
      "address": "string",
      "startAddress": "string",
      "created_by": 8,
      "updated_by": 10,
      "server_name": "lisartx-est015-sl012",
      "server_id": 121,
      "email_check": 7,
      "snmp_check": 3,
      "percentageFull": 1,
      "reverse_zone_serial": 2016102800,
      "server_count": 2,
      "dmzVisible": "Yes/No",
      "zoneTemplateId": 41010,
      "zoneTemplateName": "ZoneTemp1",
      "dnssec_enable": "Yes/No",
      "nsec_option": "NSEC/NSEC3",
      "serialFormat": "NODATE/DATE",
      "created_time": "string",
      "updated_time": "string",
      "created_by_name": "string",
      "updated_by_name": "string",
      "created_by_login_name": "string",
      "updated_by_login_name": "string",
      "network_usage": "string",
      "enable_discovery": "Yes/No",
      "discoveryTemplateId": 41010,
      "discovery_template": "DiscoveryTemp1",
      "createRevZone": "Yes/No",
      "extensions": [
        {
          "name": "RITS_ID-1",
          "value": "Admin/Network/Subnet"
        }
      ],
      "monitoringService": "string",
      "contact_name": "string",
      "first_name": "string",
      "middle_name": "string",
      "last_name": "string",
      "contact_email_id": "string",
      "contact_id": 8,
      "selectedMasterServer": "[BindAuth1, BindAuth2]",
      "selectedSlaveServer": "[NSD1,BindCache1]",
      "rrs": "[RR1, RR2]",
      "templateList": "[ZoneTemp1, ZoneTemp2]",
      "customTemplate": true,
      "mask_length": 9,
      "nw_mask_length": 6,
      "organization_id": 9,
      "organization_name": "string",
      "subnet_count": 7,
      "object_count": 5,
      "description": "string",
      "email_id": "admin@tcpwave.com",
      "percent_full": 10,
      "reverse_zone": "string",
      "updated_time_string": "string",
      "created_time_string": "string"
    },
    {
      "id": 2,
      "oldName": "string",
      "name": "string",
      "addr1": 8,
      "addr2": 8,
      "addr3": 10,
      "addr4": 1,
      "address": "string",
      "startAddress": "string",
      "created_by": 8,
      "updated_by": 7,
      "server_name": "lisartx-est015-sl012",
      "server_id": 121,
      "email_check": 5,
      "snmp_check": 7,
      "percentageFull": 10,
      "reverse_zone_serial": 2016102800,
      "server_count": 9,
      "dmzVisible": "Yes/No",
      "zoneTemplateId": 41010,
      "zoneTemplateName": "ZoneTemp1",
      "dnssec_enable": "Yes/No",
      "nsec_option": "NSEC/NSEC3",
      "serialFormat": "NODATE/DATE",
      "created_time": "string",
      "updated_time": "string",
      "created_by_name": "string",
      "updated_by_name": "string",
      "created_by_login_name": "string",
      "updated_by_login_name": "string",
      "network_usage": "string",
      "enable_discovery": "Yes/No",
      "discoveryTemplateId": 41010,
      "discovery_template": "DiscoveryTemp1",
      "createRevZone": "Yes/No",
      "extensions": [
        {
          "name": "RITS_ID-1",
          "value": "Admin/Network/Subnet"
        },
        {
          "name": "RITS_ID-1",
          "value": "Admin/Network/Subnet"
        },
        {
          "name": "RITS_ID-1",
          "value": "Admin/Network/Subnet"
        },
        {
          "name": "RITS_ID-1",
          "value": "Admin/Network/Subnet"
        },
        {
          "name": "RITS_ID-1",
          "value": "Admin/Network/Subnet"
        }
      ],
      "monitoringService": "string",
      "contact_name": "string",
      "first_name": "string",
      "middle_name": "string",
      "last_name": "string",
      "contact_email_id": "string",
      "contact_id": 2,
      "selectedMasterServer": "[BindAuth1, BindAuth2]",
      "selectedSlaveServer": "[NSD1,BindCache1]",
      "rrs": "[RR1, RR2]",
      "templateList": "[ZoneTemp1, ZoneTemp2]",
      "customTemplate": true,
      "mask_length": 5,
      "nw_mask_length": 4,
      "organization_id": 4,
      "organization_name": "string",
      "subnet_count": 3,
      "object_count": 4,
      "description": "string",
      "email_id": "admin@tcpwave.com",
      "percent_full": 10,
      "reverse_zone": "string",
      "updated_time_string": "string",
      "created_time_string": "string"
    },
    {
      "id": 4,
      "oldName": "string",
      "name": "string",
      "addr1": 1,
      "addr2": 9,
      "addr3": 4,
      "addr4": 9,
      "address": "string",
      "startAddress": "string",
      "created_by": 5,
      "updated_by": 5,
      "server_name": "lisartx-est015-sl012",
      "server_id": 121,
      "email_check": 3,
      "snmp_check": 10,
      "percentageFull": 6,
      "reverse_zone_serial": 2016102800,
      "server_count": 3,
      "dmzVisible": "Yes/No",
      "zoneTemplateId": 41010,
      "zoneTemplateName": "ZoneTemp1",
      "dnssec_enable": "Yes/No",
      "nsec_option": "NSEC/NSEC3",
      "serialFormat": "NODATE/DATE",
      "created_time": "string",
      "updated_time": "string",
      "created_by_name": "string",
      "updated_by_name": "string",
      "created_by_login_name": "string",
      "updated_by_login_name": "string",
      "network_usage": "string",
      "enable_discovery": "Yes/No",
      "discoveryTemplateId": 41010,
      "discovery_template": "DiscoveryTemp1",
      "createRevZone": "Yes/No",
      "extensions": [
        {
          "name": "RITS_ID-1",
          "value": "Admin/Network/Subnet"
        }
      ],
      "monitoringService": "string",
      "contact_name": "string",
      "first_name": "string",
      "middle_name": "string",
      "last_name": "string",
      "contact_email_id": "string",
      "contact_id": 5,
      "selectedMasterServer": "[BindAuth1, BindAuth2]",
      "selectedSlaveServer": "[NSD1,BindCache1]",
      "rrs": "[RR1, RR2]",
      "templateList": "[ZoneTemp1, ZoneTemp2]",
      "customTemplate": false,
      "mask_length": 10,
      "nw_mask_length": 9,
      "organization_id": 6,
      "organization_name": "string",
      "subnet_count": 6,
      "object_count": 8,
      "description": "string",
      "email_id": "admin@tcpwave.com",
      "percent_full": 5,
      "reverse_zone": "string",
      "updated_time_string": "string",
      "created_time_string": "string"
    },
    {
      "id": 8,
      "oldName": "string",
      "name": "string",
      "addr1": 7,
      "addr2": 6,
      "addr3": 2,
      "addr4": 10,
      "address": "string",
      "startAddress": "string",
      "created_by": 6,
      "updated_by": 2,
      "server_name": "lisartx-est015-sl012",
      "server_id": 121,
      "email_check": 7,
      "snmp_check": 1,
      "percentageFull": 10,
      "reverse_zone_serial": 2016102800,
      "server_count": 3,
      "dmzVisible": "Yes/No",
      "zoneTemplateId": 41010,
      "zoneTemplateName": "ZoneTemp1",
      "dnssec_enable": "Yes/No",
      "nsec_option": "NSEC/NSEC3",
      "serialFormat": "NODATE/DATE",
      "created_time": "string",
      "updated_time": "string",
      "created_by_name": "string",
      "updated_by_name": "string",
      "created_by_login_name": "string",
      "updated_by_login_name": "string",
      "network_usage": "string",
      "enable_discovery": "Yes/No",
      "discoveryTemplateId": 41010,
      "discovery_template": "DiscoveryTemp1",
      "createRevZone": "Yes/No",
      "extensions": [
        {
          "name": "RITS_ID-1",
          "value": "Admin/Network/Subnet"
        },
        {
          "name": "RITS_ID-1",
          "value": "Admin/Network/Subnet"
        },
        {
          "name": "RITS_ID-1",
          "value": "Admin/Network/Subnet"
        },
        {
          "name": "RITS_ID-1",
          "value": "Admin/Network/Subnet"
        },
        {
          "name": "RITS_ID-1",
          "value": "Admin/Network/Subnet"
        },
        {
          "name": "RITS_ID-1",
          "value": "Admin/Network/Subnet"
        }
      ],
      "monitoringService": "string",
      "contact_name": "string",
      "first_name": "string",
      "middle_name": "string",
      "last_name": "string",
      "contact_email_id": "string",
      "contact_id": 2,
      "selectedMasterServer": "[BindAuth1, BindAuth2]",
      "selectedSlaveServer": "[NSD1,BindCache1]",
      "rrs": "[RR1, RR2]",
      "templateList": "[ZoneTemp1, ZoneTemp2]",
      "customTemplate": true,
      "mask_length": 7,
      "nw_mask_length": 5,
      "organization_id": 9,
      "organization_name": "string",
      "subnet_count": 7,
      "object_count": 1,
      "description": "string",
      "email_id": "admin@tcpwave.com",
      "percent_full": 3,
      "reverse_zone": "string",
      "updated_time_string": "string",
      "created_time_string": "string"
    },
    {
      "id": 6,
      "oldName": "string",
      "name": "string",
      "addr1": 1,
      "addr2": 8,
      "addr3": 10,
      "addr4": 7,
      "address": "string",
      "startAddress": "string",
      "created_by": 10,
      "updated_by": 8,
      "server_name": "lisartx-est015-sl012",
      "server_id": 121,
      "email_check": 4,
      "snmp_check": 2,
      "percentageFull": 3,
      "reverse_zone_serial": 2016102800,
      "server_count": 5,
      "dmzVisible": "Yes/No",
      "zoneTemplateId": 41010,
      "zoneTemplateName": "ZoneTemp1",
      "dnssec_enable": "Yes/No",
      "nsec_option": "NSEC/NSEC3",
      "serialFormat": "NODATE/DATE",
      "created_time": "string",
      "updated_time": "string",
      "created_by_name": "string",
      "updated_by_name": "string",
      "created_by_login_name": "string",
      "updated_by_login_name": "string",
      "network_usage": "string",
      "enable_discovery": "Yes/No",
      "discoveryTemplateId": 41010,
      "discovery_template": "DiscoveryTemp1",
      "createRevZone": "Yes/No",
      "extensions": [
        {
          "name": "RITS_ID-1",
          "value": "Admin/Network/Subnet"
        }
      ],
      "monitoringService": "string",
      "contact_name": "string",
      "first_name": "string",
      "middle_name": "string",
      "last_name": "string",
      "contact_email_id": "string",
      "contact_id": 2,
      "selectedMasterServer": "[BindAuth1, BindAuth2]",
      "selectedSlaveServer": "[NSD1,BindCache1]",
      "rrs": "[RR1, RR2]",
      "templateList": "[ZoneTemp1, ZoneTemp2]",
      "customTemplate": false,
      "mask_length": 2,
      "nw_mask_length": 3,
      "organization_id": 7,
      "organization_name": "string",
      "subnet_count": 3,
      "object_count": 6,
      "description": "string",
      "email_id": "admin@tcpwave.com",
      "percent_full": 2,
      "reverse_zone": "string",
      "updated_time_string": "string",
      "created_time_string": "string"
    },
    {
      "id": 9,
      "oldName": "string",
      "name": "string",
      "addr1": 8,
      "addr2": 2,
      "addr3": 3,
      "addr4": 5,
      "address": "string",
      "startAddress": "string",
      "created_by": 3,
      "updated_by": 5,
      "server_name": "lisartx-est015-sl012",
      "server_id": 121,
      "email_check": 10,
      "snmp_check": 3,
      "percentageFull": 9,
      "reverse_zone_serial": 2016102800,
      "server_count": 1,
      "dmzVisible": "Yes/No",
      "zoneTemplateId": 41010,
      "zoneTemplateName": "ZoneTemp1",
      "dnssec_enable": "Yes/No",
      "nsec_option": "NSEC/NSEC3",
      "serialFormat": "NODATE/DATE",
      "created_time": "string",
      "updated_time": "string",
      "created_by_name": "string",
      "updated_by_name": "string",
      "created_by_login_name": "string",
      "updated_by_login_name": "string",
      "network_usage": "string",
      "enable_discovery": "Yes/No",
      "discoveryTemplateId": 41010,
      "discovery_template": "DiscoveryTemp1",
      "createRevZone": "Yes/No",
      "extensions": [
        {
          "name": "RITS_ID-1",
          "value": "Admin/Network/Subnet"
        },
        {
          "name": "RITS_ID-1",
          "value": "Admin/Network/Subnet"
        }
      ],
      "monitoringService": "string",
      "contact_name": "string",
      "first_name": "string",
      "middle_name": "string",
      "last_name": "string",
      "contact_email_id": "string",
      "contact_id": 4,
      "selectedMasterServer": "[BindAuth1, BindAuth2]",
      "selectedSlaveServer": "[NSD1,BindCache1]",
      "rrs": "[RR1, RR2]",
      "templateList": "[ZoneTemp1, ZoneTemp2]",
      "customTemplate": false,
      "mask_length": 1,
      "nw_mask_length": 1,
      "organization_id": 9,
      "organization_name": "string",
      "subnet_count": 8,
      "object_count": 9,
      "description": "string",
      "email_id": "admin@tcpwave.com",
      "percent_full": 4,
      "reverse_zone": "string",
      "updated_time_string": "string",
      "created_time_string": "string"
    },
    {
      "id": 9,
      "oldName": "string",
      "name": "string",
      "addr1": 5,
      "addr2": 4,
      "addr3": 3,
      "addr4": 8,
      "address": "string",
      "startAddress": "string",
      "created_by": 5,
      "updated_by": 5,
      "server_name": "lisartx-est015-sl012",
      "server_id": 121,
      "email_check": 2,
      "snmp_check": 6,
      "percentageFull": 7,
      "reverse_zone_serial": 2016102800,
      "server_count": 4,
      "dmzVisible": "Yes/No",
      "zoneTemplateId": 41010,
      "zoneTemplateName": "ZoneTemp1",
      "dnssec_enable": "Yes/No",
      "nsec_option": "NSEC/NSEC3",
      "serialFormat": "NODATE/DATE",
      "created_time": "string",
      "updated_time": "string",
      "created_by_name": "string",
      "updated_by_name": "string",
      "created_by_login_name": "string",
      "updated_by_login_name": "string",
      "network_usage": "string",
      "enable_discovery": "Yes/No",
      "discoveryTemplateId": 41010,
      "discovery_template": "DiscoveryTemp1",
      "createRevZone": "Yes/No",
      "extensions": [
        {
          "name": "RITS_ID-1",
          "value": "Admin/Network/Subnet"
        },
        {
          "name": "RITS_ID-1",
          "value": "Admin/Network/Subnet"
        },
        {
          "name": "RITS_ID-1",
          "value": "Admin/Network/Subnet"
        },
        {
          "name": "RITS_ID-1",
          "value": "Admin/Network/Subnet"
        }
      ],
      "monitoringService": "string",
      "contact_name": "string",
      "first_name": "string",
      "middle_name": "string",
      "last_name": "string",
      "contact_email_id": "string",
      "contact_id": 8,
      "selectedMasterServer": "[BindAuth1, BindAuth2]",
      "selectedSlaveServer": "[NSD1,BindCache1]",
      "rrs": "[RR1, RR2]",
      "templateList": "[ZoneTemp1, ZoneTemp2]",
      "customTemplate": true,
      "mask_length": 5,
      "nw_mask_length": 6,
      "organization_id": 2,
      "organization_name": "string",
      "subnet_count": 8,
      "object_count": 1,
      "description": "string",
      "email_id": "admin@tcpwave.com",
      "percent_full": 9,
      "reverse_zone": "string",
      "updated_time_string": "string",
      "created_time_string": "string"
    },
    {
      "id": 7,
      "oldName": "string",
      "name": "string",
      "addr1": 8,
      "addr2": 6,
      "addr3": 9,
      "addr4": 10,
      "address": "string",
      "startAddress": "string",
      "created_by": 6,
      "updated_by": 1,
      "server_name": "lisartx-est015-sl012",
      "server_id": 121,
      "email_check": 7,
      "snmp_check": 2,
      "percentageFull": 6,
      "reverse_zone_serial": 2016102800,
      "server_count": 10,
      "dmzVisible": "Yes/No",
      "zoneTemplateId": 41010,
      "zoneTemplateName": "ZoneTemp1",
      "dnssec_enable": "Yes/No",
      "nsec_option": "NSEC/NSEC3",
      "serialFormat": "NODATE/DATE",
      "created_time": "string",
      "updated_time": "string",
      "created_by_name": "string",
      "updated_by_name": "string",
      "created_by_login_name": "string",
      "updated_by_login_name": "string",
      "network_usage": "string",
      "enable_discovery": "Yes/No",
      "discoveryTemplateId": 41010,
      "discovery_template": "DiscoveryTemp1",
      "createRevZone": "Yes/No",
      "extensions": [
        {
          "name": "RITS_ID-1",
          "value": "Admin/Network/Subnet"
        },
        {
          "name": "RITS_ID-1",
          "value": "Admin/Network/Subnet"
        },
        {
          "name": "RITS_ID-1",
          "value": "Admin/Network/Subnet"
        }
      ],
      "monitoringService": "string",
      "contact_name": "string",
      "first_name": "string",
      "middle_name": "string",
      "last_name": "string",
      "contact_email_id": "string",
      "contact_id": 8,
      "selectedMasterServer": "[BindAuth1, BindAuth2]",
      "selectedSlaveServer": "[NSD1,BindCache1]",
      "rrs": "[RR1, RR2]",
      "templateList": "[ZoneTemp1, ZoneTemp2]",
      "customTemplate": true,
      "mask_length": 3,
      "nw_mask_length": 8,
      "organization_id": 4,
      "organization_name": "string",
      "subnet_count": 1,
      "object_count": 5,
      "description": "string",
      "email_id": "admin@tcpwave.com",
      "percent_full": 10,
      "reverse_zone": "string",
      "updated_time_string": "string",
      "created_time_string": "string"
    }
  ]
}