[
  {
    "action_time": "11/24/2016 15:18",
    "action_type": "Add/Modify/Deleted",
    "action_by": "john smith",
    "name": "tcpwave",
    "address": "10.0.1.1",
    "description": "A successful login event has been recorded.",
    "domain": "tcpwave",
    "hist_id": "45",
    "rows": 20,
    "email": "john@tcpwave.com",
    "percentagefull": "34",
    "email_notify": "No",
    "snmp_notify": "No",
    "log_notify": "No",
    "groupName": "group-1",
    "primaryRouter": "10.0.0.1",
    "location": "22 Main street, Atlantic city, sydney, South Australia-5540",
    "object_type": "CRM Server",
    "time_to_live": "1200",
    "alloc_type": "static",
    "operation": "Schedule Create",
    "role": "Functional Administrator",
    "networkAddress": "10.0.1.1/24",
    "subnetAddress": "10.0.1.1/16",
    "unusedObjects": "2047",
    "staticObjects": "30",
    "manualObjects": "1",
    "autoObjects": "0",
    "dynamicObjects": "28",
    "status": "Success",
    "remote_ip": "10.2.2.4",
    "login_name": "John Smith",
    "error_msg": "Job executed successfully.",
    "organization_name": "tcpwave",
    "template_name": "zone-template-1",
    "dnssec_enable": "No",
    "nsec_option": "Yes",
    "serial": "2016072939",
    "is_reverse_zone": "TRUE",
    "ad_enable": "yes",
    "secure_ad_enable": "no",
    "id": "45",
    "v4_ipaddress": "10.2.1.4",
    "v6_ipaddress": "5000::",
    "server_type": "BIND AUTH",
    "dns_server_template": "BIND AUTH1",
    "dns_option_template": "BIND AUTH Default Template",
    "dmz_visible": "Yes/No",
    "monitoring_service": "CHECK_MONIT",
    "enable_dynamic_updates": "No",
    "policy_template": "Clone-Policy-1",
    "preference": "Primary",
    "failover_server_details": "Primary Server : 10.1.1.18, Fail Over Server : 10.1.1.19, Primary Port :64, Fail Over Port : 64, Max Response Delay : 30, Max Unpacked Updates : 10, MCLT : 1800, SPLIT : 128, Load Balance Max Secs : 3",
    "template_status": "Active/Deleted",
    "logger": "named",
    "total": "47",
    "value": "60",
    "job_type": "Event",
    "jobId": "2452",
    "execution_time": "11/24/2016 15:18",
    "job_data": "{\"MajorVersion\":\"11\",\"ServerType\":\"DNS\",\"ZipFile\":\"IPAM_DNS_Patch002.zip\",\"PackageName\":\"TCPWaveDNS\",\"PatchLevel\":\"2\",\"PatchName\":\"DNS Test Patch 002\",\"MinorVersion\":\"8\",\"serverName\":\"server-name\",\"serverIp\":\"10.0.1.189\"}",
    "schedule_type": "One time Job",
    "run_day": "0",
    "repeat_count": "1",
    "extra_params": "sessionId:1fqu0o1howzbs1foextz3xz3pj userName:admin remoteAddress:10.2.2.1",
    "user_id": "4562",
    "execution_status": "Success",
    "vlan_id": "3456",
    "subnet_name": "subnet1",
    "subnet_address": "10.1.2.8",
    "primary_domain": "about-tcpwave.com",
    "dhcp_templ_name": "Generic",
    "owner": "www.tcpwave1.com.",
    "ttl": "5000",
    "owner_class": "BIND AUTH",
    "type": "A",
    "data": "192.168.101.2",
    "code": "BIND AUTH",
    "server_name": "server-name",
    "configData": "10.0.1.5/10.0.1.6/10.0.1.7/10.0.1.8",
    "configType": "BANNER",
    "email_id": "john@tcpwave.com",
    "admin_id": "432",
    "report_type": "dailyFunctionalAdminAuditRpt",
    "periods": "daily",
    "service_name": "External Authentication",
    "host_name": "ipam-234.tcpwave.com",
    "host_address": "10.0.0.1",
    "state": "Critical",
    "output": "CRITICAL: Failed to generate the DNSDR configuration. Exception: Table 'tims.tea_zone' doesn't exist",
    "objAddress": "10.0.0.2",
    "object_name": "object",
    "mac_address": "65:e1:44:a6:85:7b",
    "display_name": "Time Offset",
    "proxy": "0/1",
    "ipv4_address": "10.10.1.220",
    "config_name": "subnet-mask",
    "mask_length": "24",
    "subnet_addr": "10.0.0.0/24",
    "network_addr": "10.1.0.0/16",
    "scope": "10.1.12.17-10.1.12.18",
    "object_addr": "10.0.0.2",
    "class_code": "Domain Controller",
    "domain_name": "tcpwave.com",
    "mac": "00:0c:29:c5:68:5c",
    "obj_count": 24,
    "z_name": "tcpwave.com",
    "server_addr": "10.1.0.185",
    "scope_count": 245,
    "zoneRR_count": 4,
    "target_type": "Subnet Group",
    "target_name": "Load Simulation",
    "level": "Admin",
    "admin_group_name": "default",
    "short_name": "www",
    "rr_count": 5,
    "total_objzonerr": 35,
    "zone_count": 24,
    "subnet_id": 24,
    "producertype": "subnet_full_alert",
    "endDate": "11/1/2018",
    "startDate": "11/28/2016",
    "stats": "25",
    "date": "11/28/2018",
    "zone_id": 1001,
    "serialNumber": 2016153575,
    "refreshTime": 21600,
    "retryTime": 3600,
    "expireTime": 3600,
    "negativeCache": 604800,
    "view_name": "viewdemo",
    "match_destinations": "10.1.10.2",
    "match_clients": "10.1.10.2",
    "a_records": "10",
    "cname_req": "10",
    "mx_req": "10",
    "srv_req": "10",
    "txt_req": "10",
    "ptr": "10",
    "soa": "10",
    "aaaa": "10",
    "naptr": "10",
    "ns": "10",
    "dnskey": "10",
    "timestamp": "2019-02-04 05:24:00",
    "cache_dns_server": "10.1.2.182",
    "client_source_ip": "10.1.2.182",
    "serverIp": "10.11.10.2",
    "clientIp": "127.0.0.1",
    "fromtimestamp": "2019-02-04 05:24:00",
    "totimestamp": "2019-02-04 05:24:00",
    "totalfqdn": 10,
    "record_type": "SOA",
    "user": "John",
    "login_time": "2019-02-04 05:24:00",
    "logout_time": "2019-02-04 05:24:00",
    "ip_address": "10.2.6.4",
    "percentage": "10%",
    "vendor": "VMware, Inc.",
    "device": "Mac OS X",
    "change_ticket": "12345",
    "ofac_countries": "North Korea",
    "ofac_ip": "10.1.10.185",
    "ofac_name": "TCPWave00010Remote",
    "end_of_life": "2019-03-02",
    "time": "05:24:00",
    "updated_by": "John",
    "updated_time": "2019-02-04 05:24:00",
    "created_by": "John",
    "created_time": "2019-02-04 05:24:00",
    "zone_name": "abc.com",
    "deploy_date": "2019-02-22",
    "expire_date": "2019-02-22",
    "inactive_date": "2019-02-22",
    "is_ksk": "Yes/No",
    "phone_num": "7236985426",
    "ipv4": "10.2.3.5",
    "ipv6": "2000::",
    "fileName": "string",
    "isLoaded": "string"
  },
  {
    "action_time": "11/24/2016 15:18",
    "action_type": "Add/Modify/Deleted",
    "action_by": "john smith",
    "name": "tcpwave",
    "address": "10.0.1.1",
    "description": "A successful login event has been recorded.",
    "domain": "tcpwave",
    "hist_id": "45",
    "rows": 20,
    "email": "john@tcpwave.com",
    "percentagefull": "34",
    "email_notify": "No",
    "snmp_notify": "No",
    "log_notify": "No",
    "groupName": "group-1",
    "primaryRouter": "10.0.0.1",
    "location": "22 Main street, Atlantic city, sydney, South Australia-5540",
    "object_type": "CRM Server",
    "time_to_live": "1200",
    "alloc_type": "static",
    "operation": "Schedule Create",
    "role": "Functional Administrator",
    "networkAddress": "10.0.1.1/24",
    "subnetAddress": "10.0.1.1/16",
    "unusedObjects": "2047",
    "staticObjects": "30",
    "manualObjects": "1",
    "autoObjects": "0",
    "dynamicObjects": "28",
    "status": "Success",
    "remote_ip": "10.2.2.4",
    "login_name": "John Smith",
    "error_msg": "Job executed successfully.",
    "organization_name": "tcpwave",
    "template_name": "zone-template-1",
    "dnssec_enable": "No",
    "nsec_option": "Yes",
    "serial": "2016072939",
    "is_reverse_zone": "TRUE",
    "ad_enable": "yes",
    "secure_ad_enable": "no",
    "id": "45",
    "v4_ipaddress": "10.2.1.4",
    "v6_ipaddress": "5000::",
    "server_type": "BIND AUTH",
    "dns_server_template": "BIND AUTH1",
    "dns_option_template": "BIND AUTH Default Template",
    "dmz_visible": "Yes/No",
    "monitoring_service": "CHECK_MONIT",
    "enable_dynamic_updates": "No",
    "policy_template": "Clone-Policy-1",
    "preference": "Primary",
    "failover_server_details": "Primary Server : 10.1.1.18, Fail Over Server : 10.1.1.19, Primary Port :64, Fail Over Port : 64, Max Response Delay : 30, Max Unpacked Updates : 10, MCLT : 1800, SPLIT : 128, Load Balance Max Secs : 3",
    "template_status": "Active/Deleted",
    "logger": "named",
    "total": "47",
    "value": "60",
    "job_type": "Event",
    "jobId": "2452",
    "execution_time": "11/24/2016 15:18",
    "job_data": "{\"MajorVersion\":\"11\",\"ServerType\":\"DNS\",\"ZipFile\":\"IPAM_DNS_Patch002.zip\",\"PackageName\":\"TCPWaveDNS\",\"PatchLevel\":\"2\",\"PatchName\":\"DNS Test Patch 002\",\"MinorVersion\":\"8\",\"serverName\":\"server-name\",\"serverIp\":\"10.0.1.189\"}",
    "schedule_type": "One time Job",
    "run_day": "0",
    "repeat_count": "1",
    "extra_params": "sessionId:1fqu0o1howzbs1foextz3xz3pj userName:admin remoteAddress:10.2.2.1",
    "user_id": "4562",
    "execution_status": "Success",
    "vlan_id": "3456",
    "subnet_name": "subnet1",
    "subnet_address": "10.1.2.8",
    "primary_domain": "about-tcpwave.com",
    "dhcp_templ_name": "Generic",
    "owner": "www.tcpwave1.com.",
    "ttl": "5000",
    "owner_class": "BIND AUTH",
    "type": "A",
    "data": "192.168.101.2",
    "code": "BIND AUTH",
    "server_name": "server-name",
    "configData": "10.0.1.5/10.0.1.6/10.0.1.7/10.0.1.8",
    "configType": "BANNER",
    "email_id": "john@tcpwave.com",
    "admin_id": "432",
    "report_type": "dailyFunctionalAdminAuditRpt",
    "periods": "daily",
    "service_name": "External Authentication",
    "host_name": "ipam-234.tcpwave.com",
    "host_address": "10.0.0.1",
    "state": "Critical",
    "output": "CRITICAL: Failed to generate the DNSDR configuration. Exception: Table 'tims.tea_zone' doesn't exist",
    "objAddress": "10.0.0.2",
    "object_name": "object",
    "mac_address": "65:e1:44:a6:85:7b",
    "display_name": "Time Offset",
    "proxy": "0/1",
    "ipv4_address": "10.10.1.220",
    "config_name": "subnet-mask",
    "mask_length": "24",
    "subnet_addr": "10.0.0.0/24",
    "network_addr": "10.1.0.0/16",
    "scope": "10.1.12.17-10.1.12.18",
    "object_addr": "10.0.0.2",
    "class_code": "Domain Controller",
    "domain_name": "tcpwave.com",
    "mac": "00:0c:29:c5:68:5c",
    "obj_count": 24,
    "z_name": "tcpwave.com",
    "server_addr": "10.1.0.185",
    "scope_count": 245,
    "zoneRR_count": 4,
    "target_type": "Subnet Group",
    "target_name": "Load Simulation",
    "level": "Admin",
    "admin_group_name": "default",
    "short_name": "www",
    "rr_count": 5,
    "total_objzonerr": 35,
    "zone_count": 24,
    "subnet_id": 24,
    "producertype": "subnet_full_alert",
    "endDate": "11/1/2018",
    "startDate": "11/28/2016",
    "stats": "25",
    "date": "11/28/2018",
    "zone_id": 1001,
    "serialNumber": 2016153575,
    "refreshTime": 21600,
    "retryTime": 3600,
    "expireTime": 3600,
    "negativeCache": 604800,
    "view_name": "viewdemo",
    "match_destinations": "10.1.10.2",
    "match_clients": "10.1.10.2",
    "a_records": "10",
    "cname_req": "10",
    "mx_req": "10",
    "srv_req": "10",
    "txt_req": "10",
    "ptr": "10",
    "soa": "10",
    "aaaa": "10",
    "naptr": "10",
    "ns": "10",
    "dnskey": "10",
    "timestamp": "2019-02-04 05:24:00",
    "cache_dns_server": "10.1.2.182",
    "client_source_ip": "10.1.2.182",
    "serverIp": "10.11.10.2",
    "clientIp": "127.0.0.1",
    "fromtimestamp": "2019-02-04 05:24:00",
    "totimestamp": "2019-02-04 05:24:00",
    "totalfqdn": 10,
    "record_type": "SOA",
    "user": "John",
    "login_time": "2019-02-04 05:24:00",
    "logout_time": "2019-02-04 05:24:00",
    "ip_address": "10.2.6.4",
    "percentage": "10%",
    "vendor": "VMware, Inc.",
    "device": "Mac OS X",
    "change_ticket": "12345",
    "ofac_countries": "North Korea",
    "ofac_ip": "10.1.10.185",
    "ofac_name": "TCPWave00010Remote",
    "end_of_life": "2019-03-02",
    "time": "05:24:00",
    "updated_by": "John",
    "updated_time": "2019-02-04 05:24:00",
    "created_by": "John",
    "created_time": "2019-02-04 05:24:00",
    "zone_name": "abc.com",
    "deploy_date": "2019-02-22",
    "expire_date": "2019-02-22",
    "inactive_date": "2019-02-22",
    "is_ksk": "Yes/No",
    "phone_num": "7236985426",
    "ipv4": "10.2.3.5",
    "ipv6": "2000::",
    "fileName": "string",
    "isLoaded": "string"
  },
  {
    "action_time": "11/24/2016 15:18",
    "action_type": "Add/Modify/Deleted",
    "action_by": "john smith",
    "name": "tcpwave",
    "address": "10.0.1.1",
    "description": "A successful login event has been recorded.",
    "domain": "tcpwave",
    "hist_id": "45",
    "rows": 20,
    "email": "john@tcpwave.com",
    "percentagefull": "34",
    "email_notify": "No",
    "snmp_notify": "No",
    "log_notify": "No",
    "groupName": "group-1",
    "primaryRouter": "10.0.0.1",
    "location": "22 Main street, Atlantic city, sydney, South Australia-5540",
    "object_type": "CRM Server",
    "time_to_live": "1200",
    "alloc_type": "static",
    "operation": "Schedule Create",
    "role": "Functional Administrator",
    "networkAddress": "10.0.1.1/24",
    "subnetAddress": "10.0.1.1/16",
    "unusedObjects": "2047",
    "staticObjects": "30",
    "manualObjects": "1",
    "autoObjects": "0",
    "dynamicObjects": "28",
    "status": "Success",
    "remote_ip": "10.2.2.4",
    "login_name": "John Smith",
    "error_msg": "Job executed successfully.",
    "organization_name": "tcpwave",
    "template_name": "zone-template-1",
    "dnssec_enable": "No",
    "nsec_option": "Yes",
    "serial": "2016072939",
    "is_reverse_zone": "TRUE",
    "ad_enable": "yes",
    "secure_ad_enable": "no",
    "id": "45",
    "v4_ipaddress": "10.2.1.4",
    "v6_ipaddress": "5000::",
    "server_type": "BIND AUTH",
    "dns_server_template": "BIND AUTH1",
    "dns_option_template": "BIND AUTH Default Template",
    "dmz_visible": "Yes/No",
    "monitoring_service": "CHECK_MONIT",
    "enable_dynamic_updates": "No",
    "policy_template": "Clone-Policy-1",
    "preference": "Primary",
    "failover_server_details": "Primary Server : 10.1.1.18, Fail Over Server : 10.1.1.19, Primary Port :64, Fail Over Port : 64, Max Response Delay : 30, Max Unpacked Updates : 10, MCLT : 1800, SPLIT : 128, Load Balance Max Secs : 3",
    "template_status": "Active/Deleted",
    "logger": "named",
    "total": "47",
    "value": "60",
    "job_type": "Event",
    "jobId": "2452",
    "execution_time": "11/24/2016 15:18",
    "job_data": "{\"MajorVersion\":\"11\",\"ServerType\":\"DNS\",\"ZipFile\":\"IPAM_DNS_Patch002.zip\",\"PackageName\":\"TCPWaveDNS\",\"PatchLevel\":\"2\",\"PatchName\":\"DNS Test Patch 002\",\"MinorVersion\":\"8\",\"serverName\":\"server-name\",\"serverIp\":\"10.0.1.189\"}",
    "schedule_type": "One time Job",
    "run_day": "0",
    "repeat_count": "1",
    "extra_params": "sessionId:1fqu0o1howzbs1foextz3xz3pj userName:admin remoteAddress:10.2.2.1",
    "user_id": "4562",
    "execution_status": "Success",
    "vlan_id": "3456",
    "subnet_name": "subnet1",
    "subnet_address": "10.1.2.8",
    "primary_domain": "about-tcpwave.com",
    "dhcp_templ_name": "Generic",
    "owner": "www.tcpwave1.com.",
    "ttl": "5000",
    "owner_class": "BIND AUTH",
    "type": "A",
    "data": "192.168.101.2",
    "code": "BIND AUTH",
    "server_name": "server-name",
    "configData": "10.0.1.5/10.0.1.6/10.0.1.7/10.0.1.8",
    "configType": "BANNER",
    "email_id": "john@tcpwave.com",
    "admin_id": "432",
    "report_type": "dailyFunctionalAdminAuditRpt",
    "periods": "daily",
    "service_name": "External Authentication",
    "host_name": "ipam-234.tcpwave.com",
    "host_address": "10.0.0.1",
    "state": "Critical",
    "output": "CRITICAL: Failed to generate the DNSDR configuration. Exception: Table 'tims.tea_zone' doesn't exist",
    "objAddress": "10.0.0.2",
    "object_name": "object",
    "mac_address": "65:e1:44:a6:85:7b",
    "display_name": "Time Offset",
    "proxy": "0/1",
    "ipv4_address": "10.10.1.220",
    "config_name": "subnet-mask",
    "mask_length": "24",
    "subnet_addr": "10.0.0.0/24",
    "network_addr": "10.1.0.0/16",
    "scope": "10.1.12.17-10.1.12.18",
    "object_addr": "10.0.0.2",
    "class_code": "Domain Controller",
    "domain_name": "tcpwave.com",
    "mac": "00:0c:29:c5:68:5c",
    "obj_count": 24,
    "z_name": "tcpwave.com",
    "server_addr": "10.1.0.185",
    "scope_count": 245,
    "zoneRR_count": 4,
    "target_type": "Subnet Group",
    "target_name": "Load Simulation",
    "level": "Admin",
    "admin_group_name": "default",
    "short_name": "www",
    "rr_count": 5,
    "total_objzonerr": 35,
    "zone_count": 24,
    "subnet_id": 24,
    "producertype": "subnet_full_alert",
    "endDate": "11/1/2018",
    "startDate": "11/28/2016",
    "stats": "25",
    "date": "11/28/2018",
    "zone_id": 1001,
    "serialNumber": 2016153575,
    "refreshTime": 21600,
    "retryTime": 3600,
    "expireTime": 3600,
    "negativeCache": 604800,
    "view_name": "viewdemo",
    "match_destinations": "10.1.10.2",
    "match_clients": "10.1.10.2",
    "a_records": "10",
    "cname_req": "10",
    "mx_req": "10",
    "srv_req": "10",
    "txt_req": "10",
    "ptr": "10",
    "soa": "10",
    "aaaa": "10",
    "naptr": "10",
    "ns": "10",
    "dnskey": "10",
    "timestamp": "2019-02-04 05:24:00",
    "cache_dns_server": "10.1.2.182",
    "client_source_ip": "10.1.2.182",
    "serverIp": "10.11.10.2",
    "clientIp": "127.0.0.1",
    "fromtimestamp": "2019-02-04 05:24:00",
    "totimestamp": "2019-02-04 05:24:00",
    "totalfqdn": 10,
    "record_type": "SOA",
    "user": "John",
    "login_time": "2019-02-04 05:24:00",
    "logout_time": "2019-02-04 05:24:00",
    "ip_address": "10.2.6.4",
    "percentage": "10%",
    "vendor": "VMware, Inc.",
    "device": "Mac OS X",
    "change_ticket": "12345",
    "ofac_countries": "North Korea",
    "ofac_ip": "10.1.10.185",
    "ofac_name": "TCPWave00010Remote",
    "end_of_life": "2019-03-02",
    "time": "05:24:00",
    "updated_by": "John",
    "updated_time": "2019-02-04 05:24:00",
    "created_by": "John",
    "created_time": "2019-02-04 05:24:00",
    "zone_name": "abc.com",
    "deploy_date": "2019-02-22",
    "expire_date": "2019-02-22",
    "inactive_date": "2019-02-22",
    "is_ksk": "Yes/No",
    "phone_num": "7236985426",
    "ipv4": "10.2.3.5",
    "ipv6": "2000::",
    "fileName": "string",
    "isLoaded": "string"
  },
  {
    "action_time": "11/24/2016 15:18",
    "action_type": "Add/Modify/Deleted",
    "action_by": "john smith",
    "name": "tcpwave",
    "address": "10.0.1.1",
    "description": "A successful login event has been recorded.",
    "domain": "tcpwave",
    "hist_id": "45",
    "rows": 20,
    "email": "john@tcpwave.com",
    "percentagefull": "34",
    "email_notify": "No",
    "snmp_notify": "No",
    "log_notify": "No",
    "groupName": "group-1",
    "primaryRouter": "10.0.0.1",
    "location": "22 Main street, Atlantic city, sydney, South Australia-5540",
    "object_type": "CRM Server",
    "time_to_live": "1200",
    "alloc_type": "static",
    "operation": "Schedule Create",
    "role": "Functional Administrator",
    "networkAddress": "10.0.1.1/24",
    "subnetAddress": "10.0.1.1/16",
    "unusedObjects": "2047",
    "staticObjects": "30",
    "manualObjects": "1",
    "autoObjects": "0",
    "dynamicObjects": "28",
    "status": "Success",
    "remote_ip": "10.2.2.4",
    "login_name": "John Smith",
    "error_msg": "Job executed successfully.",
    "organization_name": "tcpwave",
    "template_name": "zone-template-1",
    "dnssec_enable": "No",
    "nsec_option": "Yes",
    "serial": "2016072939",
    "is_reverse_zone": "TRUE",
    "ad_enable": "yes",
    "secure_ad_enable": "no",
    "id": "45",
    "v4_ipaddress": "10.2.1.4",
    "v6_ipaddress": "5000::",
    "server_type": "BIND AUTH",
    "dns_server_template": "BIND AUTH1",
    "dns_option_template": "BIND AUTH Default Template",
    "dmz_visible": "Yes/No",
    "monitoring_service": "CHECK_MONIT",
    "enable_dynamic_updates": "No",
    "policy_template": "Clone-Policy-1",
    "preference": "Primary",
    "failover_server_details": "Primary Server : 10.1.1.18, Fail Over Server : 10.1.1.19, Primary Port :64, Fail Over Port : 64, Max Response Delay : 30, Max Unpacked Updates : 10, MCLT : 1800, SPLIT : 128, Load Balance Max Secs : 3",
    "template_status": "Active/Deleted",
    "logger": "named",
    "total": "47",
    "value": "60",
    "job_type": "Event",
    "jobId": "2452",
    "execution_time": "11/24/2016 15:18",
    "job_data": "{\"MajorVersion\":\"11\",\"ServerType\":\"DNS\",\"ZipFile\":\"IPAM_DNS_Patch002.zip\",\"PackageName\":\"TCPWaveDNS\",\"PatchLevel\":\"2\",\"PatchName\":\"DNS Test Patch 002\",\"MinorVersion\":\"8\",\"serverName\":\"server-name\",\"serverIp\":\"10.0.1.189\"}",
    "schedule_type": "One time Job",
    "run_day": "0",
    "repeat_count": "1",
    "extra_params": "sessionId:1fqu0o1howzbs1foextz3xz3pj userName:admin remoteAddress:10.2.2.1",
    "user_id": "4562",
    "execution_status": "Success",
    "vlan_id": "3456",
    "subnet_name": "subnet1",
    "subnet_address": "10.1.2.8",
    "primary_domain": "about-tcpwave.com",
    "dhcp_templ_name": "Generic",
    "owner": "www.tcpwave1.com.",
    "ttl": "5000",
    "owner_class": "BIND AUTH",
    "type": "A",
    "data": "192.168.101.2",
    "code": "BIND AUTH",
    "server_name": "server-name",
    "configData": "10.0.1.5/10.0.1.6/10.0.1.7/10.0.1.8",
    "configType": "BANNER",
    "email_id": "john@tcpwave.com",
    "admin_id": "432",
    "report_type": "dailyFunctionalAdminAuditRpt",
    "periods": "daily",
    "service_name": "External Authentication",
    "host_name": "ipam-234.tcpwave.com",
    "host_address": "10.0.0.1",
    "state": "Critical",
    "output": "CRITICAL: Failed to generate the DNSDR configuration. Exception: Table 'tims.tea_zone' doesn't exist",
    "objAddress": "10.0.0.2",
    "object_name": "object",
    "mac_address": "65:e1:44:a6:85:7b",
    "display_name": "Time Offset",
    "proxy": "0/1",
    "ipv4_address": "10.10.1.220",
    "config_name": "subnet-mask",
    "mask_length": "24",
    "subnet_addr": "10.0.0.0/24",
    "network_addr": "10.1.0.0/16",
    "scope": "10.1.12.17-10.1.12.18",
    "object_addr": "10.0.0.2",
    "class_code": "Domain Controller",
    "domain_name": "tcpwave.com",
    "mac": "00:0c:29:c5:68:5c",
    "obj_count": 24,
    "z_name": "tcpwave.com",
    "server_addr": "10.1.0.185",
    "scope_count": 245,
    "zoneRR_count": 4,
    "target_type": "Subnet Group",
    "target_name": "Load Simulation",
    "level": "Admin",
    "admin_group_name": "default",
    "short_name": "www",
    "rr_count": 5,
    "total_objzonerr": 35,
    "zone_count": 24,
    "subnet_id": 24,
    "producertype": "subnet_full_alert",
    "endDate": "11/1/2018",
    "startDate": "11/28/2016",
    "stats": "25",
    "date": "11/28/2018",
    "zone_id": 1001,
    "serialNumber": 2016153575,
    "refreshTime": 21600,
    "retryTime": 3600,
    "expireTime": 3600,
    "negativeCache": 604800,
    "view_name": "viewdemo",
    "match_destinations": "10.1.10.2",
    "match_clients": "10.1.10.2",
    "a_records": "10",
    "cname_req": "10",
    "mx_req": "10",
    "srv_req": "10",
    "txt_req": "10",
    "ptr": "10",
    "soa": "10",
    "aaaa": "10",
    "naptr": "10",
    "ns": "10",
    "dnskey": "10",
    "timestamp": "2019-02-04 05:24:00",
    "cache_dns_server": "10.1.2.182",
    "client_source_ip": "10.1.2.182",
    "serverIp": "10.11.10.2",
    "clientIp": "127.0.0.1",
    "fromtimestamp": "2019-02-04 05:24:00",
    "totimestamp": "2019-02-04 05:24:00",
    "totalfqdn": 10,
    "record_type": "SOA",
    "user": "John",
    "login_time": "2019-02-04 05:24:00",
    "logout_time": "2019-02-04 05:24:00",
    "ip_address": "10.2.6.4",
    "percentage": "10%",
    "vendor": "VMware, Inc.",
    "device": "Mac OS X",
    "change_ticket": "12345",
    "ofac_countries": "North Korea",
    "ofac_ip": "10.1.10.185",
    "ofac_name": "TCPWave00010Remote",
    "end_of_life": "2019-03-02",
    "time": "05:24:00",
    "updated_by": "John",
    "updated_time": "2019-02-04 05:24:00",
    "created_by": "John",
    "created_time": "2019-02-04 05:24:00",
    "zone_name": "abc.com",
    "deploy_date": "2019-02-22",
    "expire_date": "2019-02-22",
    "inactive_date": "2019-02-22",
    "is_ksk": "Yes/No",
    "phone_num": "7236985426",
    "ipv4": "10.2.3.5",
    "ipv6": "2000::",
    "fileName": "string",
    "isLoaded": "string"
  }
]