[
  {
    "id": 23,
    "token": "fhgh234hhjzdhnckm",
    "ip": "10.10.0.2",
    "generated_date": "03-11-2019",
    "active": true,
    "request_ip": "10.1.10.3",
    "request_user_id": 323,
    "application": "tims",
    "description": "Test",
    "validity": 30
  },
  {
    "id": 23,
    "token": "fhgh234hhjzdhnckm",
    "ip": "10.10.0.2",
    "generated_date": "03-11-2019",
    "active": true,
    "request_ip": "10.1.10.3",
    "request_user_id": 323,
    "application": "tims",
    "description": "Test",
    "validity": 30
  },
  {
    "id": 23,
    "token": "fhgh234hhjzdhnckm",
    "ip": "10.10.0.2",
    "generated_date": "03-11-2019",
    "active": true,
    "request_ip": "10.1.10.3",
    "request_user_id": 323,
    "application": "tims",
    "description": "Test",
    "validity": 30
  },
  {
    "id": 23,
    "token": "fhgh234hhjzdhnckm",
    "ip": "10.10.0.2",
    "generated_date": "03-11-2019",
    "active": true,
    "request_ip": "10.1.10.3",
    "request_user_id": 323,
    "application": "tims",
    "description": "Test",
    "validity": 30
  }
]