{
  "recordsTotal": 40,
  "recordsFiltered": 40,
  "data": [
    {
      "category": "string",
      "severity": "string",
      "serverIP": "string",
      "zoneName": "string",
      "macaddress": "string",
      "leasestartdate": "string",
      "id": "112",
      "description": "This log gives lease details.",
      "leaseenddate": "string",
      "type": "string",
      "logData": "string"
    },
    {
      "category": "string",
      "severity": "string",
      "serverIP": "string",
      "zoneName": "string",
      "macaddress": "string",
      "leasestartdate": "string",
      "id": "112",
      "description": "This log gives lease details.",
      "leaseenddate": "string",
      "type": "string",
      "logData": "string"
    },
    {
      "category": "string",
      "severity": "string",
      "serverIP": "string",
      "zoneName": "string",
      "macaddress": "string",
      "leasestartdate": "string",
      "id": "112",
      "description": "This log gives lease details.",
      "leaseenddate": "string",
      "type": "string",
      "logData": "string"
    },
    {
      "category": "string",
      "severity": "string",
      "serverIP": "string",
      "zoneName": "string",
      "macaddress": "string",
      "leasestartdate": "string",
      "id": "112",
      "description": "This log gives lease details.",
      "leaseenddate": "string",
      "type": "string",
      "logData": "string"
    }
  ]
}