{
  "actions": [
    {
      "name": "postWsdhcpserverDelete",
      "protocol": "REST",
      "method": "POST",
      "entitypath": "{base_path}/{version}/wsdhcpserver/delete?{query}",
      "requestSchema": "schema.json",
      "responseSchema": "schema.json",
      "timeout": 0,
      "sendEmpty": false,
      "sendGetBody": false,
      "requestDatatype": "JSON",
      "responseDatatype": "JSON",
      "headers": {},
      "responseObjects": [
        {
          "type": "default",
          "key": "",
          "mockFile": ""
        }
      ]
    },
    {
      "name": "getWsdhcpserverPage",
      "protocol": "REST",
      "method": "GET",
      "entitypath": "{base_path}/{version}/wsdhcpserver/page?{query}",
      "requestSchema": "schema.json",
      "responseSchema": "schema.json",
      "timeout": 0,
      "sendEmpty": false,
      "sendGetBody": false,
      "requestDatatype": "JSON",
      "responseDatatype": "JSON",
      "headers": {},
      "responseObjects": [
        {
          "type": "default",
          "key": "",
          "mockFile": "mockdatafiles/getWsdhcpserverPage-default.json"
        }
      ]
    },
    {
      "name": "getWsdhcpserverDhcpActiveLeases",
      "protocol": "REST",
      "method": "GET",
      "entitypath": "{base_path}/{version}/wsdhcpserver/dhcpActiveLeases?{query}",
      "requestSchema": "schema.json",
      "responseSchema": "schema.json",
      "timeout": 0,
      "sendEmpty": false,
      "sendGetBody": false,
      "requestDatatype": "JSON",
      "responseDatatype": "JSON",
      "headers": {},
      "responseObjects": [
        {
          "type": "default",
          "key": "",
          "mockFile": "mockdatafiles/getWsdhcpserverDhcpActiveLeases-default.json"
        }
      ]
    },
    {
      "name": "restartDHCPService",
      "protocol": "REST",
      "method": "GET",
      "entitypath": "{base_path}/{version}/wsdhcpserver/restartService?{query}",
      "requestSchema": "schema.json",
      "responseSchema": "schema.json",
      "timeout": 0,
      "sendEmpty": false,
      "sendGetBody": false,
      "requestDatatype": "JSON",
      "responseDatatype": "JSON",
      "headers": {},
      "responseObjects": [
        {
          "type": "default",
          "key": "",
          "mockFile": ""
        }
      ]
    },
    {
      "name": "syncConfig",
      "protocol": "REST",
      "method": "GET",
      "entitypath": "{base_path}/{version}/wsdhcpserver/syncConfig?{query}",
      "requestSchema": "schema.json",
      "responseSchema": "schema.json",
      "timeout": 0,
      "sendEmpty": false,
      "sendGetBody": false,
      "requestDatatype": "JSON",
      "responseDatatype": "JSON",
      "headers": {},
      "responseObjects": [
        {
          "type": "default",
          "key": "",
          "mockFile": ""
        }
      ]
    },
    {
      "name": "listServers",
      "protocol": "REST",
      "method": "GET",
      "entitypath": "{base_path}/{version}/wsdhcpserver/list?{query}",
      "requestSchema": "schema.json",
      "responseSchema": "schema.json",
      "timeout": 0,
      "sendEmpty": false,
      "sendGetBody": false,
      "requestDatatype": "JSON",
      "responseDatatype": "JSON",
      "headers": {},
      "responseObjects": [
        {
          "type": "default",
          "key": "",
          "mockFile": "mockdatafiles/listServers-default.json"
        }
      ]
    },
    {
      "name": "getApplianceDetails",
      "protocol": "REST",
      "method": "GET",
      "entitypath": "{base_path}/{version}/wsdhcpserver/getdetails?{query}",
      "requestSchema": "schema.json",
      "responseSchema": "schema.json",
      "timeout": 0,
      "sendEmpty": false,
      "sendGetBody": false,
      "requestDatatype": "JSON",
      "responseDatatype": "JSON",
      "headers": {},
      "responseObjects": [
        {
          "type": "default",
          "key": "",
          "mockFile": "mockdatafiles/getApplianceDetails-default.json"
        }
      ]
    },
    {
      "name": "updateDHCPappliance",
      "protocol": "REST",
      "method": "POST",
      "entitypath": "{base_path}/{version}/wsdhcpserver/update?{query}",
      "requestSchema": "schema.json",
      "responseSchema": "schema.json",
      "timeout": 0,
      "sendEmpty": false,
      "sendGetBody": false,
      "requestDatatype": "JSON",
      "responseDatatype": "JSON",
      "headers": {},
      "responseObjects": [
        {
          "type": "default",
          "key": "",
          "mockFile": ""
        }
      ]
    },
    {
      "name": "postWsdhcpserverAdd",
      "protocol": "REST",
      "method": "POST",
      "entitypath": "{base_path}/{version}/wsdhcpserver/add?{query}",
      "requestSchema": "schema.json",
      "responseSchema": "schema.json",
      "timeout": 0,
      "sendEmpty": false,
      "sendGetBody": false,
      "requestDatatype": "JSON",
      "responseDatatype": "JSON",
      "headers": {},
      "responseObjects": [
        {
          "type": "default",
          "key": "",
          "mockFile": ""
        }
      ]
    }
  ]
}