[
  {
    "id": 1,
    "name": "internal",
    "newName": "external",
    "matchClients": "[ACL1, ACL2, ACL3]",
    "matchDestinations": "[ACL1, ACL2, ACL3]",
    "matchClientsValue": "localhost;10.0.0.0/16",
    "matchDestinationsValue": "localhost;10.0.0.0/16",
    "organizationId": 1,
    "organizationName": "TCPWave",
    "createdBy": 1,
    "createdByName": "User1",
    "updatedBy": 1,
    "updatedByName": "1",
    "createdTime": "10/1/2016",
    "updatedTime": "10/2/2016",
    "createdTimeString": "10/1/2016 6:57",
    "updatedTimeString": "10/1/2016 6:57",
    "created_by_login_name": "string",
    "updated_by_login_name": "string",
    "sequence": 1,
    "geoType": "string",
    "matchGeoClients": "string",
    "matchGeoDestinations": "string"
  },
  {
    "id": 1,
    "name": "internal",
    "newName": "external",
    "matchClients": "[ACL1, ACL2, ACL3]",
    "matchDestinations": "[ACL1, ACL2, ACL3]",
    "matchClientsValue": "localhost;10.0.0.0/16",
    "matchDestinationsValue": "localhost;10.0.0.0/16",
    "organizationId": 1,
    "organizationName": "TCPWave",
    "createdBy": 1,
    "createdByName": "User1",
    "updatedBy": 1,
    "updatedByName": "1",
    "createdTime": "10/1/2016",
    "updatedTime": "10/2/2016",
    "createdTimeString": "10/1/2016 6:57",
    "updatedTimeString": "10/1/2016 6:57",
    "created_by_login_name": "string",
    "updated_by_login_name": "string",
    "sequence": 1,
    "geoType": "string",
    "matchGeoClients": "string",
    "matchGeoDestinations": "string"
  },
  {
    "id": 1,
    "name": "internal",
    "newName": "external",
    "matchClients": "[ACL1, ACL2, ACL3]",
    "matchDestinations": "[ACL1, ACL2, ACL3]",
    "matchClientsValue": "localhost;10.0.0.0/16",
    "matchDestinationsValue": "localhost;10.0.0.0/16",
    "organizationId": 1,
    "organizationName": "TCPWave",
    "createdBy": 1,
    "createdByName": "User1",
    "updatedBy": 1,
    "updatedByName": "1",
    "createdTime": "10/1/2016",
    "updatedTime": "10/2/2016",
    "createdTimeString": "10/1/2016 6:57",
    "updatedTimeString": "10/1/2016 6:57",
    "created_by_login_name": "string",
    "updated_by_login_name": "string",
    "sequence": 1,
    "geoType": "string",
    "matchGeoClients": "string",
    "matchGeoDestinations": "string"
  }
]