[
  {
    "id": 7,
    "countryName": "string",
    "countryCode": "string"
  },
  {
    "id": 1,
    "countryName": "string",
    "countryCode": "string"
  },
  {
    "id": 1,
    "countryName": "string",
    "countryCode": "string"
  }
]