{
  "total": 20,
  "recordsTotal": 40,
  "recordsFiltered": 40,
  "data": [
    {
      "id": 39447,
      "owner": "www.converge.com",
      "rrclass": "IN ",
      "rrtype": "CNAME",
      "ttl": 1200,
      "data": "string",
      "description": "Zone RR migrated to TCPWave IPAM by Professional Services.",
      "ipAddr": "192.168.1.43",
      "domain_id": 135978,
      "domain": "converge.com",
      "updated_by": "2019",
      "updated_time": "3/18/2016 4:37",
      "created_by": "2017",
      "created_time": "3/18/2016 3:39",
      "name": "cons.atcc.com.",
      "is_ad_rr": "No",
      "subnet_id": 318534,
      "network_id": 7939,
      "subnet_address": "10.10.0.0",
      "organization_id": 990,
      "organization_name": "EARTH",
      "is_external_rr": "No",
      "proxy": 1,
      "view_id": 21,
      "view_name": "Moscow",
      "viewList": "[Internal, Moscow]",
      "updated_time_string": "3/18/2016 4:37",
      "created_time_string": "3/18/2016 4:37",
      "created_by_login_name": "Stephen",
      "updated_by_login_name": "Stephen",
      "mask": 28,
      "extensions": [
        {
          "name": "RITS_ID-1",
          "value": "Admin/Network/Subnet"
        },
        {
          "name": "RITS_ID-1",
          "value": "Admin/Network/Subnet"
        },
        {
          "name": "RITS_ID-1",
          "value": "Admin/Network/Subnet"
        },
        {
          "name": "RITS_ID-1",
          "value": "Admin/Network/Subnet"
        },
        {
          "name": "RITS_ID-1",
          "value": "Admin/Network/Subnet"
        },
        {
          "name": "RITS_ID-1",
          "value": "Admin/Network/Subnet"
        },
        {
          "name": "RITS_ID-1",
          "value": "Admin/Network/Subnet"
        },
        {
          "name": "RITS_ID-1",
          "value": "Admin/Network/Subnet"
        },
        {
          "name": "RITS_ID-1",
          "value": "Admin/Network/Subnet"
        }
      ],
      "zoneName": "atcc.com",
      "networkAddress": "10.0.0.0"
    },
    {
      "id": 39447,
      "owner": "www.converge.com",
      "rrclass": "IN ",
      "rrtype": "CNAME",
      "ttl": 1200,
      "data": "string",
      "description": "Zone RR migrated to TCPWave IPAM by Professional Services.",
      "ipAddr": "192.168.1.43",
      "domain_id": 135978,
      "domain": "converge.com",
      "updated_by": "2019",
      "updated_time": "3/18/2016 4:37",
      "created_by": "2017",
      "created_time": "3/18/2016 3:39",
      "name": "cons.atcc.com.",
      "is_ad_rr": "No",
      "subnet_id": 318534,
      "network_id": 7939,
      "subnet_address": "10.10.0.0",
      "organization_id": 990,
      "organization_name": "EARTH",
      "is_external_rr": "No",
      "proxy": 1,
      "view_id": 21,
      "view_name": "Moscow",
      "viewList": "[Internal, Moscow]",
      "updated_time_string": "3/18/2016 4:37",
      "created_time_string": "3/18/2016 4:37",
      "created_by_login_name": "Stephen",
      "updated_by_login_name": "Stephen",
      "mask": 28,
      "extensions": [
        {
          "name": "RITS_ID-1",
          "value": "Admin/Network/Subnet"
        },
        {
          "name": "RITS_ID-1",
          "value": "Admin/Network/Subnet"
        },
        {
          "name": "RITS_ID-1",
          "value": "Admin/Network/Subnet"
        },
        {
          "name": "RITS_ID-1",
          "value": "Admin/Network/Subnet"
        },
        {
          "name": "RITS_ID-1",
          "value": "Admin/Network/Subnet"
        },
        {
          "name": "RITS_ID-1",
          "value": "Admin/Network/Subnet"
        },
        {
          "name": "RITS_ID-1",
          "value": "Admin/Network/Subnet"
        }
      ],
      "zoneName": "atcc.com",
      "networkAddress": "10.0.0.0"
    },
    {
      "id": 39447,
      "owner": "www.converge.com",
      "rrclass": "IN ",
      "rrtype": "CNAME",
      "ttl": 1200,
      "data": "string",
      "description": "Zone RR migrated to TCPWave IPAM by Professional Services.",
      "ipAddr": "192.168.1.43",
      "domain_id": 135978,
      "domain": "converge.com",
      "updated_by": "2019",
      "updated_time": "3/18/2016 4:37",
      "created_by": "2017",
      "created_time": "3/18/2016 3:39",
      "name": "cons.atcc.com.",
      "is_ad_rr": "No",
      "subnet_id": 318534,
      "network_id": 7939,
      "subnet_address": "10.10.0.0",
      "organization_id": 990,
      "organization_name": "EARTH",
      "is_external_rr": "No",
      "proxy": 1,
      "view_id": 21,
      "view_name": "Moscow",
      "viewList": "[Internal, Moscow]",
      "updated_time_string": "3/18/2016 4:37",
      "created_time_string": "3/18/2016 4:37",
      "created_by_login_name": "Stephen",
      "updated_by_login_name": "Stephen",
      "mask": 28,
      "extensions": [
        {
          "name": "RITS_ID-1",
          "value": "Admin/Network/Subnet"
        },
        {
          "name": "RITS_ID-1",
          "value": "Admin/Network/Subnet"
        },
        {
          "name": "RITS_ID-1",
          "value": "Admin/Network/Subnet"
        },
        {
          "name": "RITS_ID-1",
          "value": "Admin/Network/Subnet"
        }
      ],
      "zoneName": "atcc.com",
      "networkAddress": "10.0.0.0"
    },
    {
      "id": 39447,
      "owner": "www.converge.com",
      "rrclass": "IN ",
      "rrtype": "CNAME",
      "ttl": 1200,
      "data": "string",
      "description": "Zone RR migrated to TCPWave IPAM by Professional Services.",
      "ipAddr": "192.168.1.43",
      "domain_id": 135978,
      "domain": "converge.com",
      "updated_by": "2019",
      "updated_time": "3/18/2016 4:37",
      "created_by": "2017",
      "created_time": "3/18/2016 3:39",
      "name": "cons.atcc.com.",
      "is_ad_rr": "No",
      "subnet_id": 318534,
      "network_id": 7939,
      "subnet_address": "10.10.0.0",
      "organization_id": 990,
      "organization_name": "EARTH",
      "is_external_rr": "No",
      "proxy": 1,
      "view_id": 21,
      "view_name": "Moscow",
      "viewList": "[Internal, Moscow]",
      "updated_time_string": "3/18/2016 4:37",
      "created_time_string": "3/18/2016 4:37",
      "created_by_login_name": "Stephen",
      "updated_by_login_name": "Stephen",
      "mask": 28,
      "extensions": [
        {
          "name": "RITS_ID-1",
          "value": "Admin/Network/Subnet"
        },
        {
          "name": "RITS_ID-1",
          "value": "Admin/Network/Subnet"
        },
        {
          "name": "RITS_ID-1",
          "value": "Admin/Network/Subnet"
        },
        {
          "name": "RITS_ID-1",
          "value": "Admin/Network/Subnet"
        },
        {
          "name": "RITS_ID-1",
          "value": "Admin/Network/Subnet"
        },
        {
          "name": "RITS_ID-1",
          "value": "Admin/Network/Subnet"
        },
        {
          "name": "RITS_ID-1",
          "value": "Admin/Network/Subnet"
        },
        {
          "name": "RITS_ID-1",
          "value": "Admin/Network/Subnet"
        },
        {
          "name": "RITS_ID-1",
          "value": "Admin/Network/Subnet"
        },
        {
          "name": "RITS_ID-1",
          "value": "Admin/Network/Subnet"
        }
      ],
      "zoneName": "atcc.com",
      "networkAddress": "10.0.0.0"
    },
    {
      "id": 39447,
      "owner": "www.converge.com",
      "rrclass": "IN ",
      "rrtype": "CNAME",
      "ttl": 1200,
      "data": "string",
      "description": "Zone RR migrated to TCPWave IPAM by Professional Services.",
      "ipAddr": "192.168.1.43",
      "domain_id": 135978,
      "domain": "converge.com",
      "updated_by": "2019",
      "updated_time": "3/18/2016 4:37",
      "created_by": "2017",
      "created_time": "3/18/2016 3:39",
      "name": "cons.atcc.com.",
      "is_ad_rr": "No",
      "subnet_id": 318534,
      "network_id": 7939,
      "subnet_address": "10.10.0.0",
      "organization_id": 990,
      "organization_name": "EARTH",
      "is_external_rr": "No",
      "proxy": 1,
      "view_id": 21,
      "view_name": "Moscow",
      "viewList": "[Internal, Moscow]",
      "updated_time_string": "3/18/2016 4:37",
      "created_time_string": "3/18/2016 4:37",
      "created_by_login_name": "Stephen",
      "updated_by_login_name": "Stephen",
      "mask": 28,
      "extensions": [
        {
          "name": "RITS_ID-1",
          "value": "Admin/Network/Subnet"
        },
        {
          "name": "RITS_ID-1",
          "value": "Admin/Network/Subnet"
        },
        {
          "name": "RITS_ID-1",
          "value": "Admin/Network/Subnet"
        },
        {
          "name": "RITS_ID-1",
          "value": "Admin/Network/Subnet"
        },
        {
          "name": "RITS_ID-1",
          "value": "Admin/Network/Subnet"
        },
        {
          "name": "RITS_ID-1",
          "value": "Admin/Network/Subnet"
        }
      ],
      "zoneName": "atcc.com",
      "networkAddress": "10.0.0.0"
    }
  ]
}