{
  "expiry": "string",
  "cust": "string",
  "custId": "string",
  "ip": "string",
  "maxIPs": 10,
  "licenseValid": "string",
  "serviceTag": "string",
  "haEnabled": false,
  "expiryString": "string",
  "daysToExpiry": 8
}