{
  "actions": [
    {
      "name": "getCloudAttributeNames",
      "protocol": "REST",
      "method": "GET",
      "entitypath": "{base_path}/{version}/importcloud/attr?{query}",
      "requestSchema": "schema.json",
      "responseSchema": "schema.json",
      "timeout": 0,
      "sendEmpty": false,
      "sendGetBody": false,
      "requestDatatype": "JSON",
      "responseDatatype": "JSON",
      "headers": {},
      "responseObjects": [
        {
          "type": "default",
          "key": "",
          "mockFile": "mockdatafiles/getCloudAttributeNames-default.json"
        }
      ]
    },
    {
      "name": "getClousHostedSubnets",
      "protocol": "REST",
      "method": "GET",
      "entitypath": "{base_path}/{version}/importcloud/subnet/page?{query}",
      "requestSchema": "schema.json",
      "responseSchema": "schema.json",
      "timeout": 0,
      "sendEmpty": false,
      "sendGetBody": false,
      "requestDatatype": "JSON",
      "responseDatatype": "JSON",
      "headers": {},
      "responseObjects": [
        {
          "type": "default",
          "key": "",
          "mockFile": "mockdatafiles/getClousHostedSubnets-default.json"
        }
      ]
    },
    {
      "name": "updateAutoImportSubnets",
      "protocol": "REST",
      "method": "POST",
      "entitypath": "{base_path}/{version}/importcloud/updateAutoImportSubnets?{query}",
      "requestSchema": "schema.json",
      "responseSchema": "schema.json",
      "timeout": 0,
      "sendEmpty": false,
      "sendGetBody": false,
      "requestDatatype": "JSON",
      "responseDatatype": "JSON",
      "headers": {},
      "responseObjects": [
        {
          "type": "default",
          "key": "",
          "mockFile": ""
        }
      ]
    },
    {
      "name": "doImport",
      "protocol": "REST",
      "method": "POST",
      "entitypath": "{base_path}/{version}/importcloud/import?{query}",
      "requestSchema": "schema.json",
      "responseSchema": "schema.json",
      "timeout": 0,
      "sendEmpty": false,
      "sendGetBody": false,
      "requestDatatype": "JSON",
      "responseDatatype": "JSON",
      "headers": {},
      "responseObjects": [
        {
          "type": "default",
          "key": "",
          "mockFile": "mockdatafiles/doImport-default.json"
        }
      ]
    }
  ]
}