[
  {
    "serverId": 17,
    "zoneName": "edu.com",
    "forward": "only/first",
    "forwardersIPv4": "192.1.100.10",
    "forwardersIPv6": "2001:503:ba3e::2:30",
    "description": "Corp. DNS Appliance migrated to TCPWave IPAM by Professional Services.",
    "serverV4Addr": "192.168.1.200",
    "serverType": "BIND AUTH",
    "serverForwarders": 10
  },
  {
    "serverId": 17,
    "zoneName": "edu.com",
    "forward": "only/first",
    "forwardersIPv4": "192.1.100.10",
    "forwardersIPv6": "2001:503:ba3e::2:30",
    "description": "Corp. DNS Appliance migrated to TCPWave IPAM by Professional Services.",
    "serverV4Addr": "192.168.1.200",
    "serverType": "BIND AUTH",
    "serverForwarders": 3
  },
  {
    "serverId": 17,
    "zoneName": "edu.com",
    "forward": "only/first",
    "forwardersIPv4": "192.1.100.10",
    "forwardersIPv6": "2001:503:ba3e::2:30",
    "description": "Corp. DNS Appliance migrated to TCPWave IPAM by Professional Services.",
    "serverV4Addr": "192.168.1.200",
    "serverType": "BIND AUTH",
    "serverForwarders": 6
  }
]