{
  "$id": "schema.json",
  "type": "object",
  "schema": "http://json-schema.org/draft-07/schema#",
  "translate": true,
  "dynamicfields": true,
  "properties": {
    "ph_request_type": {
      "type": "string",
      "description": "type of request (internal to adapter)",
      "default": "getScopeList",
      "enum": [
        "getScopeList",
        "createScope",
        "postScopeDelete",
        "getScopeValidateRequest"
      ],
      "external_name": "ph_request_type"
    },
    "orgName": {
      "type": "string",
      "description": "Organization name",
      "parse": false,
      "encode": false,
      "encrypt": {
        "type": "AES",
        "key": ""
      },
      "external_name": "org_name"
    },
    "minAddr": {
      "type": "string",
      "description": "Starting Address in Scope",
      "parse": false,
      "encode": false,
      "encrypt": {
        "type": "AES",
        "key": ""
      },
      "external_name": "min_addr"
    },
    "maxAddr": {
      "type": "string",
      "description": "Ending Address in Scope",
      "parse": false,
      "encode": false,
      "encrypt": {
        "type": "AES",
        "key": ""
      },
      "external_name": "max_addr"
    }
  },
  "definitions": {}
}