[
  {
    "cert_name": "User_Certificate",
    "serial_number": "12345",
    "issuer": "string",
    "valid_from": "5/18/2018",
    "valid_to": "5/17/2019",
    "valid": true
  },
  {
    "cert_name": "User_Certificate",
    "serial_number": "12345",
    "issuer": "string",
    "valid_from": "5/18/2018",
    "valid_to": "5/17/2019",
    "valid": true
  }
]