{
  "id": 2,
  "cert_name": "string",
  "cn": "string",
  "serial_number": "string",
  "issuer": "string",
  "validity": "string",
  "valid_from": "string",
  "valid_to": "string",
  "cert_details": "string",
  "info": [
    "string",
    "string"
  ],
  "valid": true,
  "errMsg": "string"
}