{
  "actions": [
    {
      "name": "getAllCerts",
      "protocol": "REST",
      "method": "GET",
      "entitypath": "{base_path}/{version}/certmgmt/certlist?{query}",
      "requestSchema": "schema.json",
      "responseSchema": "schema.json",
      "timeout": 0,
      "sendEmpty": false,
      "sendGetBody": false,
      "requestDatatype": "JSON",
      "responseDatatype": "JSON",
      "headers": {},
      "responseObjects": [
        {
          "type": "default",
          "key": "",
          "mockFile": "mockdatafiles/getAllCerts-default.json"
        }
      ]
    },
    {
      "name": "getNumberOfDays",
      "protocol": "REST",
      "method": "GET",
      "entitypath": "{base_path}/{version}/certmgmt/certValidDays?{query}",
      "requestSchema": "schema.json",
      "responseSchema": "schema.json",
      "timeout": 0,
      "sendEmpty": false,
      "sendGetBody": false,
      "requestDatatype": "JSON",
      "responseDatatype": "JSON",
      "headers": {},
      "responseObjects": [
        {
          "type": "default",
          "key": "",
          "mockFile": ""
        }
      ]
    },
    {
      "name": "duplicateAliasCheck",
      "protocol": "REST",
      "method": "POST",
      "entitypath": "{base_path}/{version}/certmgmt/duplicateAlias?{query}",
      "requestSchema": "schema.json",
      "responseSchema": "schema.json",
      "timeout": 0,
      "sendEmpty": false,
      "sendGetBody": false,
      "requestDatatype": "JSON",
      "responseDatatype": "JSON",
      "headers": {},
      "responseObjects": [
        {
          "type": "default",
          "key": "",
          "mockFile": ""
        }
      ]
    },
    {
      "name": "certificateValidate",
      "protocol": "REST",
      "method": "GET",
      "entitypath": "{base_path}/{version}/certmgmt/certValidate?{query}",
      "requestSchema": "schema.json",
      "responseSchema": "schema.json",
      "timeout": 0,
      "sendEmpty": false,
      "sendGetBody": false,
      "requestDatatype": "JSON",
      "responseDatatype": "JSON",
      "headers": {},
      "responseObjects": [
        {
          "type": "default",
          "key": "",
          "mockFile": "mockdatafiles/certificateValidate-default.json"
        }
      ]
    },
    {
      "name": "allcertValidDays",
      "protocol": "REST",
      "method": "GET",
      "entitypath": "{base_path}/{version}/certmgmt/allcertValidDays?{query}",
      "requestSchema": "schema.json",
      "responseSchema": "schema.json",
      "timeout": 0,
      "sendEmpty": false,
      "sendGetBody": false,
      "requestDatatype": "JSON",
      "responseDatatype": "JSON",
      "headers": {},
      "responseObjects": [
        {
          "type": "default",
          "key": "",
          "mockFile": "mockdatafiles/allcertValidDays-default.json"
        }
      ]
    },
    {
      "name": "certificateImport",
      "protocol": "REST",
      "method": "POST",
      "entitypath": "{base_path}/{version}/certmgmt/certImport?{query}",
      "requestSchema": "schema.json",
      "responseSchema": "schema.json",
      "timeout": 0,
      "sendEmpty": false,
      "sendGetBody": false,
      "requestDatatype": "JSON",
      "responseDatatype": "JSON",
      "headers": {},
      "responseObjects": [
        {
          "type": "default",
          "key": "",
          "mockFile": ""
        }
      ]
    },
    {
      "name": "certificateDelete",
      "protocol": "REST",
      "method": "POST",
      "entitypath": "{base_path}/{version}/certmgmt/certDelete?{query}",
      "requestSchema": "schema.json",
      "responseSchema": "schema.json",
      "timeout": 0,
      "sendEmpty": false,
      "sendGetBody": false,
      "requestDatatype": "JSON",
      "responseDatatype": "JSON",
      "headers": {},
      "responseObjects": [
        {
          "type": "default",
          "key": "",
          "mockFile": ""
        }
      ]
    },
    {
      "name": "changeKeystorePassword",
      "protocol": "REST",
      "method": "POST",
      "entitypath": "{base_path}/{version}/certmgmt/changeKeystorePassword?{query}",
      "requestSchema": "schema.json",
      "responseSchema": "schema.json",
      "timeout": 0,
      "sendEmpty": false,
      "sendGetBody": false,
      "requestDatatype": "JSON",
      "responseDatatype": "JSON",
      "headers": {},
      "responseObjects": [
        {
          "type": "default",
          "key": "",
          "mockFile": ""
        }
      ]
    },
    {
      "name": "jettyRestart",
      "protocol": "REST",
      "method": "POST",
      "entitypath": "{base_path}/{version}/certmgmt/jettyRestart?{query}",
      "requestSchema": "schema.json",
      "responseSchema": "schema.json",
      "timeout": 0,
      "sendEmpty": false,
      "sendGetBody": false,
      "requestDatatype": "JSON",
      "responseDatatype": "JSON",
      "headers": {},
      "responseObjects": [
        {
          "type": "default",
          "key": "",
          "mockFile": ""
        }
      ]
    }
  ]
}