{
  "actions": [
    {
      "name": "getVmwareAuthtypelist",
      "protocol": "REST",
      "method": "GET",
      "entitypath": "{base_path}/{version}/vmware/authtypelist?{query}",
      "requestSchema": "schema.json",
      "responseSchema": "schema.json",
      "timeout": 0,
      "sendEmpty": false,
      "sendGetBody": false,
      "requestDatatype": "JSON",
      "responseDatatype": "JSON",
      "headers": {},
      "responseObjects": [
        {
          "type": "default",
          "key": "",
          "mockFile": "mockdatafiles/getVmwareAuthtypelist-default.json"
        }
      ]
    },
    {
      "name": "getAuthSource",
      "protocol": "REST",
      "method": "GET",
      "entitypath": "{base_path}/{version}/vmware/authsource?{query}",
      "requestSchema": "schema.json",
      "responseSchema": "schema.json",
      "timeout": 0,
      "sendEmpty": false,
      "sendGetBody": false,
      "requestDatatype": "JSON",
      "responseDatatype": "JSON",
      "headers": {},
      "responseObjects": [
        {
          "type": "default",
          "key": "",
          "mockFile": "mockdatafiles/getAuthSource-default.json"
        }
      ]
    }
  ]
}