{
  "$id": "schema.json",
  "type": "object",
  "schema": "http://json-schema.org/draft-07/schema#",
  "translate": false,
  "dynamicfields": true,
  "properties": {
    "ph_request_type": {
      "type": "string",
      "description": "type of request (internal to adapter)",
      "default": "getSubnet",
      "enum": [
        "getSubnet",
        "deleteSubnet",
        "getSubnetUsage",
        "getSubnetFirstFree",
        "getSubnetSlaves",
        "getSubnetSlavesRecursive",
        "getSubnetAddresses",
        "getSubnetIPAddress",
        "getSubnetFirstAvailable",
        "createSubnetInsideSubnet",
        "getSubnetAllAvailable",
        "getSubnetCustomFields",
        "getSubnetCIDR",
        "getSubnetCIDRSearch",
        "createSubnet",
        "updateSubnet",
        "updateSubnetMaskSize",
        "updateSubnetSplit",
        "udpateSubnetPermissions",
        "deleteSubnetPermissions",
        "deleteSubnetAddresses"
      ],
      "external_name": "ph_request_type"
    }
  },
  "definitions": {}
}