{
  "errors": [],
  "statistics": [
    {
      "owner": "errorJson",
      "description": "New adapter errors available for use",
      "value": 0
    },
    {
      "owner": "errorJson",
      "description": "Adapter errors no longer available for use",
      "value": 0
    },
    {
      "owner": "errorJson",
      "description": "Adapter errors that have been updated (e.g. recommendation changes)",
      "value": 29
    },
    {
      "owner": "packageJson",
      "description": "Number of production dependencies",
      "value": 6
    },
    {
      "owner": "packageJson",
      "description": "Number of development dependencies",
      "value": 9
    },
    {
      "owner": "packageJson",
      "description": "Number of npm scripts",
      "value": 9
    },
    {
      "owner": "packageJson",
      "description": "Runtime Library dependency",
      "value": "^4.27.3"
    },
    {
      "owner": "propertiesSchemaJson",
      "description": "Adapter properties defined in the propertiesSchema file",
      "value": 54
    },
    {
      "owner": "readmeMd",
      "description": "Number of lines in the README.md",
      "value": 486
    },
    {
      "owner": "unitTestJS",
      "description": "Number of lines of code in unit tests",
      "value": 93218
    },
    {
      "owner": "unitTestJS",
      "description": "Number of unit tests",
      "value": 5876
    },
    {
      "owner": "integrationTestJS",
      "description": "Number of lines of code in integration tests",
      "value": 39594
    },
    {
      "owner": "integrationTestJS",
      "description": "Number of integration tests",
      "value": 1388
    },
    {
      "owner": "staticFile",
      "description": "Number of lines of code in adapterBase.js",
      "value": 502
    },
    {
      "owner": "staticFile",
      "description": "Number of static files added",
      "value": 18
    },
    {
      "owner": "Overall",
      "description": "Total lines of Code",
      "value": 133314
    },
    {
      "owner": "Overall",
      "description": "Total Tests",
      "value": 7264
    },
    {
      "owner": "Overall",
      "description": "Total Files",
      "value": 6
    }
  ]
}