{
  "two_factor_auth": {
    "secret": "string",
    "type": "string"
  },
  "name": "string",
  "id": "string",
  "user": "string",
  "key": "string",
  "last_access": "string",
  "password": "string",
  "email": "string"
}