{
  "swagger" : "2.0",
  "info" : {
    "version" : "1.0.0",
    "title" : "NS1_Enterprise",
    "termsOfService" : "http://swagger.io/terms/",
    "contact" : {
      "email" : "support@itential.com"
    },
    "license" : {
      "name" : "Apache 2.0",
      "url" : "http://www.apache.org/licenses/LICENSE-2.0.html"
    }
  },
  "host" : "api.mycompany.net",
  "basePath" : "/v1/",
  "tags" : [ {
    "name" : "Operations",
    "description" : "Manager Operations"
  }, {
    "name" : "Service Definitions",
    "description" : "Manage Service Definitions"
  }, {
    "name" : "Service Groups",
    "description" : "Manage Service Groups"
  }, {
    "name" : "IPAM",
    "description" : "IP Address Management"
  }, {
    "name" : "DHCP",
    "description" : "DHCP"
  }, {
    "name" : "Active Directory",
    "description" : "Configure an Active Directory server configuration for the organization for using Active Directory authentication and role-based access controls."
  } ],
  "schemes" : [ "https" ],
  "paths" : {
    "/ops/bootstrap" : {
      "post" : {
        "tags" : [ "Operations" ],
        "summary" : "Bootstrap the first operator user",
        "description" : "When no operator users exist in the main database, the bootstrap endpoint is enabled. This is the only endpoint which does not require authentication. Note: Bootstrap can only be performed once. If the returned API key is lost, the system must be deployed again.",
        "parameters" : [ {
          "in" : "body",
          "name" : "body",
          "required" : true,
          "schema" : {
            "$ref" : "#/definitions/OperatorUser"
          }
        } ],
        "responses" : {
          "200" : {
            "description" : "successful operation",
            "schema" : {
              "$ref" : "#/definitions/NewOperatorUser"
            }
          },
          "400" : {
            "description" : "failed operation"
          }
        }
      }
    },
    "/ops/operators" : {
      "get" : {
        "tags" : [ "Operations" ],
        "summary" : "View all operator users",
        "description" : "Returns a list of all operator users in the system.",
        "parameters" : [ ],
        "responses" : {
          "200" : {
            "description" : "successful operation",
            "schema" : {
              "type" : "array",
              "items" : {
                "$ref" : "#/definitions/OperatorUser"
              }
            }
          },
          "400" : {
            "description" : "failed operation"
          }
        }
      },
      "put" : {
        "tags" : [ "Operations" ],
        "summary" : "Create a new operator user",
        "description" : "Create a new operator user for the system. In addition to creating other operators, organizations, and services; operators can act as administrators on behalf of any organization in the system where users within a tenant organization only have access to that organization’s resources (e.g. zones, records, API keys, etc.).",
        "parameters" : [ {
          "in" : "body",
          "name" : "body",
          "required" : true,
          "schema" : {
            "$ref" : "#/definitions/OperatorUser"
          }
        } ],
        "responses" : {
          "200" : {
            "description" : "successful operation",
            "schema" : {
              "$ref" : "#/definitions/OperatorUser"
            }
          },
          "400" : {
            "description" : "failed operation"
          }
        }
      }
    },
    "/ops/operators/{operator-id}" : {
      "get" : {
        "tags" : [ "Operations" ],
        "summary" : "View operator details",
        "description" : "Returns information about the operator user.",
        "parameters" : [ {
          "name" : "operator-id",
          "in" : "path",
          "description" : "Operator ID",
          "required" : true,
          "type" : "string"
        } ],
        "responses" : {
          "200" : {
            "description" : "successful operation",
            "schema" : {
              "$ref" : "#/definitions/OperatorUser"
            }
          },
          "400" : {
            "description" : "failed operation"
          }
        }
      },
      "post" : {
        "tags" : [ "Operations" ],
        "summary" : "Modify details of an operator",
        "description" : "Updates an operator's information.",
        "parameters" : [ {
          "name" : "operator-id",
          "in" : "path",
          "description" : "Operator ID",
          "required" : true,
          "type" : "string"
        }, {
          "in" : "body",
          "name" : "body",
          "required" : true,
          "schema" : {
            "$ref" : "#/definitions/OperatorUser"
          }
        } ],
        "responses" : {
          "200" : {
            "description" : "successful operation",
            "schema" : {
              "$ref" : "#/definitions/OperatorUser"
            }
          },
          "400" : {
            "description" : "failed operation"
          }
        }
      },
      "delete" : {
        "tags" : [ "Operations" ],
        "summary" : "Delete an operator",
        "description" : "Removes another operator from the system. An operator cannot remove themselves.",
        "parameters" : [ {
          "name" : "operator-id",
          "in" : "path",
          "description" : "Operator ID",
          "required" : true,
          "type" : "string"
        } ],
        "responses" : {
          "200" : {
            "description" : "successful operation"
          },
          "400" : {
            "description" : "failed operation"
          }
        }
      }
    },
    "/ops/orgs" : {
      "get" : {
        "tags" : [ "Operations" ],
        "summary" : "View a list of organizations",
        "description" : "Returns a list of the tenant organizations.",
        "parameters" : [ ],
        "responses" : {
          "200" : {
            "description" : "successful operation",
            "schema" : {
              "type" : "array",
              "items" : {
                "$ref" : "#/definitions/Organization"
              }
            }
          },
          "400" : {
            "description" : "failed operation"
          }
        }
      },
      "put" : {
        "tags" : [ "Operations" ],
        "summary" : "Create an organization",
        "description" : "Create a new tenant organization.",
        "parameters" : [ {
          "in" : "body",
          "name" : "body",
          "required" : true,
          "schema" : {
            "$ref" : "#/definitions/Organization"
          }
        } ],
        "responses" : {
          "200" : {
            "description" : "successful operation",
            "schema" : {
              "$ref" : "#/definitions/Organization"
            }
          },
          "400" : {
            "description" : "failed operation"
          }
        }
      }
    },
    "/ops/orgs/{orgid}" : {
      "get" : {
        "tags" : [ "Operations" ],
        "summary" : "View organization details",
        "description" : "Returns the details of an organization.",
        "parameters" : [ {
          "name" : "orgid",
          "in" : "path",
          "description" : "Organization ID",
          "required" : true,
          "type" : "integer"
        } ],
        "responses" : {
          "200" : {
            "description" : "successful operation",
            "schema" : {
              "$ref" : "#/definitions/Organization"
            }
          },
          "400" : {
            "description" : "failed operation"
          }
        }
      },
      "post" : {
        "tags" : [ "Operations" ],
        "summary" : "Modify an organization",
        "description" : "Modify the organization's name.",
        "parameters" : [ {
          "name" : "orgid",
          "in" : "path",
          "description" : "Organization ID",
          "required" : true,
          "type" : "integer"
        }, {
          "in" : "body",
          "name" : "body",
          "required" : true,
          "schema" : {
            "$ref" : "#/definitions/Organization"
          }
        } ],
        "responses" : {
          "200" : {
            "description" : "successful operation",
            "schema" : {
              "$ref" : "#/definitions/Organization"
            }
          },
          "400" : {
            "description" : "failed operation"
          }
        }
      },
      "delete" : {
        "tags" : [ "Operations" ],
        "summary" : "Delete an organization",
        "description" : "Delete a tenant organization. This operation requires adding the token parameter with the operator's 2FA TOTP token.",
        "parameters" : [ {
          "name" : "orgid",
          "in" : "path",
          "description" : "Organization ID",
          "required" : true,
          "type" : "integer"
        }, {
          "name" : "token",
          "in" : "query",
          "description" : "2FA TOTP token",
          "required" : true,
          "type" : "string"
        } ],
        "responses" : {
          "200" : {
            "description" : "successful operation"
          },
          "400" : {
            "description" : "failed operation"
          }
        }
      }
    },
    "/ops/orgs/{orgid}/service/groups" : {
      "get" : {
        "tags" : [ "Operations" ],
        "summary" : "View service groups associated with an organization",
        "description" : "Returns a list of all service groups associated with an organization.",
        "parameters" : [ {
          "name" : "orgid",
          "in" : "path",
          "description" : "Organization ID",
          "required" : true,
          "type" : "integer"
        } ],
        "responses" : {
          "200" : {
            "description" : "successful operation",
            "schema" : {
              "type" : "array",
              "items" : {
                "$ref" : "#/definitions/ServiceGroup"
              }
            }
          },
          "400" : {
            "description" : "failed operation"
          }
        }
      }
    },
    "/ops/service/defs" : {
      "get" : {
        "tags" : [ "Service Definitions" ],
        "summary" : "View list of service definitions",
        "description" : "Returns a list of all services of every type.",
        "parameters" : [ ],
        "responses" : {
          "200" : {
            "description" : "successful operation",
            "schema" : {
              "type" : "array",
              "items" : {
                "$ref" : "#/definitions/ServiceDefinition"
              }
            }
          },
          "400" : {
            "description" : "failed operation"
          }
        }
      },
      "put" : {
        "tags" : [ "Service Definitions" ],
        "summary" : "Create a new service definition",
        "description" : "Create a new service definition (e.g. DNS Pools or DHCP Service). Service definitions groups application data for propagation to edge nodes.",
        "parameters" : [ {
          "in" : "body",
          "name" : "body",
          "required" : true,
          "schema" : {
            "$ref" : "#/definitions/ServiceDefinition"
          }
        } ],
        "responses" : {
          "200" : {
            "description" : "successful operation",
            "schema" : {
              "$ref" : "#/definitions/ServiceDefinition"
            }
          },
          "400" : {
            "description" : "failed operation"
          }
        }
      }
    },
    "/ops/service/defs/{definitionid}" : {
      "get" : {
        "tags" : [ "Service Definitions" ],
        "summary" : "View service definition details",
        "description" : "Returns the details of a service definition.",
        "parameters" : [ {
          "name" : "definitionid",
          "in" : "path",
          "description" : "Service Definition ID",
          "required" : true,
          "type" : "string"
        } ],
        "responses" : {
          "200" : {
            "description" : "successful operation",
            "schema" : {
              "$ref" : "#/definitions/ServiceDefinition"
            }
          },
          "400" : {
            "description" : "failed operation"
          }
        }
      },
      "post" : {
        "tags" : [ "Service Definitions" ],
        "summary" : "Modify a service definition",
        "description" : "Modify a service definition's information.",
        "parameters" : [ {
          "name" : "definitionid",
          "in" : "path",
          "description" : "Service Definition ID",
          "required" : true,
          "type" : "string"
        }, {
          "in" : "body",
          "name" : "body",
          "description" : "Service Definition Object",
          "required" : true,
          "schema" : {
            "$ref" : "#/definitions/ServiceDefinition"
          }
        } ],
        "responses" : {
          "200" : {
            "description" : "successful operation",
            "schema" : {
              "$ref" : "#/definitions/ServiceDefinition"
            }
          },
          "400" : {
            "description" : "failed operation"
          }
        }
      },
      "delete" : {
        "tags" : [ "Service Definitions" ],
        "summary" : "Delete a service definition",
        "description" : "Delete a service definition.",
        "parameters" : [ {
          "name" : "definitionid",
          "in" : "path",
          "description" : "Service Definition ID",
          "required" : true,
          "type" : "string"
        } ],
        "responses" : {
          "200" : {
            "description" : "successful operation",
            "schema" : {
              "type" : "object"
            }
          },
          "400" : {
            "description" : "failed operation"
          }
        }
      }
    },
    "/ops/service/groups" : {
      "get" : {
        "tags" : [ "Service Groups" ],
        "summary" : "View a list of service groups",
        "description" : "Returns a list of all service groups.",
        "parameters" : [ ],
        "responses" : {
          "200" : {
            "description" : "successful operation",
            "schema" : {
              "type" : "array",
              "items" : {
                "$ref" : "#/definitions/ServiceGroup"
              }
            }
          },
          "400" : {
            "description" : "failed operation"
          }
        }
      },
      "put" : {
        "tags" : [ "Service Groups" ],
        "summary" : "Create a service group",
        "description" : "Creates a new service group.",
        "parameters" : [ {
          "in" : "body",
          "name" : "body",
          "required" : true,
          "schema" : {
            "$ref" : "#/definitions/ServiceGroup"
          }
        } ],
        "responses" : {
          "200" : {
            "description" : "successful operation",
            "schema" : {
              "$ref" : "#/definitions/ServiceGroup"
            }
          },
          "400" : {
            "description" : "failed operation"
          }
        }
      }
    },
    "/ops/service/groups/{servicegroupid}" : {
      "get" : {
        "tags" : [ "Service Groups" ],
        "summary" : "View service group details",
        "description" : "Returns details of a service group.",
        "parameters" : [ {
          "name" : "servicegroupid",
          "in" : "path",
          "description" : "Service Group ID",
          "required" : true,
          "type" : "integer"
        } ],
        "responses" : {
          "200" : {
            "description" : "successful operation",
            "schema" : {
              "$ref" : "#/definitions/ServiceGroup"
            }
          },
          "400" : {
            "description" : "failed operation"
          }
        }
      },
      "post" : {
        "tags" : [ "Service Groups" ],
        "summary" : "Modify a service group",
        "description" : "Modify a service group's name.",
        "parameters" : [ {
          "name" : "servicegroupid",
          "in" : "path",
          "description" : "Service Group ID",
          "required" : true,
          "type" : "integer"
        } ],
        "responses" : {
          "200" : {
            "description" : "successful operation",
            "schema" : {
              "$ref" : "#/definitions/ServiceGroup"
            }
          },
          "400" : {
            "description" : "failed operation"
          }
        }
      },
      "delete" : {
        "tags" : [ "Service Groups" ],
        "summary" : "Delete a service group",
        "description" : "Deletes a service group from the system.",
        "parameters" : [ {
          "name" : "servicegroupid",
          "in" : "path",
          "description" : "Service Group ID",
          "required" : true,
          "type" : "integer"
        } ],
        "responses" : {
          "200" : {
            "description" : "successful operation",
            "schema" : {
              "type" : "object"
            }
          },
          "400" : {
            "description" : "failed operation"
          }
        }
      }
    },
    "/ops/service/groups/{servicegroupid}/org/{orgid}" : {
      "post" : {
        "tags" : [ "Service Groups" ],
        "summary" : "Associate with an organization",
        "description" : "Associate a service group with an organization. The tenant organization will have access to resources in this service group such as its DNS Pools and DHCP services.",
        "parameters" : [ {
          "name" : "servicegroupid",
          "in" : "path",
          "description" : "Service Group ID",
          "required" : true,
          "type" : "integer"
        }, {
          "name" : "orgid",
          "in" : "path",
          "description" : "Organization ID",
          "required" : true,
          "type" : "integer"
        } ],
        "responses" : {
          "200" : {
            "description" : "successful operation",
            "schema" : {
              "$ref" : "#/definitions/inline_response_200"
            }
          },
          "400" : {
            "description" : "failed operation"
          }
        }
      }
    },
    "/ops/service/groups/{servicegroupid}/orgs" : {
      "get" : {
        "tags" : [ "Service Groups" ],
        "summary" : "View organizations associated with a service group",
        "description" : "Returns a list of organizations with access to this service group.",
        "parameters" : [ {
          "name" : "servicegroupid",
          "in" : "path",
          "description" : "Service Group ID",
          "required" : true,
          "type" : "string"
        } ],
        "responses" : {
          "200" : {
            "description" : "successful operation",
            "schema" : {
              "type" : "array",
              "items" : {
                "$ref" : "#/definitions/Organization"
              }
            }
          },
          "400" : {
            "description" : "failed operation"
          }
        }
      }
    },
    "/ipam/network" : {
      "get" : {
        "tags" : [ "IPAM" ],
        "summary" : "View a list of networks",
        "description" : "Returns a list of all networks",
        "parameters" : [ ],
        "responses" : {
          "200" : {
            "description" : "successful operation",
            "schema" : {
              "type" : "array",
              "items" : {
                "$ref" : "#/definitions/Network"
              }
            }
          },
          "400" : {
            "description" : "failed operation"
          }
        }
      },
      "put" : {
        "tags" : [ "IPAM" ],
        "summary" : "Create a network",
        "description" : "Create a network",
        "parameters" : [ {
          "in" : "body",
          "name" : "body",
          "required" : true,
          "schema" : {
            "$ref" : "#/definitions/Network"
          }
        } ],
        "responses" : {
          "200" : {
            "description" : "successful operation",
            "schema" : {
              "$ref" : "#/definitions/Network"
            }
          },
          "400" : {
            "description" : "failed operation"
          }
        }
      }
    },
    "/ipam/network/{networkId}" : {
      "get" : {
        "tags" : [ "IPAM" ],
        "summary" : "View a network",
        "description" : "View a network",
        "parameters" : [ {
          "name" : "networkId",
          "in" : "path",
          "description" : "Network ID",
          "required" : true,
          "type" : "integer"
        } ],
        "responses" : {
          "200" : {
            "description" : "successful operation",
            "schema" : {
              "$ref" : "#/definitions/Network"
            }
          },
          "400" : {
            "description" : "failed operation"
          }
        }
      },
      "post" : {
        "tags" : [ "IPAM" ],
        "summary" : "Update a network",
        "description" : "Update a network",
        "parameters" : [ {
          "name" : "networkId",
          "in" : "path",
          "description" : "Network ID",
          "required" : true,
          "type" : "integer"
        }, {
          "in" : "body",
          "name" : "body",
          "required" : true,
          "schema" : {
            "$ref" : "#/definitions/Network"
          }
        } ],
        "responses" : {
          "200" : {
            "description" : "successful operation",
            "schema" : {
              "$ref" : "#/definitions/Network"
            }
          },
          "400" : {
            "description" : "failed operation"
          }
        }
      },
      "delete" : {
        "tags" : [ "IPAM" ],
        "summary" : "Remove a network",
        "description" : "Remove a network",
        "parameters" : [ {
          "name" : "networkId",
          "in" : "path",
          "description" : "Network ID",
          "required" : true,
          "type" : "integer"
        } ],
        "responses" : {
          "200" : {
            "description" : "successful operation",
            "schema" : {
              "type" : "object"
            }
          },
          "400" : {
            "description" : "failed operation"
          }
        }
      }
    },
    "/ipam/network/{networkId}/report" : {
      "get" : {
        "tags" : [ "IPAM" ],
        "summary" : "View a network report",
        "description" : "Get a report of network usage",
        "parameters" : [ {
          "name" : "networkId",
          "in" : "path",
          "description" : "Network ID",
          "required" : true,
          "type" : "integer"
        } ],
        "responses" : {
          "200" : {
            "description" : "successful operation",
            "schema" : {
              "$ref" : "#/definitions/NetworkReport"
            }
          },
          "400" : {
            "description" : "failed operation"
          }
        }
      }
    },
    "/ipam/address" : {
      "get" : {
        "tags" : [ "IPAM" ],
        "summary" : "View a list of root addresses",
        "description" : "Returns a list of all root addresses (i.e. indent == 0) in all networks for the requesting organization.",
        "parameters" : [ ],
        "responses" : {
          "200" : {
            "description" : "successful operation",
            "schema" : {
              "type" : "array",
              "items" : {
                "$ref" : "#/definitions/Subnet"
              }
            }
          },
          "400" : {
            "description" : "failed operation"
          }
        }
      },
      "put" : {
        "tags" : [ "IPAM" ],
        "summary" : "Create a subnet",
        "description" : "Create a subnet",
        "parameters" : [ {
          "in" : "body",
          "name" : "body",
          "required" : true,
          "schema" : {
            "$ref" : "#/definitions/Subnet"
          }
        } ],
        "responses" : {
          "200" : {
            "description" : "successful operation",
            "schema" : {
              "$ref" : "#/definitions/Subnet"
            }
          },
          "400" : {
            "description" : "failed operation"
          }
        }
      }
    },
    "/ipam/address/search" : {
      "get" : {
        "tags" : [ "IPAM" ],
        "summary" : "Search for an address object",
        "description" : "Returns a list of matching objects in the IP address management.",
        "parameters" : [ {
          "name" : "network",
          "in" : "query",
          "required" : false,
          "type" : "integer"
        }, {
          "name" : "max",
          "in" : "query",
          "required" : false,
          "type" : "integer"
        }, {
          "name" : "status",
          "in" : "query",
          "required" : false,
          "type" : "string"
        }, {
          "name" : "tag",
          "in" : "query",
          "required" : false,
          "type" : "string"
        }, {
          "name" : "order_by",
          "in" : "query",
          "required" : false,
          "type" : "string"
        }, {
          "name" : "asc_desc",
          "in" : "query",
          "required" : false,
          "type" : "string"
        }, {
          "name" : "mask",
          "in" : "query",
          "required" : false,
          "type" : "integer"
        }, {
          "name" : "prefix",
          "in" : "query",
          "required" : false,
          "type" : "string"
        } ],
        "responses" : {
          "200" : {
            "description" : "successful operation",
            "schema" : {
              "type" : "array",
              "items" : {
                "$ref" : "#/definitions/Subnet"
              }
            }
          },
          "400" : {
            "description" : "failed operation"
          }
        }
      }
    },
    "/ipam/address/{addressId}" : {
      "get" : {
        "tags" : [ "IPAM" ],
        "summary" : "View a subnet",
        "description" : "View a subnet",
        "parameters" : [ {
          "name" : "addressId",
          "in" : "path",
          "description" : "Address ID",
          "required" : true,
          "type" : "integer"
        } ],
        "responses" : {
          "200" : {
            "description" : "successful operation",
            "schema" : {
              "$ref" : "#/definitions/Subnet"
            }
          },
          "400" : {
            "description" : "failed operation"
          }
        }
      },
      "post" : {
        "tags" : [ "IPAM" ],
        "summary" : "Edit a subnet",
        "description" : "Edit a subnet",
        "parameters" : [ {
          "name" : "addressId",
          "in" : "path",
          "description" : "Address ID",
          "required" : true,
          "type" : "integer"
        }, {
          "in" : "body",
          "name" : "body",
          "required" : true,
          "schema" : {
            "$ref" : "#/definitions/Subnet"
          }
        } ],
        "responses" : {
          "200" : {
            "description" : "successful operation",
            "schema" : {
              "$ref" : "#/definitions/Subnet"
            }
          },
          "400" : {
            "description" : "failed operation"
          }
        }
      },
      "delete" : {
        "tags" : [ "IPAM" ],
        "summary" : "Delete a subnet",
        "description" : "Delete a subnet",
        "parameters" : [ {
          "name" : "addressId",
          "in" : "path",
          "description" : "Address ID",
          "required" : true,
          "type" : "integer"
        } ],
        "responses" : {
          "200" : {
            "description" : "successful operation",
            "schema" : {
              "$ref" : "#/definitions/Subnet"
            }
          },
          "400" : {
            "description" : "failed operation"
          }
        }
      }
    },
    "/ipam/address/{addressId}/split" : {
      "post" : {
        "tags" : [ "IPAM" ],
        "summary" : "Split a subnet",
        "description" : "Splitting an entire block of unassigned IP space into equal pieces. This will not function with ranges or individual hosts. Normal breaking out of a subnet is done with the standard PUT route. (Eg. root address is a /24 and request for /29s will break it into 32 /29s)\n\n- Only planned subnets can be split\n- Name and description will be unset on children\n- KVPS and options will be copied; tags will be inherited as per normal\n",
        "parameters" : [ {
          "name" : "addressId",
          "in" : "path",
          "description" : "Address ID",
          "required" : true,
          "type" : "integer"
        }, {
          "in" : "body",
          "name" : "body",
          "required" : true,
          "schema" : {
            "$ref" : "#/definitions/Subnet"
          }
        } ],
        "responses" : {
          "200" : {
            "description" : "successful operation",
            "schema" : {
              "$ref" : "#/definitions/Subnet"
            }
          },
          "400" : {
            "description" : "failed operation"
          }
        }
      }
    },
    "/ipam/address/{addressId}/merge" : {
      "post" : {
        "tags" : [ "IPAM" ],
        "summary" : "Merge a subnet",
        "description" : "Merge a subnet",
        "parameters" : [ {
          "name" : "addressId",
          "in" : "path",
          "description" : "Address ID",
          "required" : true,
          "type" : "integer"
        }, {
          "in" : "body",
          "name" : "body",
          "required" : true,
          "schema" : {
            "$ref" : "#/definitions/body"
          }
        } ],
        "responses" : {
          "200" : {
            "description" : "successful operation",
            "schema" : {
              "$ref" : "#/definitions/Subnet"
            }
          },
          "400" : {
            "description" : "failed operation"
          }
        }
      }
    },
    "/ipam/address/{addressId}/children" : {
      "get" : {
        "tags" : [ "IPAM" ],
        "summary" : "View address children",
        "description" : "Request a list of all child addresses (or subnets) for the specified IP address.",
        "parameters" : [ {
          "name" : "addressId",
          "in" : "path",
          "description" : "Address ID",
          "required" : true,
          "type" : "integer"
        } ],
        "responses" : {
          "200" : {
            "description" : "successful operation",
            "schema" : {
              "type" : "array",
              "items" : {
                "$ref" : "#/definitions/Subnet"
              }
            }
          },
          "400" : {
            "description" : "failed operation"
          }
        }
      }
    },
    "/ipam/address/{addressId}/parent" : {
      "get" : {
        "tags" : [ "IPAM" ],
        "summary" : "View address parent",
        "description" : "Request a list of all parent addresses (or subnets) for the specified IP address.",
        "parameters" : [ {
          "name" : "addressId",
          "in" : "path",
          "description" : "Address ID",
          "required" : true,
          "type" : "integer"
        } ],
        "responses" : {
          "200" : {
            "description" : "successful operation",
            "schema" : {
              "$ref" : "#/definitions/Subnet"
            }
          },
          "400" : {
            "description" : "failed operation"
          }
        }
      }
    },
    "/ipam/address/{addressId}/adjacent" : {
      "get" : {
        "tags" : [ "IPAM" ],
        "summary" : "View next (or previous) available prefix",
        "description" : "Retrieves next or previous (aka adjacent) available IP address.",
        "parameters" : [ {
          "name" : "addressId",
          "in" : "path",
          "description" : "Address ID",
          "required" : true,
          "type" : "integer"
        }, {
          "name" : "previous",
          "in" : "query",
          "required" : false,
          "type" : "boolean"
        }, {
          "name" : "X-NSONE-Key",
          "in" : "header",
          "required" : true,
          "type" : "string"
        } ],
        "responses" : {
          "200" : {
            "description" : "successful operation",
            "schema" : {
              "$ref" : "#/definitions/inline_response_200_1"
            }
          },
          "400" : {
            "description" : "failed operation"
          }
        }
      }
    },
    "/ipam/address/{subnet_id}/pool" : {
      "get" : {
        "tags" : [ "IPAM" ],
        "summary" : "View a subnet",
        "description" : "View a subnet",
        "parameters" : [ {
          "name" : "subnet_id",
          "in" : "path",
          "description" : "Subnet ID",
          "required" : true,
          "type" : "integer"
        } ],
        "responses" : {
          "200" : {
            "description" : "successful operation",
            "schema" : {
              "type" : "array",
              "items" : {
                "$ref" : "#/definitions/PoolOfIPAddresses"
              }
            }
          },
          "400" : {
            "description" : "failed operation"
          }
        }
      },
      "put" : {
        "tags" : [ "IPAM" ],
        "summary" : "Create a pool (IP range) within a subnet",
        "description" : "Creates a pool (range of IP addresses) under a given subnet.",
        "parameters" : [ {
          "name" : "subnet_id",
          "in" : "path",
          "description" : "Subnet ID",
          "required" : true,
          "type" : "integer"
        }, {
          "in" : "body",
          "name" : "body",
          "required" : true,
          "schema" : {
            "$ref" : "#/definitions/PoolOfIPAddresses"
          }
        } ],
        "responses" : {
          "200" : {
            "description" : "successful operation",
            "schema" : {
              "$ref" : "#/definitions/PoolOfIPAddresses"
            }
          },
          "400" : {
            "description" : "failed operation"
          }
        }
      }
    },
    "/ipam/address/{subnet_id}/pool/{pool_id}" : {
      "get" : {
        "tags" : [ "IPAM" ],
        "summary" : "View a pool (IP range) within a subnet",
        "description" : "Returns a pool (range of IP addresses) under a given subnet.",
        "parameters" : [ {
          "name" : "subnet_id",
          "in" : "path",
          "description" : "Subnet ID",
          "required" : true,
          "type" : "integer"
        }, {
          "name" : "pool_id",
          "in" : "path",
          "description" : "Pool ID",
          "required" : true,
          "type" : "integer"
        } ],
        "responses" : {
          "200" : {
            "description" : "successful operation",
            "schema" : {
              "$ref" : "#/definitions/PoolOfIPAddresses"
            }
          },
          "400" : {
            "description" : "failed operation"
          }
        }
      },
      "post" : {
        "tags" : [ "IPAM" ],
        "summary" : "Update a pool (IP range) within a subnet",
        "description" : "Updates a pool (range of IP addresses) under a given subnet.",
        "parameters" : [ {
          "name" : "subnet_id",
          "in" : "path",
          "description" : "Subnet ID",
          "required" : true,
          "type" : "integer"
        }, {
          "name" : "pool_id",
          "in" : "path",
          "description" : "Pool ID",
          "required" : true,
          "type" : "integer"
        }, {
          "in" : "body",
          "name" : "body",
          "required" : true,
          "schema" : {
            "$ref" : "#/definitions/PoolOfIPAddresses"
          }
        } ],
        "responses" : {
          "200" : {
            "description" : "successful operation",
            "schema" : {
              "$ref" : "#/definitions/PoolOfIPAddresses"
            }
          },
          "400" : {
            "description" : "failed operation"
          }
        }
      },
      "delete" : {
        "tags" : [ "IPAM" ],
        "summary" : "Delete a pool (IP range) within a subnet",
        "description" : "Deletes a pool (range of IP addresses) under a given subnet.",
        "parameters" : [ {
          "name" : "subnet_id",
          "in" : "path",
          "description" : "Subnet ID",
          "required" : true,
          "type" : "integer"
        }, {
          "name" : "pool_id",
          "in" : "path",
          "description" : "Pool ID",
          "required" : true,
          "type" : "integer"
        } ],
        "responses" : {
          "200" : {
            "description" : "successful operation"
          },
          "400" : {
            "description" : "failed operation"
          }
        }
      }
    },
    "/ipam/tags" : {
      "get" : {
        "tags" : [ "IPAM" ],
        "summary" : "View all tags",
        "description" : "Get a list of all tags used by this organization",
        "parameters" : [ ],
        "responses" : {
          "200" : {
            "description" : "successful operation",
            "schema" : {
              "type" : "array",
              "items" : {
                "type" : "string"
              }
            }
          },
          "400" : {
            "description" : "failed operation"
          }
        }
      }
    },
    "/ipam/keys" : {
      "get" : {
        "tags" : [ "IPAM" ],
        "summary" : "View all organization keys",
        "description" : "Get a list of all keys used by this organization for key-value pairs",
        "parameters" : [ ],
        "responses" : {
          "200" : {
            "description" : "successful operation",
            "schema" : {
              "type" : "array",
              "items" : {
                "type" : "string"
              }
            }
          },
          "400" : {
            "description" : "failed operation"
          }
        }
      }
    },
    "/dhcp/scope" : {
      "get" : {
        "tags" : [ "DHCP" ],
        "summary" : "Generate a list of the active scopes",
        "description" : "Generate a list of the active scopes",
        "parameters" : [ ],
        "responses" : {
          "200" : {
            "description" : "successful operation",
            "schema" : {
              "type" : "array",
              "items" : {
                "$ref" : "#/definitions/Scope"
              }
            }
          },
          "400" : {
            "description" : "failed operation"
          }
        }
      },
      "put" : {
        "tags" : [ "DHCP" ],
        "summary" : "Create a scope",
        "description" : "Create a scope.\n\n**Note**: The DHCP server, if enabled, will allocate addresses from the associated IP address, grant any DHCP options associated with the address. The address and scope group must each meet certain invariants or else the request will result in a **422**.\n\nThe address must:\n  - be of type `assignment`.\n  - not already be assigned to another scope group\n\n`options` should be supported for the address' protocol.\n",
        "parameters" : [ {
          "in" : "body",
          "name" : "body",
          "required" : true,
          "schema" : {
            "$ref" : "#/definitions/Scope"
          }
        } ],
        "responses" : {
          "200" : {
            "description" : "successful operation",
            "schema" : {
              "$ref" : "#/definitions/Scope"
            }
          },
          "400" : {
            "description" : "failed operation"
          }
        }
      }
    },
    "/dhcp/scope/{scopeID}" : {
      "get" : {
        "tags" : [ "DHCP" ],
        "summary" : "View scope details",
        "description" : "Request details about a specific scope.",
        "parameters" : [ {
          "name" : "scopeID",
          "in" : "path",
          "description" : "Scope ID",
          "required" : true,
          "type" : "integer"
        } ],
        "responses" : {
          "200" : {
            "description" : "successful operation",
            "schema" : {
              "$ref" : "#/definitions/Scope"
            }
          },
          "400" : {
            "description" : "failed operation"
          }
        }
      },
      "post" : {
        "tags" : [ "DHCP" ],
        "summary" : "Modify a scope",
        "description" : "Modify a scope",
        "parameters" : [ {
          "name" : "scopeID",
          "in" : "path",
          "description" : "Scope ID",
          "required" : true,
          "type" : "integer"
        }, {
          "in" : "body",
          "name" : "body",
          "required" : true,
          "schema" : {
            "$ref" : "#/definitions/Scope"
          }
        } ],
        "responses" : {
          "200" : {
            "description" : "successful operation",
            "schema" : {
              "$ref" : "#/definitions/Scope"
            }
          },
          "400" : {
            "description" : "failed operation"
          }
        }
      },
      "delete" : {
        "tags" : [ "DHCP" ],
        "summary" : "Remove a scope",
        "description" : "Once removed, the address will no longer be used for leases and any current leases will be reclaimed.",
        "parameters" : [ {
          "name" : "scopeID",
          "in" : "path",
          "description" : "Scope ID",
          "required" : true,
          "type" : "integer"
        } ],
        "responses" : {
          "200" : {
            "description" : "successful operation",
            "schema" : {
              "$ref" : "#/definitions/Scope"
            }
          },
          "400" : {
            "description" : "failed operation"
          }
        }
      }
    },
    "/dhcp/scope/group" : {
      "get" : {
        "tags" : [ "DHCP" ],
        "summary" : "List scope groups",
        "description" : "Request a list of all scope groups",
        "parameters" : [ ],
        "responses" : {
          "200" : {
            "description" : "successful operation",
            "schema" : {
              "type" : "array",
              "items" : {
                "$ref" : "#/definitions/ScopeGroup"
              }
            }
          },
          "400" : {
            "description" : "failed operation"
          }
        }
      },
      "put" : {
        "tags" : [ "DHCP" ],
        "summary" : "Create a scope group",
        "description" : "Creates a scope group with global settings and options.Options must be valid for the address's IP protocol. If the option has already been set, this request will overwrite it.",
        "parameters" : [ {
          "in" : "body",
          "name" : "body",
          "required" : true,
          "schema" : {
            "$ref" : "#/definitions/ScopeGroup"
          }
        } ],
        "responses" : {
          "200" : {
            "description" : "successful operation",
            "schema" : {
              "$ref" : "#/definitions/ScopeGroup"
            }
          },
          "400" : {
            "description" : "failed operation"
          }
        }
      }
    },
    "/dhcp/scopegroup/{scopegroupID}" : {
      "get" : {
        "tags" : [ "DHCP" ],
        "summary" : "View scope group",
        "description" : "Request information about a scope groups using its unique ID.",
        "parameters" : [ {
          "name" : "scopegroupID",
          "in" : "path",
          "description" : "Scope Group ID",
          "required" : true,
          "type" : "integer"
        } ],
        "responses" : {
          "200" : {
            "description" : "successful operation",
            "schema" : {
              "$ref" : "#/definitions/ScopeGroup"
            }
          },
          "400" : {
            "description" : "failed operation"
          }
        }
      },
      "post" : {
        "tags" : [ "DHCP" ],
        "summary" : "Update scope group by ID",
        "description" : "Update scope group by ID",
        "parameters" : [ {
          "name" : "scopegroupID",
          "in" : "path",
          "description" : "Scope Group ID",
          "required" : true,
          "type" : "integer"
        }, {
          "name" : "X-NSONE-Key",
          "in" : "header",
          "required" : true,
          "type" : "string"
        }, {
          "in" : "body",
          "name" : "body",
          "required" : true,
          "schema" : {
            "$ref" : "#/definitions/ScopeGroup"
          }
        } ],
        "responses" : {
          "200" : {
            "description" : "successful operation",
            "schema" : {
              "$ref" : "#/definitions/ScopeGroup"
            }
          },
          "400" : {
            "description" : "failed operation"
          }
        }
      },
      "delete" : {
        "tags" : [ "DHCP" ],
        "summary" : "Remove scope group by ID",
        "description" : "Remove scope group by ID",
        "parameters" : [ {
          "name" : "scopegroupID",
          "in" : "path",
          "description" : "Scope Group ID",
          "required" : true,
          "type" : "integer"
        } ],
        "responses" : {
          "200" : {
            "description" : "successful operation",
            "schema" : {
              "$ref" : "#/definitions/ScopeGroup"
            }
          },
          "400" : {
            "description" : "failed operation"
          }
        }
      }
    },
    "/dhcp/scopegroup/{scopegroupID}/report" : {
      "get" : {
        "tags" : [ "DHCP" ],
        "summary" : "Returns a report about the specified scope group.",
        "description" : "Returns a report about the specified scope group.",
        "parameters" : [ {
          "name" : "scopegroupID",
          "in" : "path",
          "description" : "Scope Group ID",
          "required" : true,
          "type" : "integer"
        } ],
        "responses" : {
          "200" : {
            "description" : "successful operation",
            "schema" : {
              "$ref" : "#/definitions/NetworkReport"
            }
          },
          "400" : {
            "description" : "failed operation"
          }
        }
      }
    },
    "/dhcp/reservation" : {
      "get" : {
        "tags" : [ "DHCP" ],
        "summary" : "List reservations",
        "description" : "Request a list of all active DHCP reservations.",
        "parameters" : [ ],
        "responses" : {
          "200" : {
            "description" : "successful operation",
            "schema" : {
              "type" : "array",
              "items" : {
                "$ref" : "#/definitions/Reservation"
              }
            }
          },
          "400" : {
            "description" : "failed operation"
          }
        }
      },
      "put" : {
        "tags" : [ "DHCP" ],
        "summary" : "Create a reservation",
        "description" : "Creates a new host reservation.\n\n**Note**: Currently, the reservation must be associated with an address. The DHCP server, if enabled, will provide the associated IP address and any DHCP options to the client with the associated MAC address. The address and scope group must each meet certain invariants or else the request will result in a 422.\n\nThe address must:\n\n- Be of status = assigned.\n- Not be associated with another scope group\n- Not have another conflicting reservation\n\nThe scope group must:\n\n- Only contain reservations and scopes from a single network.\n\nOptions should be supported for the address' protocol.\n",
        "parameters" : [ {
          "in" : "body",
          "name" : "body",
          "required" : true,
          "schema" : {
            "$ref" : "#/definitions/Reservation"
          }
        } ],
        "responses" : {
          "200" : {
            "description" : "successful operation",
            "schema" : {
              "$ref" : "#/definitions/Reservation"
            }
          },
          "400" : {
            "description" : "failed operation"
          }
        }
      }
    },
    "/dhcp/reservation/{reservationId}" : {
      "get" : {
        "tags" : [ "DHCP" ],
        "summary" : "View a reservation's details",
        "description" : "View a reservation's details",
        "parameters" : [ {
          "name" : "reservationId",
          "in" : "path",
          "description" : "Reservation ID",
          "required" : true,
          "type" : "integer"
        } ],
        "responses" : {
          "200" : {
            "description" : "successful operation",
            "schema" : {
              "$ref" : "#/definitions/Reservation"
            }
          },
          "400" : {
            "description" : "failed operation"
          }
        }
      },
      "post" : {
        "tags" : [ "DHCP" ],
        "summary" : "Modify a reservation",
        "description" : "Modify an existing DHCP reservation.\n\n**Note**: The DHCP server, if enabled, will provide the associated IP address and any DHCP options to the client with the associated MAC address. The address and scope group must each meet certain invariants or else the request will result in a **422**.\n\nThe `address` must:\n\n  - Be of type `host`.\n  - Not be associated with another `scope group`\n  - Not have another conflicting `reservation`\n\n`options` should be supported for the address' protocol.\n",
        "parameters" : [ {
          "name" : "reservationId",
          "in" : "path",
          "description" : "Reservation ID",
          "required" : true,
          "type" : "integer"
        }, {
          "in" : "body",
          "name" : "body",
          "required" : true,
          "schema" : {
            "$ref" : "#/definitions/Reservation"
          }
        } ],
        "responses" : {
          "200" : {
            "description" : "successful operation",
            "schema" : {
              "$ref" : "#/definitions/ScopeGroup"
            }
          },
          "400" : {
            "description" : "failed operation"
          }
        }
      },
      "delete" : {
        "tags" : [ "DHCP" ],
        "summary" : "Delete a reservation",
        "description" : "Delete a reservation",
        "parameters" : [ {
          "name" : "reservationId",
          "in" : "path",
          "description" : "Reservation ID",
          "required" : true,
          "type" : "integer"
        } ],
        "responses" : {
          "200" : {
            "description" : "successful operation",
            "schema" : {
              "type" : "object"
            }
          },
          "400" : {
            "description" : "failed operation"
          }
        }
      }
    },
    "/dhcp/lease" : {
      "get" : {
        "tags" : [ "DHCP" ],
        "summary" : "List leases",
        "description" : "Lists any active leases, optionally filtering by one or more parameters.",
        "parameters" : [ ],
        "responses" : {
          "200" : {
            "description" : "successful operation",
            "schema" : {
              "$ref" : "#/definitions/Lease"
            }
          },
          "400" : {
            "description" : "failed operation"
          }
        }
      }
    },
    "/dhcp/optiondef" : {
      "get" : {
        "tags" : [ "DHCP" ],
        "summary" : "List option definitions",
        "description" : "Return a list of option definitions available to this organization and optionally filter by parameters.",
        "parameters" : [ ],
        "responses" : {
          "200" : {
            "description" : "successful operation",
            "schema" : {
              "type" : "array",
              "items" : {
                "type" : "object",
                "properties" : { }
              }
            }
          },
          "400" : {
            "description" : "failed operation"
          }
        }
      }
    },
    "/dhcp/optiondef/{space}/{key}" : {
      "post" : {
        "tags" : [ "DHCP" ],
        "summary" : "Modify an custom DHCP option definition",
        "description" : "Modify an option definition. The key and code must be unique in the chosen option space.",
        "parameters" : [ {
          "name" : "space",
          "in" : "path",
          "description" : "space",
          "required" : true,
          "type" : "string"
        }, {
          "name" : "key",
          "in" : "path",
          "description" : "key",
          "required" : true,
          "type" : "string"
        }, {
          "in" : "body",
          "name" : "body",
          "required" : false,
          "schema" : {
            "$ref" : "#/definitions/DHCPOptionDefinition"
          }
        } ],
        "responses" : {
          "200" : {
            "description" : "successful operation",
            "schema" : {
              "$ref" : "#/definitions/DHCPOptionDefinition"
            }
          },
          "400" : {
            "description" : "failed operation"
          }
        }
      },
      "put" : {
        "tags" : [ "DHCP" ],
        "summary" : "Create an custom DHCP option definition",
        "description" : "Create an option definition. The key and code must be unique in the chosen option space.\n\nNOTE\nThe following are important guidelines to follow when configuring a custom DHCP option with “complex” schema selected:\n\n- The record must consist of at least two fields.\n- \"String\" or \"binary\" fields must be last in the order of primitive types.\n- You can only enter one \"string\" field or one \"binary\" field per record.\n- \"Empty\" type is not allowed in a complex record.\n- You cannot create an array of “string” or “binary” field types.\n- If a string contains commas, they must be escaped with double-backslash (\\\\).\n\nThe following are important guidelines to follow when configuring a custom DHCP option with \"array\" schema selected selected:\n\n- You cannot create an array of \"string\", \"binary\", or \"empty\" field types.\n",
        "parameters" : [ {
          "name" : "space",
          "in" : "path",
          "description" : "space",
          "required" : true,
          "type" : "string"
        }, {
          "name" : "key",
          "in" : "path",
          "description" : "key",
          "required" : true,
          "type" : "string"
        }, {
          "in" : "body",
          "name" : "body",
          "required" : false,
          "schema" : {
            "$ref" : "#/definitions/DHCPOptionDefinition"
          }
        } ],
        "responses" : {
          "200" : {
            "description" : "successful operation",
            "schema" : {
              "$ref" : "#/definitions/DHCPOptionDefinition"
            }
          },
          "400" : {
            "description" : "failed operation"
          }
        }
      },
      "delete" : {
        "tags" : [ "DHCP" ],
        "summary" : "Delete an option definition",
        "description" : "Delete an option definition.",
        "parameters" : [ {
          "name" : "space",
          "in" : "path",
          "description" : "space",
          "required" : true,
          "type" : "string"
        }, {
          "name" : "key",
          "in" : "path",
          "description" : "key",
          "required" : true,
          "type" : "string"
        } ],
        "responses" : {
          "200" : {
            "description" : "successful operation"
          },
          "400" : {
            "description" : "failed operation"
          }
        }
      }
    },
    "/activedirectory" : {
      "get" : {
        "tags" : [ "Active Directory" ],
        "summary" : "View Active Directory configuration",
        "description" : "Returns details of current Active Directory configuration.",
        "parameters" : [ ],
        "responses" : {
          "200" : {
            "description" : "successful operation",
            "schema" : {
              "$ref" : "#/definitions/ActiveDirectoryConfiguration"
            }
          },
          "400" : {
            "description" : "failed operation"
          }
        }
      },
      "post" : {
        "tags" : [ "Active Directory" ],
        "summary" : "Modify Active Directory configuration",
        "description" : "Modifies the AD configuration entry associated with the current organization.",
        "parameters" : [ {
          "in" : "body",
          "name" : "body",
          "required" : true,
          "schema" : {
            "$ref" : "#/definitions/ActiveDirectoryConfiguration"
          }
        } ],
        "responses" : {
          "200" : {
            "description" : "successful operation",
            "schema" : {
              "$ref" : "#/definitions/ActiveDirectoryConfiguration"
            }
          },
          "400" : {
            "description" : "failed operation"
          }
        }
      },
      "put" : {
        "tags" : [ "Active Directory" ],
        "summary" : "Create an Active Directory configuration",
        "description" : "Create a new AD configuration entry associated with the current organization.",
        "parameters" : [ {
          "in" : "body",
          "name" : "body",
          "required" : true,
          "schema" : {
            "$ref" : "#/definitions/ActiveDirectoryConfiguration"
          }
        } ],
        "responses" : {
          "200" : {
            "description" : "successful operation",
            "schema" : {
              "$ref" : "#/definitions/ActiveDirectoryConfiguration"
            }
          },
          "400" : {
            "description" : "failed operation"
          }
        }
      },
      "delete" : {
        "tags" : [ "Active Directory" ],
        "summary" : "Delete Active Directory configuration",
        "description" : "Deletes the AD configuration entry associated with the current organization.",
        "parameters" : [ ],
        "responses" : {
          "200" : {
            "description" : "successful operation",
            "schema" : {
              "type" : "object"
            }
          },
          "400" : {
            "description" : "failed operation"
          }
        }
      }
    },
    "/activedirectory/test" : {
      "post" : {
        "tags" : [ "Active Directory" ],
        "summary" : "Test the Active Directory connection",
        "description" : "Test the AD server connection.",
        "parameters" : [ {
          "in" : "body",
          "name" : "body",
          "required" : true,
          "schema" : {
            "$ref" : "#/definitions/ActiveDirectoryConfiguration"
          }
        } ],
        "responses" : {
          "200" : {
            "description" : "successful operation",
            "schema" : {
              "type" : "object"
            }
          },
          "400" : {
            "description" : "failed operation"
          }
        }
      }
    }
  },
  "definitions" : {
    "ActiveDirectoryConfiguration" : {
      "type" : "object",
      "required" : [ "domain", "password", "secure", "server", "user" ],
      "properties" : {
        "server" : {
          "type" : "string",
          "description" : "IP for the Active Directory server"
        },
        "port" : {
          "type" : "integer",
          "description" : "(Optional) Port for the AD connection"
        },
        "domain" : {
          "type" : "string",
          "description" : "Domain used for the connections"
        },
        "base_dn" : {
          "type" : "string",
          "description" : "(Optional) Base Distinguished Name"
        },
        "user" : {
          "type" : "string",
          "description" : "Login name for the DN Bind"
        },
        "password" : {
          "type" : "string",
          "description" : "Password for the DN Bind"
        },
        "secure" : {
          "type" : "boolean",
          "description" : "Option to enable a secure connection"
        },
        "tls_cert" : {
          "type" : "string",
          "description" : "TLS cert in case a secure connection is enabled"
        }
      }
    },
    "DHCPOptionDefinition" : {
      "type" : "object",
      "properties" : {
        "code" : {
          "type" : "integer"
        },
        "description" : {
          "type" : "string"
        },
        "space" : {
          "type" : "string"
        },
        "friendly_name" : {
          "type" : "string"
        },
        "key" : {
          "type" : "string"
        },
        "schema" : {
          "type" : "object",
          "properties" : { }
        },
        "standard" : {
          "type" : "boolean"
        }
      }
    },
    "Lease" : {
      "type" : "object",
      "properties" : {
        "prefix" : {
          "type" : "string"
        },
        "scope_group_id" : {
          "type" : "integer"
        },
        "dhcid" : {
          "type" : "string"
        },
        "mac" : {
          "type" : "string"
        },
        "expiration" : {
          "type" : "string"
        }
      }
    },
    "Reservation" : {
      "type" : "object",
      "required" : [ "address_id", "name", "options", "value" ],
      "properties" : {
        "name" : {
          "type" : "string"
        },
        "value" : {
          "type" : "array",
          "items" : {
            "type" : "string"
          }
        },
        "options" : {
          "type" : "array",
          "items" : {
            "type" : "object",
            "properties" : { }
          }
        },
        "mac" : {
          "type" : "string"
        },
        "scope_group_id" : {
          "type" : "integer"
        },
        "address_id" : {
          "type" : "integer"
        }
      }
    },
    "ScopeGroup" : {
      "type" : "object",
      "properties" : {
        "name" : {
          "type" : "string"
        },
        "dhcp_service_id" : {
          "type" : "integer"
        },
        "dhcpv4" : {
          "type" : "object",
          "properties" : { }
        },
        "dhcpv6" : {
          "type" : "object",
          "properties" : { }
        },
        "id" : {
          "type" : "integer"
        }
      }
    },
    "Scope" : {
      "type" : "object",
      "required" : [ "address_id", "name", "options", "value" ],
      "properties" : {
        "address_id" : {
          "type" : "integer",
          "description" : "the ID of the scope address; must not have host bits set"
        },
        "scope_group_id" : {
          "type" : "integer",
          "description" : "the ID of the scope group; if set and the scope group is active, the scope will be used for leases"
        },
        "options" : {
          "type" : "array",
          "items" : {
            "type" : "object",
            "properties" : { }
          }
        },
        "name" : {
          "type" : "string"
        },
        "value" : {
          "type" : "array",
          "items" : {
            "type" : "string"
          }
        },
        "id" : {
          "type" : "integer"
        }
      }
    },
    "PoolOfIPAddresses" : {
      "type" : "object",
      "properties" : {
        "range" : {
          "type" : "string"
        },
        "id" : {
          "type" : "integer"
        },
        "options" : {
          "type" : "array",
          "items" : {
            "$ref" : "#/definitions/PoolOfIPAddresses_options"
          }
        }
      }
    },
    "NewOperatorUser" : {
      "type" : "object",
      "properties" : {
        "user" : {
          "type" : "string"
        },
        "name" : {
          "type" : "string"
        },
        "email" : {
          "type" : "string"
        },
        "password" : {
          "type" : "string"
        }
      }
    },
    "OperatorUser" : {
      "type" : "object",
      "required" : [ "name" ],
      "properties" : {
        "two_factor_auth" : {
          "$ref" : "#/definitions/OperatorUser_two_factor_auth"
        },
        "name" : {
          "type" : "string"
        },
        "id" : {
          "type" : "string"
        },
        "user" : {
          "type" : "string"
        },
        "key" : {
          "type" : "string"
        },
        "last_access" : {
          "type" : "string"
        },
        "password" : {
          "type" : "string"
        },
        "email" : {
          "type" : "string"
        }
      }
    },
    "Organization" : {
      "type" : "object",
      "required" : [ "name" ],
      "properties" : {
        "org_id" : {
          "type" : "integer",
          "format" : "int64",
          "example" : 2000
        },
        "ts_create" : {
          "type" : "string",
          "example" : "2019-08-05T19:37:08.065Z"
        },
        "ts_update" : {
          "type" : "string",
          "example" : "2019-08-05T19:37:08.065Z"
        },
        "name" : {
          "type" : "string",
          "example" : "My Company"
        },
        "id" : {
          "type" : "integer",
          "format" : "int64",
          "example" : 2000
        }
      }
    },
    "ServiceGroup" : {
      "type" : "object",
      "required" : [ "name" ],
      "properties" : {
        "properties" : {
          "type" : "object",
          "properties" : { }
        },
        "id" : {
          "type" : "integer"
        },
        "name" : {
          "type" : "string"
        }
      }
    },
    "ServiceDefinition" : {
      "type" : "object",
      "required" : [ "name", "nameservers", "type" ],
      "properties" : {
        "config_tree_id" : {
          "type" : "integer"
        },
        "properties" : {
          "type" : "object",
          "properties" : { }
        },
        "nameservers" : {
          "type" : "array",
          "items" : {
            "type" : "string"
          }
        },
        "type" : {
          "type" : "string"
        },
        "id" : {
          "type" : "integer"
        },
        "name" : {
          "type" : "string"
        }
      }
    },
    "Network" : {
      "type" : "object",
      "properties" : {
        "name" : {
          "type" : "string"
        },
        "rt" : {
          "type" : "string"
        },
        "tags" : {
          "type" : "array",
          "items" : {
            "type" : "string"
          }
        },
        "desc" : {
          "type" : "string"
        },
        "kvps" : {
          "type" : "object",
          "properties" : { }
        },
        "free_addresses_v4" : {
          "type" : "string"
        },
        "used_addresses_v4" : {
          "type" : "string"
        },
        "total_addresses_v4" : {
          "type" : "string"
        },
        "num_prefixes_v4" : {
          "type" : "string"
        },
        "free_addresses_v6" : {
          "type" : "string"
        },
        "used_addresses_v6" : {
          "type" : "string"
        },
        "total_addresses_v6" : {
          "type" : "string"
        },
        "num_prefixes_v6" : {
          "type" : "string"
        },
        "addresses" : {
          "type" : "array",
          "example" : [ {
            "addr_id" : 0,
            "prefix" : "string",
            "name" : "string"
          } ],
          "items" : {
            "type" : "object",
            "properties" : { }
          }
        }
      }
    },
    "NetworkReport" : {
      "type" : "object",
      "properties" : {
        "v4" : {
          "type" : "object",
          "properties" : { }
        },
        "v6" : {
          "type" : "object",
          "properties" : { }
        }
      }
    },
    "Subnet" : {
      "type" : "object",
      "properties" : {
        "prefix" : {
          "type" : "string"
        },
        "network_id" : {
          "type" : "integer"
        },
        "kvps" : {
          "type" : "object",
          "properties" : { }
        },
        "tags" : {
          "type" : "array",
          "items" : {
            "type" : "string"
          }
        },
        "desc" : {
          "type" : "string"
        },
        "status" : {
          "type" : "string"
        },
        "name" : {
          "type" : "string"
        },
        "inherited_tags" : {
          "type" : "array",
          "items" : {
            "type" : "string"
          }
        },
        "total_addresses" : {
          "type" : "string"
        },
        "children" : {
          "type" : "integer"
        },
        "free_addresses" : {
          "type" : "string"
        },
        "id" : {
          "type" : "integer"
        },
        "indent" : {
          "type" : "integer"
        },
        "used_addresses" : {
          "type" : "string"
        },
        "parent" : {
          "type" : "object",
          "properties" : { }
        }
      }
    },
    "inline_response_200" : {
      "type" : "object",
      "properties" : {
        "status" : {
          "type" : "string",
          "example" : "success"
        },
        "org_id" : {
          "type" : "string",
          "example" : "2000"
        },
        "service_group_id" : {
          "type" : "string",
          "example" : "2"
        }
      },
      "description" : ""
    },
    "body" : {
      "type" : "object",
      "properties" : {
        "root_address_id" : {
          "type" : "integer"
        },
        "merged_address_id" : {
          "type" : "integer"
        }
      }
    },
    "inline_response_200_1" : {
      "type" : "object",
      "properties" : {
        "prefix" : {
          "type" : "string"
        }
      }
    },
    "PoolOfIPAddresses_options" : {
      "type" : "object",
      "properties" : {
        "name" : {
          "type" : "string"
        },
        "value" : {
          "type" : "integer"
        },
        "always_send" : {
          "type" : "boolean"
        }
      }
    },
    "OperatorUser_two_factor_auth" : {
      "type" : "object",
      "properties" : {
        "secret" : {
          "type" : "string"
        },
        "type" : {
          "type" : "string"
        }
      }
    }
  },
  "externalDocs" : {
    "description" : "Find out more about Swagger",
    "url" : "http://swagger.io"
  }
}