{
  "actions": [
    {
      "name": "getActivedirectory",
      "protocol": "REST",
      "method": "GET",
      "entitypath": "{base_path}/{version}/activedirectory?{query}",
      "requestSchema": "schema.json",
      "responseSchema": "schema.json",
      "timeout": 0,
      "sendEmpty": false,
      "sendGetBody": false,
      "requestDatatype": "JSON",
      "responseDatatype": "JSON",
      "headers": {},
      "responseObjects": [
        {
          "type": "default",
          "key": "",
          "mockFile": "mockdatafiles/getActivedirectory-default.json"
        }
      ]
    },
    {
      "name": "postActivedirectory",
      "protocol": "REST",
      "method": "POST",
      "entitypath": "{base_path}/{version}/activedirectory?{query}",
      "requestSchema": "schema.json",
      "responseSchema": "schema.json",
      "timeout": 0,
      "sendEmpty": false,
      "sendGetBody": false,
      "requestDatatype": "JSON",
      "responseDatatype": "JSON",
      "headers": {},
      "responseObjects": [
        {
          "type": "default",
          "key": "",
          "mockFile": "mockdatafiles/postActivedirectory-default.json"
        }
      ]
    },
    {
      "name": "putActivedirectory",
      "protocol": "REST",
      "method": "PUT",
      "entitypath": "{base_path}/{version}/activedirectory?{query}",
      "requestSchema": "schema.json",
      "responseSchema": "schema.json",
      "timeout": 0,
      "sendEmpty": false,
      "sendGetBody": false,
      "requestDatatype": "JSON",
      "responseDatatype": "JSON",
      "headers": {},
      "responseObjects": [
        {
          "type": "default",
          "key": "",
          "mockFile": "mockdatafiles/putActivedirectory-default.json"
        }
      ]
    },
    {
      "name": "deleteActivedirectory",
      "protocol": "REST",
      "method": "DELETE",
      "entitypath": "{base_path}/{version}/activedirectory?{query}",
      "requestSchema": "schema.json",
      "responseSchema": "schema.json",
      "timeout": 0,
      "sendEmpty": false,
      "sendGetBody": false,
      "requestDatatype": "JSON",
      "responseDatatype": "JSON",
      "headers": {},
      "responseObjects": [
        {
          "type": "default",
          "key": "",
          "mockFile": ""
        }
      ]
    },
    {
      "name": "postActivedirectoryTest",
      "protocol": "REST",
      "method": "POST",
      "entitypath": "{base_path}/{version}/activedirectory/test?{query}",
      "requestSchema": "schema.json",
      "responseSchema": "schema.json",
      "timeout": 0,
      "sendEmpty": false,
      "sendGetBody": false,
      "requestDatatype": "JSON",
      "responseDatatype": "JSON",
      "headers": {},
      "responseObjects": [
        {
          "type": "default",
          "key": "",
          "mockFile": ""
        }
      ]
    }
  ]
}