[
  {
    "name": "string",
    "value": [
      "string",
      "string"
    ],
    "options": [
      {},
      {},
      {},
      {},
      {},
      {},
      {}
    ],
    "mac": "string",
    "scope_group_id": 1,
    "address_id": 1
  },
  {
    "name": "string",
    "value": [
      "string",
      "string"
    ],
    "options": [
      {},
      {},
      {},
      {},
      {},
      {},
      {},
      {},
      {},
      {}
    ],
    "mac": "string",
    "scope_group_id": 7,
    "address_id": 9
  },
  {
    "name": "string",
    "value": [
      "string",
      "string",
      "string",
      "string",
      "string",
      "string",
      "string"
    ],
    "options": [
      {},
      {},
      {},
      {},
      {},
      {},
      {},
      {},
      {},
      {}
    ],
    "mac": "string",
    "scope_group_id": 1,
    "address_id": 7
  },
  {
    "name": "string",
    "value": [
      "string",
      "string",
      "string",
      "string",
      "string",
      "string",
      "string",
      "string",
      "string"
    ],
    "options": [
      {},
      {},
      {},
      {},
      {},
      {},
      {},
      {},
      {},
      {}
    ],
    "mac": "string",
    "scope_group_id": 9,
    "address_id": 6
  }
]