{
  "address_id": 9,
  "scope_group_id": 2,
  "options": [
    {},
    {},
    {},
    {},
    {},
    {}
  ],
  "name": "string",
  "value": [
    "string",
    "string",
    "string",
    "string",
    "string",
    "string",
    "string",
    "string"
  ],
  "id": 2
}