{
  "range": "string",
  "id": 10,
  "options": [
    {
      "name": "string",
      "value": 3,
      "always_send": true
    },
    {
      "name": "string",
      "value": 8,
      "always_send": false
    },
    {
      "name": "string",
      "value": 7,
      "always_send": true
    },
    {
      "name": "string",
      "value": 4,
      "always_send": true
    },
    {
      "name": "string",
      "value": 4,
      "always_send": false
    },
    {
      "name": "string",
      "value": 7,
      "always_send": true
    }
  ]
}