{
  "name": "string",
  "rt": "string",
  "tags": [
    "string",
    "string",
    "string",
    "string",
    "string",
    "string"
  ],
  "desc": "string",
  "kvps": {},
  "free_addresses_v4": "string",
  "used_addresses_v4": "string",
  "total_addresses_v4": "string",
  "num_prefixes_v4": "string",
  "free_addresses_v6": "string",
  "used_addresses_v6": "string",
  "total_addresses_v6": "string",
  "num_prefixes_v6": "string",
  "addresses": [
    {
      "addr_id": 0,
      "prefix": "string",
      "name": "string"
    }
  ]
}