{
  "prefix": "string",
  "network_id": 10,
  "kvps": {},
  "tags": [
    "string",
    "string",
    "string",
    "string",
    "string",
    "string",
    "string",
    "string",
    "string",
    "string"
  ],
  "desc": "string",
  "status": "string",
  "name": "string",
  "inherited_tags": [
    "string",
    "string",
    "string",
    "string",
    "string",
    "string"
  ],
  "total_addresses": "string",
  "children": 2,
  "free_addresses": "string",
  "id": 4,
  "indent": 4,
  "used_addresses": "string",
  "parent": {}
}