{
  "name": "adapter-ns1_enterprise",
  "webName": "Adapter for Integration to NS1 Enterprise",
  "supportLevel": "community",
  "vendor": "NS1",
  "product": "Enterprise",
  "techAlliance": false,
  "osVersion": [],
  "apiVersions": [],
  "iapVersions": [
    "2021.1.x",
    "2021.2.x",
    "2022.1.x",
    "2023.1.x"
  ],
  "method": "REST",
  "type": "Adapter",
  "domains": [
    "Inventory",
    "Network Services"
  ],
  "tags": [
    "Network Infrastructure Changes",
    "Configuration & Compliance"
  ],
  "useCases": [
    "Device Onboarding",
    "Assign Network & IP",
    "Create A Record",
    "Run network compliance checks and remediation",
    "Golden Configuration",
    "Bulk IP Address Allocation",
    "DNS Management"
  ],
  "deprecated": {
    "isDeprecated": false
  },
  "brokerSince": "",
  "authMethods": [
    {
      "type": "API Key",
      "primary": true
    }
  ],
  "documentation": {
    "storeLink": "",
    "npmLink": "https://www.npmjs.com/package/@itentialopensource/adapter-ns1_enterprise",
    "repoLink": "https://gitlab.com/itentialopensource/adapters/adapter-ns1_enterprise",
    "docLink": "https://gitlab.com/itentialopensource/adapters/adapter-ns1_enterprise/-/blob/master/README.md?ref_type=heads",
    "demoLinks": [],
    "trainingLinks": [
      {
        "title": "Itential Academy",
        "link": "https://www.itential.com/itential-academy/"
      }
    ],
    "faqLink": "https://docs.itential.com/opensource/docs/troubleshooting-an-adapter",
    "contributeLink": "https://gitlab.com/itentialopensource/adapters/contributing-guide",
    "issueLink": "https://itential.atlassian.net/servicedesk/customer/portals",
    "webLink": "https://www.itential.com/adapters/ns1-enterprise/",
    "vendorLink": "https://www.ibm.com/us-en",
    "productLink": "https://www.ibm.com/products/ns1-connect",
    "apiLinks": [
      {
        "title": "API documents for IBM NS1",
        "link": "https://developer.ibm.com/apis/catalog/ns1--ibm-ns1-connect-api/Introduction",
        "public": true
      }
    ],
    "workshopLinks": [],
    "workshopHomePage": "https://www.itential.com/get-started/"
  },
  "assets": [],
  "relatedItems": {
    "adapters": [],
    "integrations": [],
    "ecosystemApplications": [],
    "workflowProjects": [],
    "transformationProjects": [],
    "exampleProjects": []
  }
}