{
  "name": "string",
  "address": "string",
  "prefixLength": 6,
  "minPrefix": 2,
  "maxPrefix": 4,
  "defaultPrefix": 4,
  "algorithmType": "string",
  "poolName": "string",
  "createType": 2,
  "createReverseZone": true,
  "udas": [
    {
      "name": "string",
      "value": "string"
    },
    {
      "name": "string",
      "value": "string"
    }
  ],
  "groups": [
    {
      "name": "string",
      "udas": [
        {
          "name": "string",
          "value": "string"
        },
        {
          "name": "string",
          "value": "string"
        },
        {
          "name": "string",
          "value": "string"
        },
        {
          "name": "string",
          "value": "string"
        },
        {
          "name": "string",
          "value": "string"
        },
        {
          "name": "string",
          "value": "string"
        },
        {
          "name": "string",
          "value": "string"
        },
        {
          "name": "string",
          "value": "string"
        },
        {
          "name": "string",
          "value": "string"
        }
      ]
    },
    {
      "name": "string",
      "udas": [
        {
          "name": "string",
          "value": "string"
        },
        {
          "name": "string",
          "value": "string"
        }
      ]
    },
    {
      "name": "string",
      "udas": [
        {
          "name": "string",
          "value": "string"
        },
        {
          "name": "string",
          "value": "string"
        },
        {
          "name": "string",
          "value": "string"
        },
        {
          "name": "string",
          "value": "string"
        },
        {
          "name": "string",
          "value": "string"
        }
      ]
    },
    {
      "name": "string",
      "udas": [
        {
          "name": "string",
          "value": "string"
        },
        {
          "name": "string",
          "value": "string"
        },
        {
          "name": "string",
          "value": "string"
        },
        {
          "name": "string",
          "value": "string"
        }
      ]
    },
    {
      "name": "string",
      "udas": [
        {
          "name": "string",
          "value": "string"
        },
        {
          "name": "string",
          "value": "string"
        },
        {
          "name": "string",
          "value": "string"
        },
        {
          "name": "string",
          "value": "string"
        },
        {
          "name": "string",
          "value": "string"
        },
        {
          "name": "string",
          "value": "string"
        },
        {
          "name": "string",
          "value": "string"
        },
        {
          "name": "string",
          "value": "string"
        },
        {
          "name": "string",
          "value": "string"
        },
        {
          "name": "string",
          "value": "string"
        }
      ]
    },
    {
      "name": "string",
      "udas": [
        {
          "name": "string",
          "value": "string"
        },
        {
          "name": "string",
          "value": "string"
        },
        {
          "name": "string",
          "value": "string"
        },
        {
          "name": "string",
          "value": "string"
        },
        {
          "name": "string",
          "value": "string"
        },
        {
          "name": "string",
          "value": "string"
        },
        {
          "name": "string",
          "value": "string"
        },
        {
          "name": "string",
          "value": "string"
        },
        {
          "name": "string",
          "value": "string"
        }
      ]
    },
    {
      "name": "string",
      "udas": [
        {
          "name": "string",
          "value": "string"
        },
        {
          "name": "string",
          "value": "string"
        },
        {
          "name": "string",
          "value": "string"
        }
      ]
    },
    {
      "name": "string",
      "udas": [
        {
          "name": "string",
          "value": "string"
        },
        {
          "name": "string",
          "value": "string"
        },
        {
          "name": "string",
          "value": "string"
        },
        {
          "name": "string",
          "value": "string"
        },
        {
          "name": "string",
          "value": "string"
        },
        {
          "name": "string",
          "value": "string"
        },
        {
          "name": "string",
          "value": "string"
        },
        {
          "name": "string",
          "value": "string"
        }
      ]
    },
    {
      "name": "string",
      "udas": [
        {
          "name": "string",
          "value": "string"
        },
        {
          "name": "string",
          "value": "string"
        },
        {
          "name": "string",
          "value": "string"
        }
      ]
    }
  ]
}