[
  {
    "name": "string",
    "newName": "string",
    "fullQualifiedParentPoolName": "string",
    "parentName": "string",
    "contact": "string",
    "assignBlockType": "string",
    "notificationType": "string",
    "algorithmType": "string",
    "minPrefix": 6,
    "maxPrefix": 1,
    "defaultPrefix": 3,
    "blockReqType": "string",
    "createReverseZone": true,
    "udas": [
      {
        "name": "string",
        "value": "string"
      },
      {
        "name": "string",
        "value": "string"
      }
    ],
    "groups": [
      {
        "name": "string",
        "udas": [
          {
            "name": "string",
            "value": "string"
          },
          {
            "name": "string",
            "value": "string"
          },
          {
            "name": "string",
            "value": "string"
          },
          {
            "name": "string",
            "value": "string"
          }
        ]
      }
    ]
  }
]