[
  {
    "name": "string",
    "nodeType": "string",
    "uniqueID": "string",
    "duid": "string",
    "description": "string",
    "udas": [
      {
        "name": "string",
        "value": "string"
      },
      {
        "name": "string",
        "value": "string"
      },
      {
        "name": "string",
        "value": "string"
      },
      {
        "name": "string",
        "value": "string"
      },
      {
        "name": "string",
        "value": "string"
      },
      {
        "name": "string",
        "value": "string"
      },
      {
        "name": "string",
        "value": "string"
      },
      {
        "name": "string",
        "value": "string"
      },
      {
        "name": "string",
        "value": "string"
      }
    ],
    "groups": [
      {
        "name": "string",
        "udas": [
          {
            "name": "string",
            "value": "string"
          }
        ]
      },
      {
        "name": "string",
        "udas": [
          {
            "name": "string",
            "value": "string"
          }
        ]
      },
      {
        "name": "string",
        "udas": [
          {
            "name": "string",
            "value": "string"
          },
          {
            "name": "string",
            "value": "string"
          },
          {
            "name": "string",
            "value": "string"
          },
          {
            "name": "string",
            "value": "string"
          },
          {
            "name": "string",
            "value": "string"
          },
          {
            "name": "string",
            "value": "string"
          },
          {
            "name": "string",
            "value": "string"
          },
          {
            "name": "string",
            "value": "string"
          },
          {
            "name": "string",
            "value": "string"
          }
        ]
      },
      {
        "name": "string",
        "udas": [
          {
            "name": "string",
            "value": "string"
          },
          {
            "name": "string",
            "value": "string"
          },
          {
            "name": "string",
            "value": "string"
          },
          {
            "name": "string",
            "value": "string"
          },
          {
            "name": "string",
            "value": "string"
          },
          {
            "name": "string",
            "value": "string"
          },
          {
            "name": "string",
            "value": "string"
          }
        ]
      },
      {
        "name": "string",
        "udas": [
          {
            "name": "string",
            "value": "string"
          },
          {
            "name": "string",
            "value": "string"
          },
          {
            "name": "string",
            "value": "string"
          },
          {
            "name": "string",
            "value": "string"
          },
          {
            "name": "string",
            "value": "string"
          },
          {
            "name": "string",
            "value": "string"
          },
          {
            "name": "string",
            "value": "string"
          },
          {
            "name": "string",
            "value": "string"
          }
        ]
      },
      {
        "name": "string",
        "udas": [
          {
            "name": "string",
            "value": "string"
          }
        ]
      },
      {
        "name": "string",
        "udas": [
          {
            "name": "string",
            "value": "string"
          },
          {
            "name": "string",
            "value": "string"
          },
          {
            "name": "string",
            "value": "string"
          },
          {
            "name": "string",
            "value": "string"
          },
          {
            "name": "string",
            "value": "string"
          }
        ]
      },
      {
        "name": "string",
        "udas": [
          {
            "name": "string",
            "value": "string"
          },
          {
            "name": "string",
            "value": "string"
          }
        ]
      },
      {
        "name": "string",
        "udas": [
          {
            "name": "string",
            "value": "string"
          }
        ]
      },
      {
        "name": "string",
        "udas": [
          {
            "name": "string",
            "value": "string"
          },
          {
            "name": "string",
            "value": "string"
          },
          {
            "name": "string",
            "value": "string"
          },
          {
            "name": "string",
            "value": "string"
          },
          {
            "name": "string",
            "value": "string"
          },
          {
            "name": "string",
            "value": "string"
          },
          {
            "name": "string",
            "value": "string"
          },
          {
            "name": "string",
            "value": "string"
          }
        ]
      }
    ]
  },
  {
    "name": "string",
    "nodeType": "string",
    "uniqueID": "string",
    "duid": "string",
    "description": "string",
    "udas": [
      {
        "name": "string",
        "value": "string"
      },
      {
        "name": "string",
        "value": "string"
      },
      {
        "name": "string",
        "value": "string"
      },
      {
        "name": "string",
        "value": "string"
      },
      {
        "name": "string",
        "value": "string"
      },
      {
        "name": "string",
        "value": "string"
      },
      {
        "name": "string",
        "value": "string"
      },
      {
        "name": "string",
        "value": "string"
      }
    ],
    "groups": [
      {
        "name": "string",
        "udas": [
          {
            "name": "string",
            "value": "string"
          },
          {
            "name": "string",
            "value": "string"
          },
          {
            "name": "string",
            "value": "string"
          },
          {
            "name": "string",
            "value": "string"
          },
          {
            "name": "string",
            "value": "string"
          },
          {
            "name": "string",
            "value": "string"
          },
          {
            "name": "string",
            "value": "string"
          }
        ]
      },
      {
        "name": "string",
        "udas": [
          {
            "name": "string",
            "value": "string"
          }
        ]
      },
      {
        "name": "string",
        "udas": [
          {
            "name": "string",
            "value": "string"
          },
          {
            "name": "string",
            "value": "string"
          }
        ]
      },
      {
        "name": "string",
        "udas": [
          {
            "name": "string",
            "value": "string"
          },
          {
            "name": "string",
            "value": "string"
          }
        ]
      },
      {
        "name": "string",
        "udas": [
          {
            "name": "string",
            "value": "string"
          },
          {
            "name": "string",
            "value": "string"
          }
        ]
      },
      {
        "name": "string",
        "udas": [
          {
            "name": "string",
            "value": "string"
          },
          {
            "name": "string",
            "value": "string"
          },
          {
            "name": "string",
            "value": "string"
          },
          {
            "name": "string",
            "value": "string"
          },
          {
            "name": "string",
            "value": "string"
          },
          {
            "name": "string",
            "value": "string"
          }
        ]
      }
    ]
  },
  {
    "name": "string",
    "nodeType": "string",
    "uniqueID": "string",
    "duid": "string",
    "description": "string",
    "udas": [
      {
        "name": "string",
        "value": "string"
      },
      {
        "name": "string",
        "value": "string"
      },
      {
        "name": "string",
        "value": "string"
      },
      {
        "name": "string",
        "value": "string"
      },
      {
        "name": "string",
        "value": "string"
      }
    ],
    "groups": [
      {
        "name": "string",
        "udas": [
          {
            "name": "string",
            "value": "string"
          },
          {
            "name": "string",
            "value": "string"
          },
          {
            "name": "string",
            "value": "string"
          },
          {
            "name": "string",
            "value": "string"
          }
        ]
      },
      {
        "name": "string",
        "udas": [
          {
            "name": "string",
            "value": "string"
          },
          {
            "name": "string",
            "value": "string"
          },
          {
            "name": "string",
            "value": "string"
          },
          {
            "name": "string",
            "value": "string"
          },
          {
            "name": "string",
            "value": "string"
          },
          {
            "name": "string",
            "value": "string"
          },
          {
            "name": "string",
            "value": "string"
          }
        ]
      },
      {
        "name": "string",
        "udas": [
          {
            "name": "string",
            "value": "string"
          },
          {
            "name": "string",
            "value": "string"
          },
          {
            "name": "string",
            "value": "string"
          },
          {
            "name": "string",
            "value": "string"
          },
          {
            "name": "string",
            "value": "string"
          },
          {
            "name": "string",
            "value": "string"
          },
          {
            "name": "string",
            "value": "string"
          },
          {
            "name": "string",
            "value": "string"
          },
          {
            "name": "string",
            "value": "string"
          },
          {
            "name": "string",
            "value": "string"
          }
        ]
      },
      {
        "name": "string",
        "udas": [
          {
            "name": "string",
            "value": "string"
          }
        ]
      },
      {
        "name": "string",
        "udas": [
          {
            "name": "string",
            "value": "string"
          },
          {
            "name": "string",
            "value": "string"
          },
          {
            "name": "string",
            "value": "string"
          }
        ]
      },
      {
        "name": "string",
        "udas": [
          {
            "name": "string",
            "value": "string"
          },
          {
            "name": "string",
            "value": "string"
          },
          {
            "name": "string",
            "value": "string"
          },
          {
            "name": "string",
            "value": "string"
          },
          {
            "name": "string",
            "value": "string"
          },
          {
            "name": "string",
            "value": "string"
          },
          {
            "name": "string",
            "value": "string"
          },
          {
            "name": "string",
            "value": "string"
          }
        ]
      },
      {
        "name": "string",
        "udas": [
          {
            "name": "string",
            "value": "string"
          },
          {
            "name": "string",
            "value": "string"
          },
          {
            "name": "string",
            "value": "string"
          },
          {
            "name": "string",
            "value": "string"
          },
          {
            "name": "string",
            "value": "string"
          }
        ]
      },
      {
        "name": "string",
        "udas": [
          {
            "name": "string",
            "value": "string"
          },
          {
            "name": "string",
            "value": "string"
          },
          {
            "name": "string",
            "value": "string"
          },
          {
            "name": "string",
            "value": "string"
          },
          {
            "name": "string",
            "value": "string"
          },
          {
            "name": "string",
            "value": "string"
          },
          {
            "name": "string",
            "value": "string"
          }
        ]
      }
    ]
  },
  {
    "name": "string",
    "nodeType": "string",
    "uniqueID": "string",
    "duid": "string",
    "description": "string",
    "udas": [
      {
        "name": "string",
        "value": "string"
      },
      {
        "name": "string",
        "value": "string"
      },
      {
        "name": "string",
        "value": "string"
      },
      {
        "name": "string",
        "value": "string"
      },
      {
        "name": "string",
        "value": "string"
      }
    ],
    "groups": [
      {
        "name": "string",
        "udas": [
          {
            "name": "string",
            "value": "string"
          },
          {
            "name": "string",
            "value": "string"
          },
          {
            "name": "string",
            "value": "string"
          },
          {
            "name": "string",
            "value": "string"
          },
          {
            "name": "string",
            "value": "string"
          },
          {
            "name": "string",
            "value": "string"
          }
        ]
      },
      {
        "name": "string",
        "udas": [
          {
            "name": "string",
            "value": "string"
          },
          {
            "name": "string",
            "value": "string"
          }
        ]
      },
      {
        "name": "string",
        "udas": [
          {
            "name": "string",
            "value": "string"
          },
          {
            "name": "string",
            "value": "string"
          },
          {
            "name": "string",
            "value": "string"
          },
          {
            "name": "string",
            "value": "string"
          }
        ]
      },
      {
        "name": "string",
        "udas": [
          {
            "name": "string",
            "value": "string"
          }
        ]
      },
      {
        "name": "string",
        "udas": [
          {
            "name": "string",
            "value": "string"
          },
          {
            "name": "string",
            "value": "string"
          },
          {
            "name": "string",
            "value": "string"
          }
        ]
      },
      {
        "name": "string",
        "udas": [
          {
            "name": "string",
            "value": "string"
          },
          {
            "name": "string",
            "value": "string"
          },
          {
            "name": "string",
            "value": "string"
          },
          {
            "name": "string",
            "value": "string"
          },
          {
            "name": "string",
            "value": "string"
          },
          {
            "name": "string",
            "value": "string"
          },
          {
            "name": "string",
            "value": "string"
          },
          {
            "name": "string",
            "value": "string"
          }
        ]
      },
      {
        "name": "string",
        "udas": [
          {
            "name": "string",
            "value": "string"
          },
          {
            "name": "string",
            "value": "string"
          },
          {
            "name": "string",
            "value": "string"
          },
          {
            "name": "string",
            "value": "string"
          },
          {
            "name": "string",
            "value": "string"
          }
        ]
      },
      {
        "name": "string",
        "udas": [
          {
            "name": "string",
            "value": "string"
          },
          {
            "name": "string",
            "value": "string"
          },
          {
            "name": "string",
            "value": "string"
          },
          {
            "name": "string",
            "value": "string"
          },
          {
            "name": "string",
            "value": "string"
          }
        ]
      }
    ]
  }
]