{
  "id": 3,
  "device": {
    "id": 8,
    "url": "string",
    "name": "string",
    "display_name": "string"
  },
  "name": "string",
  "type": {
    "label": "Extreme SummitStack-512",
    "value": "2.5gbase-t"
  },
  "enabled": false,
  "lag": {
    "id": 1,
    "url": "string",
    "device": {
      "id": 1,
      "url": "string",
      "name": "string",
      "display_name": "string"
    },
    "name": "string",
    "cable": 5,
    "connection_status": {
      "label": "Connected",
      "value": false
    }
  },
  "mtu": 6,
  "mac_address": "string",
  "mgmt_only": true,
  "description": "string",
  "connected_endpoint_type": "string",
  "connected_endpoint": {},
  "connection_status": {
    "label": "Not Connected",
    "value": true
  },
  "cable": {
    "id": 9,
    "url": "string",
    "label": "string"
  },
  "mode": {
    "label": "Access",
    "value": "tagged"
  },
  "untagged_vlan": {
    "id": 3,
    "url": "string",
    "vid": 5,
    "name": "string",
    "display_name": "string"
  },
  "tagged_vlans": [
    {
      "id": 5,
      "url": "string",
      "vid": 2,
      "name": "string",
      "display_name": "string"
    },
    {
      "id": 10,
      "url": "string",
      "vid": 3,
      "name": "string",
      "display_name": "string"
    },
    {
      "id": 2,
      "url": "string",
      "vid": 2,
      "name": "string",
      "display_name": "string"
    },
    {
      "id": 5,
      "url": "string",
      "vid": 7,
      "name": "string",
      "display_name": "string"
    },
    {
      "id": 2,
      "url": "string",
      "vid": 5,
      "name": "string",
      "display_name": "string"
    },
    {
      "id": 4,
      "url": "string",
      "vid": 6,
      "name": "string",
      "display_name": "string"
    },
    {
      "id": 1,
      "url": "string",
      "vid": 9,
      "name": "string",
      "display_name": "string"
    },
    {
      "id": 5,
      "url": "string",
      "vid": 4,
      "name": "string",
      "display_name": "string"
    }
  ],
  "tags": [
    "string",
    "string",
    "string",
    "string"
  ],
  "count_ipaddresses": 10
}