{
  "id": 4,
  "name": "string",
  "slug": "string",
  "site": {
    "id": 10,
    "url": "string",
    "name": "string",
    "slug": "string"
  },
  "parent": {
    "id": 10,
    "url": "string",
    "name": "string",
    "slug": "string",
    "rack_count": 1
  },
  "description": "string",
  "rack_count": 2
}