{
  "id": 1,
  "device_type": {
    "id": 6,
    "url": "string",
    "manufacturer": {
      "id": 7,
      "url": "string",
      "name": "string",
      "slug": "string",
      "devicetype_count": 8
    },
    "model": "string",
    "slug": "string",
    "display_name": "string",
    "device_count": 5
  },
  "name": "string",
  "type": {
    "label": "RJ-12",
    "value": "usb-b"
  }
}