{
  "id": 2,
  "device": {
    "id": 1,
    "url": "string",
    "name": "string",
    "display_name": "string"
  },
  "name": "string",
  "type": {
    "label": "ITA Type M (BS 546)",
    "value": "ita-i"
  },
  "power_port": {
    "id": 10,
    "url": "string",
    "device": {
      "id": 2,
      "url": "string",
      "name": "string",
      "display_name": "string"
    },
    "name": "string",
    "cable": 5,
    "connection_status": {
      "label": "Not Connected",
      "value": true
    }
  },
  "feed_leg": {
    "label": "A",
    "value": "C"
  },
  "description": "string",
  "connected_endpoint_type": "string",
  "connected_endpoint": {},
  "connection_status": {
    "label": "Not Connected",
    "value": true
  },
  "cable": {
    "id": 10,
    "url": "string",
    "label": "string"
  },
  "tags": [
    "string",
    "string",
    "string",
    "string",
    "string"
  ]
}