{
  "count": 8,
  "next": "string",
  "previous": "string",
  "results": [
    {
      "id": 5,
      "name": "string",
      "type": {
        "id": 5,
        "url": "string",
        "name": "string",
        "slug": "string",
        "cluster_count": 2
      },
      "group": {
        "id": 9,
        "url": "string",
        "name": "string",
        "slug": "string",
        "cluster_count": 3
      },
      "tenant": {
        "id": 5,
        "url": "string",
        "name": "string",
        "slug": "string"
      },
      "site": {
        "id": 3,
        "url": "string",
        "name": "string",
        "slug": "string"
      },
      "comments": "string",
      "tags": [
        "string",
        "string",
        "string",
        "string",
        "string",
        "string"
      ],
      "custom_fields": {},
      "created": "string",
      "last_updated": "string",
      "device_count": 10,
      "virtualmachine_count": 9
    },
    {
      "id": 9,
      "name": "string",
      "type": {
        "id": 7,
        "url": "string",
        "name": "string",
        "slug": "string",
        "cluster_count": 9
      },
      "group": {
        "id": 2,
        "url": "string",
        "name": "string",
        "slug": "string",
        "cluster_count": 3
      },
      "tenant": {
        "id": 1,
        "url": "string",
        "name": "string",
        "slug": "string"
      },
      "site": {
        "id": 5,
        "url": "string",
        "name": "string",
        "slug": "string"
      },
      "comments": "string",
      "tags": [
        "string",
        "string",
        "string",
        "string",
        "string",
        "string",
        "string",
        "string",
        "string"
      ],
      "custom_fields": {},
      "created": "string",
      "last_updated": "string",
      "device_count": 4,
      "virtualmachine_count": 2
    },
    {
      "id": 7,
      "name": "string",
      "type": {
        "id": 4,
        "url": "string",
        "name": "string",
        "slug": "string",
        "cluster_count": 4
      },
      "group": {
        "id": 9,
        "url": "string",
        "name": "string",
        "slug": "string",
        "cluster_count": 9
      },
      "tenant": {
        "id": 7,
        "url": "string",
        "name": "string",
        "slug": "string"
      },
      "site": {
        "id": 8,
        "url": "string",
        "name": "string",
        "slug": "string"
      },
      "comments": "string",
      "tags": [
        "string",
        "string",
        "string",
        "string"
      ],
      "custom_fields": {},
      "created": "string",
      "last_updated": "string",
      "device_count": 2,
      "virtualmachine_count": 7
    },
    {
      "id": 9,
      "name": "string",
      "type": {
        "id": 5,
        "url": "string",
        "name": "string",
        "slug": "string",
        "cluster_count": 5
      },
      "group": {
        "id": 8,
        "url": "string",
        "name": "string",
        "slug": "string",
        "cluster_count": 8
      },
      "tenant": {
        "id": 1,
        "url": "string",
        "name": "string",
        "slug": "string"
      },
      "site": {
        "id": 9,
        "url": "string",
        "name": "string",
        "slug": "string"
      },
      "comments": "string",
      "tags": [
        "string",
        "string"
      ],
      "custom_fields": {},
      "created": "string",
      "last_updated": "string",
      "device_count": 7,
      "virtualmachine_count": 2
    },
    {
      "id": 2,
      "name": "string",
      "type": {
        "id": 6,
        "url": "string",
        "name": "string",
        "slug": "string",
        "cluster_count": 4
      },
      "group": {
        "id": 3,
        "url": "string",
        "name": "string",
        "slug": "string",
        "cluster_count": 8
      },
      "tenant": {
        "id": 7,
        "url": "string",
        "name": "string",
        "slug": "string"
      },
      "site": {
        "id": 7,
        "url": "string",
        "name": "string",
        "slug": "string"
      },
      "comments": "string",
      "tags": [
        "string",
        "string",
        "string",
        "string",
        "string",
        "string",
        "string"
      ],
      "custom_fields": {},
      "created": "string",
      "last_updated": "string",
      "device_count": 10,
      "virtualmachine_count": 5
    },
    {
      "id": 6,
      "name": "string",
      "type": {
        "id": 8,
        "url": "string",
        "name": "string",
        "slug": "string",
        "cluster_count": 8
      },
      "group": {
        "id": 9,
        "url": "string",
        "name": "string",
        "slug": "string",
        "cluster_count": 9
      },
      "tenant": {
        "id": 8,
        "url": "string",
        "name": "string",
        "slug": "string"
      },
      "site": {
        "id": 9,
        "url": "string",
        "name": "string",
        "slug": "string"
      },
      "comments": "string",
      "tags": [
        "string",
        "string",
        "string",
        "string",
        "string",
        "string",
        "string"
      ],
      "custom_fields": {},
      "created": "string",
      "last_updated": "string",
      "device_count": 7,
      "virtualmachine_count": 5
    }
  ]
}