{
  "id": 9,
  "site": {
    "id": 4,
    "url": "string",
    "name": "string",
    "slug": "string"
  },
  "group": {
    "id": 4,
    "url": "string",
    "name": "string",
    "slug": "string",
    "vlan_count": 9
  },
  "vid": 5,
  "name": "string",
  "tenant": {
    "id": 1,
    "url": "string",
    "name": "string",
    "slug": "string"
  },
  "status": {
    "label": "Active",
    "value": "active"
  },
  "role": {
    "id": 9,
    "url": "string",
    "name": "string",
    "slug": "string",
    "prefix_count": 7,
    "vlan_count": 3
  },
  "description": "string",
  "tags": [
    "string",
    "string",
    "string",
    "string",
    "string",
    "string",
    "string",
    "string",
    "string"
  ],
  "display_name": "string",
  "custom_fields": {
    "service-id": null
  },
  "created": "string",
  "last_updated": "string",
  "prefix_count": 9
}