{
  "count": 7,
  "next": "string",
  "previous": "string",
  "results": [
    {
      "id": 8,
      "name": "string",
      "slug": "string",
      "asn": 4,
      "account": "string",
      "portal_url": "string",
      "noc_contact": "string",
      "admin_contact": "string",
      "comments": "string",
      "tags": [
        "string",
        "string",
        "string",
        "string",
        "string"
      ],
      "custom_fields": {},
      "created": "string",
      "last_updated": "string",
      "circuit_count": 3
    },
    {
      "id": 5,
      "name": "string",
      "slug": "string",
      "asn": 7,
      "account": "string",
      "portal_url": "string",
      "noc_contact": "string",
      "admin_contact": "string",
      "comments": "string",
      "tags": [
        "string",
        "string",
        "string",
        "string",
        "string",
        "string",
        "string",
        "string",
        "string"
      ],
      "custom_fields": {},
      "created": "string",
      "last_updated": "string",
      "circuit_count": 2
    },
    {
      "id": 1,
      "name": "string",
      "slug": "string",
      "asn": 4,
      "account": "string",
      "portal_url": "string",
      "noc_contact": "string",
      "admin_contact": "string",
      "comments": "string",
      "tags": [
        "string",
        "string",
        "string",
        "string",
        "string",
        "string"
      ],
      "custom_fields": {},
      "created": "string",
      "last_updated": "string",
      "circuit_count": 2
    },
    {
      "id": 2,
      "name": "string",
      "slug": "string",
      "asn": 6,
      "account": "string",
      "portal_url": "string",
      "noc_contact": "string",
      "admin_contact": "string",
      "comments": "string",
      "tags": [
        "string",
        "string",
        "string",
        "string",
        "string",
        "string",
        "string"
      ],
      "custom_fields": {},
      "created": "string",
      "last_updated": "string",
      "circuit_count": 5
    },
    {
      "id": 6,
      "name": "string",
      "slug": "string",
      "asn": 4,
      "account": "string",
      "portal_url": "string",
      "noc_contact": "string",
      "admin_contact": "string",
      "comments": "string",
      "tags": [
        "string",
        "string",
        "string",
        "string",
        "string",
        "string",
        "string",
        "string",
        "string",
        "string"
      ],
      "custom_fields": {},
      "created": "string",
      "last_updated": "string",
      "circuit_count": 4
    },
    {
      "id": 1,
      "name": "string",
      "slug": "string",
      "asn": 6,
      "account": "string",
      "portal_url": "string",
      "noc_contact": "string",
      "admin_contact": "string",
      "comments": "string",
      "tags": [
        "string",
        "string",
        "string",
        "string",
        "string",
        "string",
        "string",
        "string",
        "string",
        "string"
      ],
      "custom_fields": {},
      "created": "string",
      "last_updated": "string",
      "circuit_count": 4
    },
    {
      "id": 8,
      "name": "string",
      "slug": "string",
      "asn": 10,
      "account": "string",
      "portal_url": "string",
      "noc_contact": "string",
      "admin_contact": "string",
      "comments": "string",
      "tags": [
        "string",
        "string",
        "string",
        "string",
        "string",
        "string",
        "string",
        "string"
      ],
      "custom_fields": {},
      "created": "string",
      "last_updated": "string",
      "circuit_count": 9
    }
  ]
}