{
  "id": 2,
  "name": "string",
  "rd": "string",
  "tenant": {
    "id": 7,
    "url": "string",
    "name": "string",
    "slug": "string"
  },
  "enforce_unique": true,
  "description": "string",
  "tags": [
    "string",
    "string",
    "string",
    "string",
    "string",
    "string",
    "string",
    "string",
    "string"
  ],
  "display_name": "string",
  "custom_fields": {},
  "created": "string",
  "last_updated": "string",
  "ipaddress_count": 7,
  "prefix_count": 3
}