{
  "id": 8,
  "name": "string",
  "slug": "string",
  "site": {
    "id": 6,
    "url": "string",
    "name": "string",
    "slug": "string"
  },
  "parent": {
    "id": 6,
    "url": "string",
    "name": "string",
    "slug": "string",
    "rack_count": 5
  },
  "description": "string",
  "rack_count": 7
}