{
  "id": 6,
  "name": "string",
  "slug": "string",
  "parent": {
    "id": 5,
    "url": "string",
    "name": "string",
    "slug": "string",
    "site_count": 4
  },
  "description": "string",
  "site_count": 2
}