{
  "count": 10,
  "next": "string",
  "previous": "string",
  "results": [
    {
      "id": 6,
      "name": "string",
      "slug": "string",
      "manufacturer": {
        "id": 4,
        "url": "string",
        "name": "string",
        "slug": "string",
        "devicetype_count": 8
      },
      "napalm_driver": "string",
      "napalm_args": "string",
      "description": "string",
      "device_count": 4,
      "virtualmachine_count": 8
    },
    {
      "id": 10,
      "name": "string",
      "slug": "string",
      "manufacturer": {
        "id": 3,
        "url": "string",
        "name": "string",
        "slug": "string",
        "devicetype_count": 8
      },
      "napalm_driver": "string",
      "napalm_args": "string",
      "description": "string",
      "device_count": 4,
      "virtualmachine_count": 2
    },
    {
      "id": 6,
      "name": "string",
      "slug": "string",
      "manufacturer": {
        "id": 1,
        "url": "string",
        "name": "string",
        "slug": "string",
        "devicetype_count": 7
      },
      "napalm_driver": "string",
      "napalm_args": "string",
      "description": "string",
      "device_count": 5,
      "virtualmachine_count": 10
    },
    {
      "id": 9,
      "name": "string",
      "slug": "string",
      "manufacturer": {
        "id": 2,
        "url": "string",
        "name": "string",
        "slug": "string",
        "devicetype_count": 5
      },
      "napalm_driver": "string",
      "napalm_args": "string",
      "description": "string",
      "device_count": 10,
      "virtualmachine_count": 2
    },
    {
      "id": 4,
      "name": "string",
      "slug": "string",
      "manufacturer": {
        "id": 10,
        "url": "string",
        "name": "string",
        "slug": "string",
        "devicetype_count": 2
      },
      "napalm_driver": "string",
      "napalm_args": "string",
      "description": "string",
      "device_count": 5,
      "virtualmachine_count": 9
    },
    {
      "id": 4,
      "name": "string",
      "slug": "string",
      "manufacturer": {
        "id": 2,
        "url": "string",
        "name": "string",
        "slug": "string",
        "devicetype_count": 9
      },
      "napalm_driver": "string",
      "napalm_args": "string",
      "description": "string",
      "device_count": 1,
      "virtualmachine_count": 6
    },
    {
      "id": 7,
      "name": "string",
      "slug": "string",
      "manufacturer": {
        "id": 9,
        "url": "string",
        "name": "string",
        "slug": "string",
        "devicetype_count": 8
      },
      "napalm_driver": "string",
      "napalm_args": "string",
      "description": "string",
      "device_count": 5,
      "virtualmachine_count": 8
    },
    {
      "id": 2,
      "name": "string",
      "slug": "string",
      "manufacturer": {
        "id": 6,
        "url": "string",
        "name": "string",
        "slug": "string",
        "devicetype_count": 2
      },
      "napalm_driver": "string",
      "napalm_args": "string",
      "description": "string",
      "device_count": 8,
      "virtualmachine_count": 8
    },
    {
      "id": 4,
      "name": "string",
      "slug": "string",
      "manufacturer": {
        "id": 4,
        "url": "string",
        "name": "string",
        "slug": "string",
        "devicetype_count": 2
      },
      "napalm_driver": "string",
      "napalm_args": "string",
      "description": "string",
      "device_count": 8,
      "virtualmachine_count": 7
    },
    {
      "id": 9,
      "name": "string",
      "slug": "string",
      "manufacturer": {
        "id": 2,
        "url": "string",
        "name": "string",
        "slug": "string",
        "devicetype_count": 10
      },
      "napalm_driver": "string",
      "napalm_args": "string",
      "description": "string",
      "device_count": 5,
      "virtualmachine_count": 1
    }
  ]
}