{
  "id": 2,
  "device": {
    "id": 1,
    "url": "string",
    "name": "string",
    "display_name": "string"
  },
  "name": "string",
  "type": {
    "label": "Other",
    "value": "rj-12"
  },
  "description": "string",
  "connected_endpoint_type": "string",
  "connected_endpoint": {},
  "connection_status": {
    "label": "Not Connected",
    "value": false
  },
  "cable": {
    "id": 8,
    "url": "string",
    "label": "string"
  },
  "tags": [
    "string",
    "string",
    "string",
    "string",
    "string",
    "string"
  ]
}