{
  "id": 7,
  "name": "string",
  "slug": "string",
  "group": {
    "id": 2,
    "url": "string",
    "name": "string",
    "slug": "string",
    "tenant_count": 3
  },
  "description": "string",
  "comments": "string",
  "tags": [
    "string",
    "string",
    "string",
    "string",
    "string",
    "string"
  ],
  "custom_fields": {},
  "created": "string",
  "last_updated": "string",
  "circuit_count": 5,
  "device_count": 1,
  "ipaddress_count": 2,
  "prefix_count": 10,
  "rack_count": 7,
  "site_count": 2,
  "virtualmachine_count": 10,
  "vlan_count": 4,
  "vrf_count": 4,
  "cluster_count": 3
}