{
  "count": 2,
  "next": "string",
  "previous": "string",
  "results": [
    {
      "id": 4,
      "name": "string",
      "slug": "string",
      "description": "string",
      "cluster_count": 6
    }
  ]
}