{
  "id": 5,
  "name": "string",
  "slug": "string",
  "asn": 7,
  "account": "string",
  "portal_url": "string",
  "noc_contact": "string",
  "admin_contact": "string",
  "comments": "string",
  "tags": [
    "string",
    "string",
    "string"
  ],
  "custom_fields": {},
  "created": "string",
  "last_updated": "string",
  "circuit_count": 1
}