{
  "id": 3,
  "cid": "string",
  "provider": {
    "id": 5,
    "url": "string",
    "name": "string",
    "slug": "string",
    "circuit_count": 5
  },
  "type": {
    "id": 10,
    "url": "string",
    "name": "string",
    "slug": "string",
    "circuit_count": 8
  },
  "status": {
    "label": "Offline",
    "value": "active"
  },
  "tenant": {
    "id": 10,
    "url": "string",
    "name": "string",
    "slug": "string"
  },
  "install_date": "string",
  "commit_rate": 9,
  "description": "string",
  "termination_a": {
    "id": 2,
    "url": "string",
    "site": {
      "id": 2,
      "url": "string",
      "name": "string",
      "slug": "string"
    },
    "connected_endpoint": {
      "id": 2,
      "url": "string",
      "device": {
        "id": 4,
        "url": "string",
        "name": "string",
        "display_name": "string"
      },
      "name": "string",
      "cable": 1,
      "connection_status": {
        "label": "Connected",
        "value": false
      }
    },
    "port_speed": 1,
    "upstream_speed": 7,
    "xconnect_id": "string"
  },
  "termination_z": {
    "id": 1,
    "url": "string",
    "site": {
      "id": 2,
      "url": "string",
      "name": "string",
      "slug": "string"
    },
    "connected_endpoint": {
      "id": 7,
      "url": "string",
      "device": {
        "id": 9,
        "url": "string",
        "name": "string",
        "display_name": "string"
      },
      "name": "string",
      "cable": 3,
      "connection_status": {
        "label": "Connected",
        "value": false
      }
    },
    "port_speed": 4,
    "upstream_speed": 10,
    "xconnect_id": "string"
  },
  "comments": "string",
  "tags": [
    "string",
    "string",
    "string",
    "string",
    "string",
    "string"
  ],
  "custom_fields": {},
  "created": "string",
  "last_updated": "string"
}