{
  "count": 5,
  "next": "string",
  "previous": "string",
  "results": [
    {
      "id": 3,
      "power_panel": {
        "id": 9,
        "url": "string",
        "name": "string",
        "powerfeed_count": 4
      },
      "rack": {
        "id": 10,
        "url": "string",
        "name": "string",
        "display_name": "string",
        "device_count": 10
      },
      "name": "string",
      "status": {
        "id": 1,
        "label": "Active",
        "value": "active"
      },
      "type": {
        "id": 1,
        "label": "Primary",
        "value": "primary"
      },
      "supply": {
        "id": 1,
        "label": "AC",
        "value": "ac"
      },
      "phase": {
        "id": 1,
        "label": "Single phase",
        "value": "single-phase"
      },
      "voltage": 7,
      "amperage": 9,
      "max_utilization": 10,
      "comments": "string",
      "tags": [
        "string"
      ],
      "custom_fields": {},
      "created": "string",
      "last_updated": "string"
    },
    {
      "id": 4,
      "power_panel": {
        "id": 7,
        "url": "string",
        "name": "string",
        "powerfeed_count": 9
      },
      "rack": {
        "id": 10,
        "url": "string",
        "name": "string",
        "display_name": "string",
        "device_count": 10
      },
      "name": "string",
      "status": {
        "id": 1,
        "label": "Active",
        "value": "active"
      },
      "type": {
        "id": 1,
        "label": "Primary",
        "value": "primary"
      },
      "supply": {
        "id": 1,
        "label": "AC",
        "value": "ac"
      },
      "phase": {
        "id": 1,
        "label": "Single phase",
        "value": "single-phase"
      },
      "voltage": 8,
      "amperage": 1,
      "max_utilization": 5,
      "comments": "string",
      "tags": [
        "string",
        "string",
        "string",
        "string",
        "string",
        "string"
      ],
      "custom_fields": {},
      "created": "string",
      "last_updated": "string"
    },
    {
      "id": 3,
      "power_panel": {
        "id": 7,
        "url": "string",
        "name": "string",
        "powerfeed_count": 3
      },
      "rack": {
        "id": 10,
        "url": "string",
        "name": "string",
        "display_name": "string",
        "device_count": 5
      },
      "name": "string",
      "status": {
        "id": 1,
        "label": "Active",
        "value": "active"
      },
      "type": {
        "id": 1,
        "label": "Primary",
        "value": "primary"
      },
      "supply": {
        "id": 1,
        "label": "AC",
        "value": "ac"
      },
      "phase": {
        "id": 1,
        "label": "Single phase",
        "value": "single-phase"
      },
      "voltage": 1,
      "amperage": 1,
      "max_utilization": 9,
      "comments": "string",
      "tags": [
        "string"
      ],
      "custom_fields": {},
      "created": "string",
      "last_updated": "string"
    },
    {
      "id": 10,
      "power_panel": {
        "id": 9,
        "url": "string",
        "name": "string",
        "powerfeed_count": 6
      },
      "rack": {
        "id": 10,
        "url": "string",
        "name": "string",
        "display_name": "string",
        "device_count": 10
      },
      "name": "string",
      "status": {
        "id": 1,
        "label": "Active",
        "value": "active"
      },
      "type": {
        "id": 1,
        "label": "Primary",
        "value": "primary"
      },
      "supply": {
        "id": 1,
        "label": "AC",
        "value": "ac"
      },
      "phase": {
        "id": 1,
        "label": "Single phase",
        "value": "single-phase"
      },
      "voltage": 10,
      "amperage": 8,
      "max_utilization": 5,
      "comments": "string",
      "tags": [
        "string"
      ],
      "custom_fields": {},
      "created": "string",
      "last_updated": "string"
    }
  ]
}