{
  "id": 2,
  "site": {
    "id": 2,
    "url": "string",
    "name": "string",
    "slug": "string"
  },
  "rack_group": {
    "id": 3,
    "url": "string",
    "name": "string",
    "slug": "string",
    "rack_count": 9
  },
  "name": "string",
  "powerfeed_count": 2
}