{
  "count": 6,
  "next": "string",
  "previous": "string",
  "results": [
    {
      "id": 7,
      "device_type": {
        "id": 7,
        "url": "string",
        "manufacturer": {
          "id": 1,
          "url": "string",
          "name": "string",
          "slug": "string",
          "devicetype_count": 8
        },
        "model": "string",
        "slug": "string",
        "display_name": "string",
        "device_count": 1
      },
      "name": "string"
    },
    {
      "id": 10,
      "device_type": {
        "id": 6,
        "url": "string",
        "manufacturer": {
          "id": 4,
          "url": "string",
          "name": "string",
          "slug": "string",
          "devicetype_count": 1
        },
        "model": "string",
        "slug": "string",
        "display_name": "string",
        "device_count": 8
      },
      "name": "string"
    },
    {
      "id": 10,
      "device_type": {
        "id": 9,
        "url": "string",
        "manufacturer": {
          "id": 9,
          "url": "string",
          "name": "string",
          "slug": "string",
          "devicetype_count": 1
        },
        "model": "string",
        "slug": "string",
        "display_name": "string",
        "device_count": 5
      },
      "name": "string"
    },
    {
      "id": 7,
      "device_type": {
        "id": 9,
        "url": "string",
        "manufacturer": {
          "id": 1,
          "url": "string",
          "name": "string",
          "slug": "string",
          "devicetype_count": 4
        },
        "model": "string",
        "slug": "string",
        "display_name": "string",
        "device_count": 3
      },
      "name": "string"
    },
    {
      "id": 7,
      "device_type": {
        "id": 9,
        "url": "string",
        "manufacturer": {
          "id": 8,
          "url": "string",
          "name": "string",
          "slug": "string",
          "devicetype_count": 9
        },
        "model": "string",
        "slug": "string",
        "display_name": "string",
        "device_count": 8
      },
      "name": "string"
    }
  ]
}