{
  "id": 4,
  "device_type": {
    "id": 7,
    "url": "string",
    "manufacturer": {
      "id": 4,
      "url": "string",
      "name": "string",
      "slug": "string",
      "devicetype_count": 8
    },
    "model": "string",
    "slug": "string",
    "display_name": "string",
    "device_count": 2
  },
  "name": "string",
  "type": {
    "label": "NEMA L6-15P",
    "value": "ita-f"
  },
  "maximum_draw": 4,
  "allocated_draw": 8
}