{
  "id": 5,
  "name": "string",
  "rd": "string",
  "tenant": {
    "id": 8,
    "url": "string",
    "name": "string",
    "slug": "string"
  },
  "enforce_unique": false,
  "description": "string",
  "tags": [
    "string",
    "string"
  ],
  "display_name": "string",
  "custom_fields": {},
  "created": "string",
  "last_updated": "string",
  "ipaddress_count": 4,
  "prefix_count": 8
}