{
  "count": 4,
  "next": "string",
  "previous": "string",
  "results": [
    {
      "id": 9,
      "device": {
        "id": 1,
        "url": "string",
        "name": "string",
        "display_name": "string"
      },
      "name": "string",
      "type": {
        "label": "ST",
        "value": "st"
      },
      "positions": 4,
      "description": "string",
      "cable": {
        "id": 7,
        "url": "string",
        "label": "string"
      },
      "tags": [
        "string",
        "string",
        "string",
        "string",
        "string",
        "string",
        "string",
        "string",
        "string"
      ]
    },
    {
      "id": 9,
      "device": {
        "id": 5,
        "url": "string",
        "name": "string",
        "display_name": "string"
      },
      "name": "string",
      "type": {
        "label": "SC",
        "value": "fc"
      },
      "positions": 9,
      "description": "string",
      "cable": {
        "id": 10,
        "url": "string",
        "label": "string"
      },
      "tags": [
        "string",
        "string",
        "string",
        "string",
        "string",
        "string",
        "string",
        "string",
        "string",
        "string"
      ]
    },
    {
      "id": 9,
      "device": {
        "id": 10,
        "url": "string",
        "name": "string",
        "display_name": "string"
      },
      "name": "string",
      "type": {
        "label": "LSH/APC",
        "value": "sc-apc"
      },
      "positions": 1,
      "description": "string",
      "cable": {
        "id": 9,
        "url": "string",
        "label": "string"
      },
      "tags": [
        "string",
        "string",
        "string"
      ]
    },
    {
      "id": 4,
      "device": {
        "id": 10,
        "url": "string",
        "name": "string",
        "display_name": "string"
      },
      "name": "string",
      "type": {
        "label": "SC",
        "value": "mrj21"
      },
      "positions": 3,
      "description": "string",
      "cable": {
        "id": 4,
        "url": "string",
        "label": "string"
      },
      "tags": [
        "string",
        "string",
        "string",
        "string",
        "string",
        "string",
        "string"
      ]
    },
    {
      "id": 7,
      "device": {
        "id": 4,
        "url": "string",
        "name": "string",
        "display_name": "string"
      },
      "name": "string",
      "type": {
        "label": "SC/APC",
        "value": "sc"
      },
      "positions": 1,
      "description": "string",
      "cable": {
        "id": 3,
        "url": "string",
        "label": "string"
      },
      "tags": [
        "string",
        "string",
        "string",
        "string",
        "string",
        "string"
      ]
    },
    {
      "id": 4,
      "device": {
        "id": 5,
        "url": "string",
        "name": "string",
        "display_name": "string"
      },
      "name": "string",
      "type": {
        "label": "8P8C",
        "value": "lc-apc"
      },
      "positions": 6,
      "description": "string",
      "cable": {
        "id": 3,
        "url": "string",
        "label": "string"
      },
      "tags": [
        "string",
        "string"
      ]
    },
    {
      "id": 6,
      "device": {
        "id": 1,
        "url": "string",
        "name": "string",
        "display_name": "string"
      },
      "name": "string",
      "type": {
        "label": "110 Punch",
        "value": "110-punch"
      },
      "positions": 9,
      "description": "string",
      "cable": {
        "id": 7,
        "url": "string",
        "label": "string"
      },
      "tags": [
        "string"
      ]
    },
    {
      "id": 2,
      "device": {
        "id": 6,
        "url": "string",
        "name": "string",
        "display_name": "string"
      },
      "name": "string",
      "type": {
        "label": "LSH/APC",
        "value": "lsh-apc"
      },
      "positions": 2,
      "description": "string",
      "cable": {
        "id": 4,
        "url": "string",
        "label": "string"
      },
      "tags": [
        "string",
        "string",
        "string",
        "string",
        "string",
        "string",
        "string",
        "string"
      ]
    }
  ]
}