{
  "id": 8,
  "circuit": {
    "id": 9,
    "url": "string",
    "cid": "string"
  },
  "term_side": "A",
  "site": {
    "id": 7,
    "url": "string",
    "name": "string",
    "slug": "string"
  },
  "port_speed": 2,
  "upstream_speed": 2,
  "xconnect_id": "string",
  "pp_info": "string",
  "description": "string",
  "connected_endpoint_type": "string",
  "connected_endpoint": {},
  "connection_status": {
    "label": "Connected",
    "value": false
  },
  "cable": {
    "id": 6,
    "url": "string",
    "label": "string"
  }
}