{
  "id": 8,
  "device": {
    "id": 4,
    "url": "string",
    "name": "string",
    "display_name": "string"
  },
  "virtual_machine": {
    "id": 6,
    "url": "string",
    "name": "string"
  },
  "name": "string",
  "port": 9,
  "protocol": {
    "label": "TCP",
    "value": "tcp"
  },
  "ipaddresses": [
    {
      "id": 3,
      "url": "string",
      "family": "string",
      "address": "string"
    },
    {
      "id": 1,
      "url": "string",
      "family": "string",
      "address": "string"
    },
    {
      "id": 2,
      "url": "string",
      "family": "string",
      "address": "string"
    },
    {
      "id": 7,
      "url": "string",
      "family": "string",
      "address": "string"
    },
    {
      "id": 9,
      "url": "string",
      "family": "string",
      "address": "string"
    },
    {
      "id": 10,
      "url": "string",
      "family": "string",
      "address": "string"
    },
    {
      "id": 8,
      "url": "string",
      "family": "string",
      "address": "string"
    },
    {
      "id": 2,
      "url": "string",
      "family": "string",
      "address": "string"
    },
    {
      "id": 3,
      "url": "string",
      "family": "string",
      "address": "string"
    }
  ],
  "description": "string",
  "tags": [
    "string",
    "string",
    "string",
    "string",
    "string"
  ],
  "custom_fields": {},
  "created": "string",
  "last_updated": "string"
}