{
  "id": 4,
  "name": "string",
  "slug": "string",
  "parent": {
    "id": 2,
    "url": "string",
    "name": "string",
    "slug": "string",
    "site_count": 7
  },
  "description": "string",
  "site_count": 10
}