{
  "id": 9,
  "virtual_machine": {
    "id": 1,
    "url": "string",
    "name": "string"
  },
  "name": "string",
  "type": {
    "label": "Virtual",
    "value": "virtual"
  },
  "enabled": true,
  "mtu": 2,
  "mac_address": "string",
  "description": "string",
  "mode": {
    "label": "Access",
    "value": "access"
  },
  "untagged_vlan": {
    "id": 4,
    "url": "string",
    "vid": 10,
    "name": "string",
    "display_name": "string"
  },
  "tagged_vlans": [
    {
      "id": 6,
      "url": "string",
      "vid": 7,
      "name": "string",
      "display_name": "string"
    },
    {
      "id": 3,
      "url": "string",
      "vid": 10,
      "name": "string",
      "display_name": "string"
    },
    {
      "id": 10,
      "url": "string",
      "vid": 2,
      "name": "string",
      "display_name": "string"
    },
    {
      "id": 5,
      "url": "string",
      "vid": 2,
      "name": "string",
      "display_name": "string"
    }
  ],
  "tags": [
    "string",
    "string",
    "string",
    "string",
    "string",
    "string",
    "string",
    "string"
  ]
}