{
  "id": "string",
  "url": "string",
  "name": "string",
  "device_type": {
    "id": "string",
    "url": "string",
    "manufacturer": {
      "id": "string",
      "url": "string",
      "name": "string",
      "slug": "string",
      "devicetype_count": 7,
      "display": "string"
    },
    "model": "string",
    "slug": "string",
    "device_count": 10,
    "display": "string"
  },
  "device_role": {
    "id": "string",
    "url": "string",
    "name": "string",
    "slug": "string",
    "device_count": 5,
    "virtualmachine_count": 1,
    "display": "string"
  },
  "tenant": {
    "id": "string",
    "url": "string",
    "name": "string",
    "slug": "string",
    "display": "string"
  },
  "platform": {
    "id": "string",
    "url": "string",
    "name": "string",
    "slug": "string",
    "device_count": 9,
    "virtualmachine_count": 1,
    "display": "string"
  },
  "serial": "string",
  "asset_tag": "string",
  "site": {
    "id": "string",
    "url": "string",
    "name": "string",
    "slug": "string",
    "display": "string"
  },
  "rack": {
    "id": "string",
    "url": "string",
    "name": "string",
    "device_count": 5,
    "display": "string"
  },
  "position": 9,
  "face": {
    "label": "Rear",
    "value": "front"
  },
  "parent_device": {
    "id": "string",
    "url": "string",
    "name": "string",
    "display": "string"
  },
  "status": "staged",
  "primary_ip": {
    "id": "string",
    "url": "string",
    "family": 6,
    "address": "string",
    "display": "string"
  },
  "primary_ip4": {
    "id": "string",
    "url": "string",
    "family": 3,
    "address": "string",
    "display": "string"
  },
  "primary_ip6": {
    "id": "string",
    "url": "string",
    "family": 10,
    "address": "string",
    "display": "string"
  },
  "cluster": {
    "id": "string",
    "url": "string",
    "name": "string",
    "virtualmachine_count": 1,
    "display": "string"
  },
  "virtual_chassis": {
    "id": "string",
    "name": "string",
    "url": "string",
    "master": {
      "id": "string",
      "url": "string",
      "name": "string",
      "display": "string"
    },
    "member_count": 10,
    "display": "string"
  },
  "vc_position": 4,
  "vc_priority": 6,
  "comments": "string",
  "local_context_schema": {
    "id": "string",
    "url": "string",
    "name": "string",
    "slug": "string",
    "display": "string"
  },
  "local_context_data": "string",
  "tags": [
    {
      "id": "string",
      "url": "string",
      "name": "string",
      "slug": "string",
      "color": "string",
      "display": "string"
    },
    {
      "id": "string",
      "url": "string",
      "name": "string",
      "slug": "string",
      "color": "string",
      "display": "string"
    },
    {
      "id": "string",
      "url": "string",
      "name": "string",
      "slug": "string",
      "color": "string",
      "display": "string"
    }
  ],
  "custom_fields": {
    "bgp_ecmp_maximum_paths": null
  },
  "config_context": {},
  "created": "string",
  "last_updated": "string",
  "display": "string"
}