{
  "id": "string",
  "url": "string",
  "site": {
    "id": "string",
    "url": "string",
    "name": "string",
    "slug": "string",
    "display": "string"
  },
  "rack_group": {
    "id": "string",
    "url": "string",
    "name": "string",
    "slug": "string",
    "rack_count": 9,
    "_depth": 9,
    "display": "string"
  },
  "name": "string",
  "tags": [
    {
      "id": "string",
      "url": "string",
      "name": "string",
      "slug": "string",
      "color": "string",
      "display": "string"
    },
    {
      "id": "string",
      "url": "string",
      "name": "string",
      "slug": "string",
      "color": "string",
      "display": "string"
    },
    {
      "id": "string",
      "url": "string",
      "name": "string",
      "slug": "string",
      "color": "string",
      "display": "string"
    }
  ],
  "custom_fields": {},
  "powerfeed_count": 3,
  "display": "string"
}