{
  "id": "string",
  "url": "string",
  "device_type": {
    "id": "string",
    "url": "string",
    "manufacturer": {
      "id": "string",
      "url": "string",
      "name": "string",
      "slug": "string",
      "devicetype_count": 6,
      "display": "string"
    },
    "model": "string",
    "slug": "string",
    "device_count": 1,
    "display": "string"
  },
  "name": "string",
  "label": "string",
  "type": {
    "label": "DE-9",
    "value": "usb-b"
  },
  "description": "string",
  "custom_fields": {},
  "display": "string"
}