{
  "id": "string",
  "url": "string",
  "username": "string",
  "password": "string",
  "first_name": "string",
  "last_name": "string",
  "email": "string",
  "is_staff": true,
  "is_active": false,
  "date_joined": "string",
  "groups": [
    4,
    7,
    3,
    9,
    4
  ],
  "display": "string"
}