[
  {
    "family": 4,
    "prefix": "string",
    "vrf": {
      "id": "string",
      "url": "string",
      "name": "string",
      "rd": "string",
      "display": "string",
      "prefix_count": 6
    }
  }
]