{
  "id": "string",
  "url": "string",
  "name": "string",
  "role": "string",
  "description": "string",
  "enabled": true,
  "vrf": "string",
  "update_source_content_type": "string",
  "update_source_object_id": "string",
  "update_source": {},
  "router_id": "string",
  "autonomous_system": "string",
  "maximum_paths_ibgp": 3,
  "maximum_paths_ebgp": 9,
  "maximum_paths_eibgp": 6,
  "maximum_prefix": 4,
  "bfd_multiplier": 2,
  "bfd_minimum_interval": 9,
  "bfd_fast_detection": true,
  "enforce_first_as": true,
  "send_community_ebgp": false,
  "display": "string"
}