{
  "count": 1,
  "next": "string",
  "previous": "string",
  "results": [
    {
      "id": "string",
      "url": "string",
      "content_types": [
        "string",
        "string"
      ],
      "name": "string",
      "type_create": false,
      "type_update": false,
      "type_delete": true,
      "payload_url": "string",
      "http_method": "GET",
      "http_content_type": "string",
      "additional_headers": "string",
      "body_template": "string",
      "secret": "string",
      "ssl_verification": true,
      "ca_file_path": "string",
      "display": "string"
    }
  ]
}