{
  "count": 8,
  "next": "string",
  "previous": "string",
  "results": [
    {
      "id": "string",
      "relationship": {
        "id": "string",
        "url": "string",
        "name": "string",
        "slug": "string",
        "display": "string"
      },
      "source_type": "string",
      "source_id": "string",
      "destination_type": "string",
      "destination_id": "string"
    },
    {
      "id": "string",
      "relationship": {
        "id": "string",
        "url": "string",
        "name": "string",
        "slug": "string",
        "display": "string"
      },
      "source_type": "string",
      "source_id": "string",
      "destination_type": "string",
      "destination_id": "string"
    },
    {
      "id": "string",
      "relationship": {
        "id": "string",
        "url": "string",
        "name": "string",
        "slug": "string",
        "display": "string"
      },
      "source_type": "string",
      "source_id": "string",
      "destination_type": "string",
      "destination_id": "string"
    },
    {
      "id": "string",
      "relationship": {
        "id": "string",
        "url": "string",
        "name": "string",
        "slug": "string",
        "display": "string"
      },
      "source_type": "string",
      "source_id": "string",
      "destination_type": "string",
      "destination_id": "string"
    },
    {
      "id": "string",
      "relationship": {
        "id": "string",
        "url": "string",
        "name": "string",
        "slug": "string",
        "display": "string"
      },
      "source_type": "string",
      "source_id": "string",
      "destination_type": "string",
      "destination_id": "string"
    },
    {
      "id": "string",
      "relationship": {
        "id": "string",
        "url": "string",
        "name": "string",
        "slug": "string",
        "display": "string"
      },
      "source_type": "string",
      "source_id": "string",
      "destination_type": "string",
      "destination_id": "string"
    },
    {
      "id": "string",
      "relationship": {
        "id": "string",
        "url": "string",
        "name": "string",
        "slug": "string",
        "display": "string"
      },
      "source_type": "string",
      "source_id": "string",
      "destination_type": "string",
      "destination_id": "string"
    },
    {
      "id": "string",
      "relationship": {
        "id": "string",
        "url": "string",
        "name": "string",
        "slug": "string",
        "display": "string"
      },
      "source_type": "string",
      "source_id": "string",
      "destination_type": "string",
      "destination_id": "string"
    },
    {
      "id": "string",
      "relationship": {
        "id": "string",
        "url": "string",
        "name": "string",
        "slug": "string",
        "display": "string"
      },
      "source_type": "string",
      "source_id": "string",
      "destination_type": "string",
      "destination_id": "string"
    },
    {
      "id": "string",
      "relationship": {
        "id": "string",
        "url": "string",
        "name": "string",
        "slug": "string",
        "display": "string"
      },
      "source_type": "string",
      "source_id": "string",
      "destination_type": "string",
      "destination_id": "string"
    }
  ]
}