{
  "id": "string",
  "url": "string",
  "name": "string",
  "slug": "string",
  "description": "string",
  "cluster_count": 9,
  "custom_fields": {},
  "created": "string",
  "last_updated": "string",
  "display": "string"
}