{
  "count": 8,
  "next": "string",
  "previous": "string",
  "results": [
    {
      "id": "string",
      "tags": [
        {
          "id": "string",
          "url": "string",
          "name": "string",
          "slug": "string",
          "color": "string",
          "display": "string"
        },
        {
          "id": "string",
          "url": "string",
          "name": "string",
          "slug": "string",
          "color": "string",
          "display": "string"
        },
        {
          "id": "string",
          "url": "string",
          "name": "string",
          "slug": "string",
          "color": "string",
          "display": "string"
        },
        {
          "id": "string",
          "url": "string",
          "name": "string",
          "slug": "string",
          "color": "string",
          "display": "string"
        },
        {
          "id": "string",
          "url": "string",
          "name": "string",
          "slug": "string",
          "color": "string",
          "display": "string"
        },
        {
          "id": "string",
          "url": "string",
          "name": "string",
          "slug": "string",
          "color": "string",
          "display": "string"
        },
        {
          "id": "string",
          "url": "string",
          "name": "string",
          "slug": "string",
          "color": "string",
          "display": "string"
        },
        {
          "id": "string",
          "url": "string",
          "name": "string",
          "slug": "string",
          "color": "string",
          "display": "string"
        }
      ],
      "display": "string",
      "computed_fields": "string",
      "custom_fields": {},
      "url": "string",
      "created": "string",
      "last_updated": "string",
      "_custom_field_data": "string",
      "backup_config": "string",
      "backup_last_attempt_date": "string",
      "backup_last_success_date": "string",
      "intended_config": "string",
      "intended_last_attempt_date": "string",
      "intended_last_success_date": "string",
      "compliance_config": "string",
      "compliance_last_attempt_date": "string",
      "compliance_last_success_date": "string",
      "device": "string"
    },
    {
      "id": "string",
      "tags": [
        {
          "id": "string",
          "url": "string",
          "name": "string",
          "slug": "string",
          "color": "string",
          "display": "string"
        },
        {
          "id": "string",
          "url": "string",
          "name": "string",
          "slug": "string",
          "color": "string",
          "display": "string"
        },
        {
          "id": "string",
          "url": "string",
          "name": "string",
          "slug": "string",
          "color": "string",
          "display": "string"
        },
        {
          "id": "string",
          "url": "string",
          "name": "string",
          "slug": "string",
          "color": "string",
          "display": "string"
        },
        {
          "id": "string",
          "url": "string",
          "name": "string",
          "slug": "string",
          "color": "string",
          "display": "string"
        },
        {
          "id": "string",
          "url": "string",
          "name": "string",
          "slug": "string",
          "color": "string",
          "display": "string"
        },
        {
          "id": "string",
          "url": "string",
          "name": "string",
          "slug": "string",
          "color": "string",
          "display": "string"
        },
        {
          "id": "string",
          "url": "string",
          "name": "string",
          "slug": "string",
          "color": "string",
          "display": "string"
        },
        {
          "id": "string",
          "url": "string",
          "name": "string",
          "slug": "string",
          "color": "string",
          "display": "string"
        },
        {
          "id": "string",
          "url": "string",
          "name": "string",
          "slug": "string",
          "color": "string",
          "display": "string"
        }
      ],
      "display": "string",
      "computed_fields": "string",
      "custom_fields": {},
      "url": "string",
      "created": "string",
      "last_updated": "string",
      "_custom_field_data": "string",
      "backup_config": "string",
      "backup_last_attempt_date": "string",
      "backup_last_success_date": "string",
      "intended_config": "string",
      "intended_last_attempt_date": "string",
      "intended_last_success_date": "string",
      "compliance_config": "string",
      "compliance_last_attempt_date": "string",
      "compliance_last_success_date": "string",
      "device": "string"
    },
    {
      "id": "string",
      "tags": [
        {
          "id": "string",
          "url": "string",
          "name": "string",
          "slug": "string",
          "color": "string",
          "display": "string"
        },
        {
          "id": "string",
          "url": "string",
          "name": "string",
          "slug": "string",
          "color": "string",
          "display": "string"
        },
        {
          "id": "string",
          "url": "string",
          "name": "string",
          "slug": "string",
          "color": "string",
          "display": "string"
        },
        {
          "id": "string",
          "url": "string",
          "name": "string",
          "slug": "string",
          "color": "string",
          "display": "string"
        },
        {
          "id": "string",
          "url": "string",
          "name": "string",
          "slug": "string",
          "color": "string",
          "display": "string"
        },
        {
          "id": "string",
          "url": "string",
          "name": "string",
          "slug": "string",
          "color": "string",
          "display": "string"
        },
        {
          "id": "string",
          "url": "string",
          "name": "string",
          "slug": "string",
          "color": "string",
          "display": "string"
        }
      ],
      "display": "string",
      "computed_fields": "string",
      "custom_fields": {},
      "url": "string",
      "created": "string",
      "last_updated": "string",
      "_custom_field_data": "string",
      "backup_config": "string",
      "backup_last_attempt_date": "string",
      "backup_last_success_date": "string",
      "intended_config": "string",
      "intended_last_attempt_date": "string",
      "intended_last_success_date": "string",
      "compliance_config": "string",
      "compliance_last_attempt_date": "string",
      "compliance_last_success_date": "string",
      "device": "string"
    },
    {
      "id": "string",
      "tags": [
        {
          "id": "string",
          "url": "string",
          "name": "string",
          "slug": "string",
          "color": "string",
          "display": "string"
        },
        {
          "id": "string",
          "url": "string",
          "name": "string",
          "slug": "string",
          "color": "string",
          "display": "string"
        },
        {
          "id": "string",
          "url": "string",
          "name": "string",
          "slug": "string",
          "color": "string",
          "display": "string"
        },
        {
          "id": "string",
          "url": "string",
          "name": "string",
          "slug": "string",
          "color": "string",
          "display": "string"
        },
        {
          "id": "string",
          "url": "string",
          "name": "string",
          "slug": "string",
          "color": "string",
          "display": "string"
        }
      ],
      "display": "string",
      "computed_fields": "string",
      "custom_fields": {},
      "url": "string",
      "created": "string",
      "last_updated": "string",
      "_custom_field_data": "string",
      "backup_config": "string",
      "backup_last_attempt_date": "string",
      "backup_last_success_date": "string",
      "intended_config": "string",
      "intended_last_attempt_date": "string",
      "intended_last_success_date": "string",
      "compliance_config": "string",
      "compliance_last_attempt_date": "string",
      "compliance_last_success_date": "string",
      "device": "string"
    }
  ]
}