{
  "id": "string",
  "url": "string",
  "name": "string",
  "slug": "string",
  "weight": 10,
  "description": "string",
  "prefix_count": 5,
  "vlan_count": 1,
  "custom_fields": {},
  "created": "string",
  "last_updated": "string",
  "display": "string"
}