{
  "id": "string",
  "url": "string",
  "created": "string",
  "completed": "string",
  "name": "string",
  "obj_type": "string",
  "status": {
    "label": "Pending",
    "value": "pending"
  },
  "user": {
    "id": "string",
    "url": "string",
    "username": "string",
    "display": "string"
  },
  "data": "string",
  "job_id": "string"
}