{
  "id": "string",
  "tags": [
    {
      "id": "string",
      "url": "string",
      "name": "string",
      "slug": "string",
      "color": "string",
      "display": "string"
    },
    {
      "id": "string",
      "url": "string",
      "name": "string",
      "slug": "string",
      "color": "string",
      "display": "string"
    },
    {
      "id": "string",
      "url": "string",
      "name": "string",
      "slug": "string",
      "color": "string",
      "display": "string"
    },
    {
      "id": "string",
      "url": "string",
      "name": "string",
      "slug": "string",
      "color": "string",
      "display": "string"
    },
    {
      "id": "string",
      "url": "string",
      "name": "string",
      "slug": "string",
      "color": "string",
      "display": "string"
    },
    {
      "id": "string",
      "url": "string",
      "name": "string",
      "slug": "string",
      "color": "string",
      "display": "string"
    },
    {
      "id": "string",
      "url": "string",
      "name": "string",
      "slug": "string",
      "color": "string",
      "display": "string"
    },
    {
      "id": "string",
      "url": "string",
      "name": "string",
      "slug": "string",
      "color": "string",
      "display": "string"
    },
    {
      "id": "string",
      "url": "string",
      "name": "string",
      "slug": "string",
      "color": "string",
      "display": "string"
    },
    {
      "id": "string",
      "url": "string",
      "name": "string",
      "slug": "string",
      "color": "string",
      "display": "string"
    }
  ],
  "display": "string",
  "computed_fields": "string",
  "custom_fields": {},
  "url": "string",
  "created": "string",
  "last_updated": "string",
  "_custom_field_data": "string",
  "compliance": false,
  "actual": "string",
  "intended": "string",
  "missing": "string",
  "extra": "string",
  "ordered": false,
  "compliance_int": 1,
  "device": "string",
  "rule": "string"
}