{
  "id": "string",
  "url": "string",
  "device": {
    "id": "string",
    "url": "string",
    "name": "string",
    "display": "string"
  },
  "name": "string",
  "label": "string",
  "type": {
    "label": "BNC",
    "value": "lc-apc"
  },
  "positions": 9,
  "description": "string",
  "cable": {
    "id": "string",
    "url": "string",
    "label": "string",
    "display": "string"
  },
  "cable_peer": {},
  "cable_peer_type": "string",
  "tags": [
    {
      "id": "string",
      "url": "string",
      "name": "string",
      "slug": "string",
      "color": "string",
      "display": "string"
    },
    {
      "id": "string",
      "url": "string",
      "name": "string",
      "slug": "string",
      "color": "string",
      "display": "string"
    }
  ],
  "custom_fields": {},
  "display": "string"
}