{
  "id": "string",
  "url": "string",
  "site": {
    "id": "string",
    "url": "string",
    "name": "string",
    "slug": "string",
    "display": "string"
  },
  "group": {
    "id": "string",
    "url": "string",
    "name": "string",
    "slug": "string",
    "vlan_count": 10,
    "display": "string"
  },
  "vid": 1,
  "name": "string",
  "tenant": {
    "id": "string",
    "url": "string",
    "name": "string",
    "slug": "string",
    "display": "string"
  },
  "status": "active",
  "role": {
    "id": "string",
    "url": "string",
    "name": "string",
    "slug": "string",
    "prefix_count": 10,
    "vlan_count": 8,
    "display": "string"
  },
  "description": "string",
  "tags": [
    {
      "id": "string",
      "url": "string",
      "name": "string",
      "slug": "string",
      "color": "string",
      "display": "string"
    }
  ],
  "custom_fields": {},
  "created": "string",
  "last_updated": "string",
  "prefix_count": 7,
  "display": "string"
}