{
  "id": "string",
  "url": "string",
  "afi_safi": "vpnv4",
  "peer_group": "string",
  "peer_endpoint": "string",
  "export_policy": "string",
  "import_policy": "string",
  "redistribute_static_policy": "string",
  "maximum_prefix": 8,
  "multipath": false,
  "display": "string"
}