{
  "id": "string",
  "url": "string",
  "slug": "string",
  "label": "string",
  "description": "string",
  "content_type": "string",
  "template": "string",
  "fallback_value": "string",
  "weight": 5,
  "display": "string"
}