{
  "id": "string",
  "url": "string",
  "content_type": "string",
  "object_id": "string",
  "parent": {},
  "name": "string",
  "image": "string",
  "image_height": 3,
  "image_width": 1,
  "created": "string",
  "display": "string"
}