{
  "id": "string",
  "url": "string",
  "asn": 2,
  "description": "string",
  "status": "failed",
  "tags": [
    {
      "id": "string",
      "url": "string",
      "name": "string",
      "slug": "string",
      "color": "string",
      "display": "string"
    },
    {
      "id": "string",
      "url": "string",
      "name": "string",
      "slug": "string",
      "color": "string",
      "display": "string"
    },
    {
      "id": "string",
      "url": "string",
      "name": "string",
      "slug": "string",
      "color": "string",
      "display": "string"
    },
    {
      "id": "string",
      "url": "string",
      "name": "string",
      "slug": "string",
      "color": "string",
      "display": "string"
    }
  ],
  "display": "string"
}