{
  "id": "string",
  "url": "string",
  "name": "string",
  "status": "staged",
  "site": {
    "id": "string",
    "url": "string",
    "name": "string",
    "slug": "string",
    "display": "string"
  },
  "cluster": {
    "id": "string",
    "url": "string",
    "name": "string",
    "virtualmachine_count": 9,
    "display": "string"
  },
  "role": {
    "id": "string",
    "url": "string",
    "name": "string",
    "slug": "string",
    "device_count": 3,
    "virtualmachine_count": 6,
    "display": "string"
  },
  "tenant": {
    "id": "string",
    "url": "string",
    "name": "string",
    "slug": "string",
    "display": "string"
  },
  "platform": {
    "id": "string",
    "url": "string",
    "name": "string",
    "slug": "string",
    "device_count": 8,
    "virtualmachine_count": 6,
    "display": "string"
  },
  "primary_ip": {
    "id": "string",
    "url": "string",
    "family": 6,
    "address": "string",
    "display": "string"
  },
  "primary_ip4": {
    "id": "string",
    "url": "string",
    "family": 6,
    "address": "string",
    "display": "string"
  },
  "primary_ip6": {
    "id": "string",
    "url": "string",
    "family": 1,
    "address": "string",
    "display": "string"
  },
  "vcpus": 4,
  "memory": 8,
  "disk": 6,
  "comments": "string",
  "local_context_data": "string",
  "local_context_schema": {
    "id": "string",
    "url": "string",
    "name": "string",
    "slug": "string",
    "display": "string"
  },
  "tags": [
    {
      "id": "string",
      "url": "string",
      "name": "string",
      "slug": "string",
      "color": "string",
      "display": "string"
    }
  ],
  "custom_fields": {},
  "config_context": {},
  "created": "string",
  "last_updated": "string",
  "display": "string"
}