{
  "id": "string",
  "url": "string",
  "family": {
    "label": "IPv4",
    "value": 6
  },
  "address": "string",
  "vrf": {
    "id": "string",
    "url": "string",
    "name": "string",
    "rd": "string",
    "display": "string",
    "prefix_count": 10
  },
  "tenant": {
    "id": "string",
    "url": "string",
    "name": "string",
    "slug": "string",
    "display": "string"
  },
  "status": "dhcp",
  "role": {
    "label": "HSRP",
    "value": "glbp"
  },
  "assigned_object_type": "string",
  "assigned_object_id": "string",
  "assigned_object": {},
  "nat_inside": {
    "id": "string",
    "url": "string",
    "family": 1,
    "address": "string",
    "display": "string"
  },
  "nat_outside": {
    "id": "string",
    "url": "string",
    "family": 2,
    "address": "string",
    "display": "string"
  },
  "dns_name": "string",
  "description": "string",
  "tags": [
    {
      "id": "string",
      "url": "string",
      "name": "string",
      "slug": "string",
      "color": "string",
      "display": "string"
    },
    {
      "id": "string",
      "url": "string",
      "name": "string",
      "slug": "string",
      "color": "string",
      "display": "string"
    },
    {
      "id": "string",
      "url": "string",
      "name": "string",
      "slug": "string",
      "color": "string",
      "display": "string"
    },
    {
      "id": "string",
      "url": "string",
      "name": "string",
      "slug": "string",
      "color": "string",
      "display": "string"
    },
    {
      "id": "string",
      "url": "string",
      "name": "string",
      "slug": "string",
      "color": "string",
      "display": "string"
    },
    {
      "id": "string",
      "url": "string",
      "name": "string",
      "slug": "string",
      "color": "string",
      "display": "string"
    }
  ],
  "custom_fields": {},
  "created": "string",
  "last_updated": "string",
  "display": "string"
}