{
  "id": "string",
  "url": "string",
  "device_type": {
    "id": "string",
    "url": "string",
    "manufacturer": {
      "id": "string",
      "url": "string",
      "name": "string",
      "slug": "string",
      "devicetype_count": 2,
      "display": "string"
    },
    "model": "string",
    "slug": "string",
    "device_count": 3,
    "display": "string"
  },
  "name": "string",
  "label": "string",
  "type": {
    "label": "USB Mini B",
    "value": "rj-45"
  },
  "description": "string",
  "custom_fields": {},
  "display": "string"
}