{
  "id": "string",
  "url": "string",
  "name": "string",
  "type": {
    "id": "string",
    "url": "string",
    "name": "string",
    "slug": "string",
    "cluster_count": 1,
    "display": "string"
  },
  "group": {
    "id": "string",
    "url": "string",
    "name": "string",
    "slug": "string",
    "cluster_count": 2,
    "display": "string"
  },
  "tenant": {
    "id": "string",
    "url": "string",
    "name": "string",
    "slug": "string",
    "display": "string"
  },
  "site": {
    "id": "string",
    "url": "string",
    "name": "string",
    "slug": "string",
    "display": "string"
  },
  "comments": "string",
  "tags": [
    {
      "id": "string",
      "url": "string",
      "name": "string",
      "slug": "string",
      "color": "string",
      "display": "string"
    },
    {
      "id": "string",
      "url": "string",
      "name": "string",
      "slug": "string",
      "color": "string",
      "display": "string"
    },
    {
      "id": "string",
      "url": "string",
      "name": "string",
      "slug": "string",
      "color": "string",
      "display": "string"
    },
    {
      "id": "string",
      "url": "string",
      "name": "string",
      "slug": "string",
      "color": "string",
      "display": "string"
    }
  ],
  "custom_fields": {},
  "created": "string",
  "last_updated": "string",
  "device_count": 5,
  "virtualmachine_count": 6,
  "display": "string"
}