{
  "id": "string",
  "url": "string",
  "device": {
    "id": "string",
    "url": "string",
    "name": "string",
    "display": "string"
  },
  "name": "string",
  "label": "string",
  "type": {
    "label": "ITA Type F (CEE7/3)",
    "value": "iec-60320-c13"
  },
  "power_port": {
    "id": "string",
    "url": "string",
    "device": {
      "id": "string",
      "url": "string",
      "name": "string",
      "display": "string"
    },
    "name": "string",
    "cable": "string",
    "display": "string"
  },
  "feed_leg": {
    "label": "C",
    "value": "A"
  },
  "description": "string",
  "cable": {
    "id": "string",
    "url": "string",
    "label": "string",
    "display": "string"
  },
  "cable_peer": {},
  "cable_peer_type": "string",
  "connected_endpoint": {},
  "connected_endpoint_type": "string",
  "connected_endpoint_reachable": false,
  "tags": [
    {
      "id": "string",
      "url": "string",
      "name": "string",
      "slug": "string",
      "color": "string",
      "display": "string"
    },
    {
      "id": "string",
      "url": "string",
      "name": "string",
      "slug": "string",
      "color": "string",
      "display": "string"
    },
    {
      "id": "string",
      "url": "string",
      "name": "string",
      "slug": "string",
      "color": "string",
      "display": "string"
    },
    {
      "id": "string",
      "url": "string",
      "name": "string",
      "slug": "string",
      "color": "string",
      "display": "string"
    },
    {
      "id": "string",
      "url": "string",
      "name": "string",
      "slug": "string",
      "color": "string",
      "display": "string"
    }
  ],
  "custom_fields": {},
  "display": "string"
}