{
  "count": 7,
  "next": "string",
  "previous": "string",
  "results": [
    {
      "id": "string",
      "url": "string",
      "name": "string",
      "slug": "string",
      "manufacturer": {
        "id": "string",
        "url": "string",
        "name": "string",
        "slug": "string",
        "devicetype_count": 7,
        "display": "string"
      },
      "napalm_driver": "string",
      "napalm_args": "string",
      "description": "string",
      "device_count": 8,
      "virtualmachine_count": 4,
      "custom_fields": {},
      "created": "string",
      "last_updated": "string",
      "display": "string"
    },
    {
      "id": "string",
      "url": "string",
      "name": "string",
      "slug": "string",
      "manufacturer": {
        "id": "string",
        "url": "string",
        "name": "string",
        "slug": "string",
        "devicetype_count": 9,
        "display": "string"
      },
      "napalm_driver": "string",
      "napalm_args": "string",
      "description": "string",
      "device_count": 7,
      "virtualmachine_count": 7,
      "custom_fields": {},
      "created": "string",
      "last_updated": "string",
      "display": "string"
    },
    {
      "id": "string",
      "url": "string",
      "name": "string",
      "slug": "string",
      "manufacturer": {
        "id": "string",
        "url": "string",
        "name": "string",
        "slug": "string",
        "devicetype_count": 10,
        "display": "string"
      },
      "napalm_driver": "string",
      "napalm_args": "string",
      "description": "string",
      "device_count": 6,
      "virtualmachine_count": 6,
      "custom_fields": {},
      "created": "string",
      "last_updated": "string",
      "display": "string"
    },
    {
      "id": "string",
      "url": "string",
      "name": "string",
      "slug": "string",
      "manufacturer": {
        "id": "string",
        "url": "string",
        "name": "string",
        "slug": "string",
        "devicetype_count": 6,
        "display": "string"
      },
      "napalm_driver": "string",
      "napalm_args": "string",
      "description": "string",
      "device_count": 10,
      "virtualmachine_count": 2,
      "custom_fields": {},
      "created": "string",
      "last_updated": "string",
      "display": "string"
    },
    {
      "id": "string",
      "url": "string",
      "name": "string",
      "slug": "string",
      "manufacturer": {
        "id": "string",
        "url": "string",
        "name": "string",
        "slug": "string",
        "devicetype_count": 4,
        "display": "string"
      },
      "napalm_driver": "string",
      "napalm_args": "string",
      "description": "string",
      "device_count": 7,
      "virtualmachine_count": 8,
      "custom_fields": {},
      "created": "string",
      "last_updated": "string",
      "display": "string"
    },
    {
      "id": "string",
      "url": "string",
      "name": "string",
      "slug": "string",
      "manufacturer": {
        "id": "string",
        "url": "string",
        "name": "string",
        "slug": "string",
        "devicetype_count": 6,
        "display": "string"
      },
      "napalm_driver": "string",
      "napalm_args": "string",
      "description": "string",
      "device_count": 6,
      "virtualmachine_count": 3,
      "custom_fields": {},
      "created": "string",
      "last_updated": "string",
      "display": "string"
    },
    {
      "id": "string",
      "url": "string",
      "name": "string",
      "slug": "string",
      "manufacturer": {
        "id": "string",
        "url": "string",
        "name": "string",
        "slug": "string",
        "devicetype_count": 1,
        "display": "string"
      },
      "napalm_driver": "string",
      "napalm_args": "string",
      "description": "string",
      "device_count": 6,
      "virtualmachine_count": 10,
      "custom_fields": {},
      "created": "string",
      "last_updated": "string",
      "display": "string"
    },
    {
      "id": "string",
      "url": "string",
      "name": "string",
      "slug": "string",
      "manufacturer": {
        "id": "string",
        "url": "string",
        "name": "string",
        "slug": "string",
        "devicetype_count": 3,
        "display": "string"
      },
      "napalm_driver": "string",
      "napalm_args": "string",
      "description": "string",
      "device_count": 7,
      "virtualmachine_count": 10,
      "custom_fields": {},
      "created": "string",
      "last_updated": "string",
      "display": "string"
    },
    {
      "id": "string",
      "url": "string",
      "name": "string",
      "slug": "string",
      "manufacturer": {
        "id": "string",
        "url": "string",
        "name": "string",
        "slug": "string",
        "devicetype_count": 9,
        "display": "string"
      },
      "napalm_driver": "string",
      "napalm_args": "string",
      "description": "string",
      "device_count": 10,
      "virtualmachine_count": 4,
      "custom_fields": {},
      "created": "string",
      "last_updated": "string",
      "display": "string"
    },
    {
      "id": "string",
      "url": "string",
      "name": "string",
      "slug": "string",
      "manufacturer": {
        "id": "string",
        "url": "string",
        "name": "string",
        "slug": "string",
        "devicetype_count": 6,
        "display": "string"
      },
      "napalm_driver": "string",
      "napalm_args": "string",
      "description": "string",
      "device_count": 9,
      "virtualmachine_count": 5,
      "custom_fields": {},
      "created": "string",
      "last_updated": "string",
      "display": "string"
    }
  ]
}