{
  "id": "string",
  "url": "string",
  "name": "string",
  "slug": "string",
  "parent": {
    "id": "string",
    "url": "string",
    "name": "string",
    "slug": "string",
    "site_count": 4,
    "_depth": 7,
    "display": "string"
  },
  "description": "string",
  "site_count": 1,
  "_depth": 2,
  "custom_fields": {},
  "created": "string",
  "last_updated": "string",
  "display": "string"
}