{
  "id": "string",
  "url": "string",
  "name": "string",
  "slug": "string",
  "asn": 1,
  "account": "string",
  "portal_url": "string",
  "noc_contact": "string",
  "admin_contact": "string",
  "comments": "string",
  "tags": [
    {
      "id": "string",
      "url": "string",
      "name": "string",
      "slug": "string",
      "color": "string",
      "display": "string"
    },
    {
      "id": "string",
      "url": "string",
      "name": "string",
      "slug": "string",
      "color": "string",
      "display": "string"
    },
    {
      "id": "string",
      "url": "string",
      "name": "string",
      "slug": "string",
      "color": "string",
      "display": "string"
    },
    {
      "id": "string",
      "url": "string",
      "name": "string",
      "slug": "string",
      "color": "string",
      "display": "string"
    },
    {
      "id": "string",
      "url": "string",
      "name": "string",
      "slug": "string",
      "color": "string",
      "display": "string"
    }
  ],
  "custom_fields": {
    "emails_circuit_maintenances": null,
    "provider_parser_circuit_maintenances": null
  },
  "created": "string",
  "last_updated": "string",
  "circuit_count": 10,
  "display": "string"
}