{
  "id": "string",
  "url": "string",
  "name": "string",
  "slug": "string",
  "description": "string",
  "type": "many-to-many",
  "source_type": "string",
  "source_label": "string",
  "source_hidden": false,
  "source_filter": "string",
  "destination_type": "string",
  "destination_label": "string",
  "destination_hidden": true,
  "destination_filter": "string"
}