{
  "id": "string",
  "url": "string",
  "name": "string",
  "owner_content_type": "string",
  "owner_object_id": "string",
  "owner": {},
  "weight": 1,
  "description": "string",
  "schema": {
    "id": "string",
    "url": "string",
    "name": "string",
    "slug": "string",
    "display": "string"
  },
  "is_active": true,
  "regions": [
    "string",
    "string",
    "string",
    "string",
    "string",
    "string",
    "string",
    "string",
    "string",
    "string"
  ],
  "sites": [
    "string",
    "string",
    "string",
    "string",
    "string"
  ],
  "roles": [
    "string",
    "string"
  ],
  "device_types": [
    "string",
    "string",
    "string",
    "string",
    "string",
    "string",
    "string",
    "string"
  ],
  "platforms": [
    "string"
  ],
  "cluster_groups": [
    "string",
    "string",
    "string"
  ],
  "clusters": [
    "string",
    "string",
    "string",
    "string",
    "string",
    "string",
    "string",
    "string",
    "string"
  ],
  "tenant_groups": [
    "string",
    "string",
    "string",
    "string",
    "string"
  ],
  "tenants": [
    "string",
    "string",
    "string",
    "string",
    "string",
    "string",
    "string",
    "string"
  ],
  "tags": [
    "string",
    "string",
    "string",
    "string",
    "string"
  ],
  "data": "string",
  "created": "string",
  "last_updated": "string",
  "display": "string"
}