{
  "id": "string",
  "url": "string",
  "device": {
    "id": "string",
    "url": "string",
    "name": "string",
    "display": "string"
  },
  "virtual_machine": {
    "id": "string",
    "url": "string",
    "name": "string",
    "display": "string"
  },
  "name": "string",
  "ports": [
    6,
    6,
    4,
    7
  ],
  "protocol": {
    "label": "TCP",
    "value": "udp"
  },
  "ipaddresses": [
    "string",
    "string",
    "string",
    "string",
    "string",
    "string"
  ],
  "description": "string",
  "tags": [
    {
      "id": "string",
      "url": "string",
      "name": "string",
      "slug": "string",
      "color": "string",
      "display": "string"
    },
    {
      "id": "string",
      "url": "string",
      "name": "string",
      "slug": "string",
      "color": "string",
      "display": "string"
    },
    {
      "id": "string",
      "url": "string",
      "name": "string",
      "slug": "string",
      "color": "string",
      "display": "string"
    }
  ],
  "custom_fields": {},
  "created": "string",
  "last_updated": "string",
  "display": "string"
}