{
  "id": "string",
  "url": "string",
  "name": "string",
  "slug": "string",
  "content_type": "string",
  "field": "string",
  "min": 4,
  "max": 9,
  "enabled": false,
  "error_message": "string",
  "created": "string",
  "last_updated": "string",
  "display": "string"
}