{
  "id": "string",
  "url": "string",
  "name": "string",
  "slug": "string",
  "color": "string",
  "vm_role": false,
  "description": "string",
  "device_count": 3,
  "virtualmachine_count": 2,
  "custom_fields": {},
  "created": "string",
  "last_updated": "string",
  "display": "string"
}