{
  "id": "string",
  "url": "string",
  "target_url": "string",
  "name": "string",
  "content_type": "string",
  "text": "string",
  "weight": 2,
  "group_name": "string",
  "button_class": "info",
  "new_window": true,
  "display": "string"
}