{
  "count": 1,
  "next": "string",
  "previous": "string",
  "results": [
    {
      "id": "string",
      "comment": "string",
      "platform": "mattermost",
      "token": "string",
      "display": "string"
    },
    {
      "id": "string",
      "comment": "string",
      "platform": "mattermost",
      "token": "string",
      "display": "string"
    }
  ]
}