{
  "id": "string",
  "url": "string",
  "power_panel": {
    "id": "string",
    "url": "string",
    "name": "string",
    "powerfeed_count": 9,
    "display": "string"
  },
  "rack": {
    "id": "string",
    "url": "string",
    "name": "string",
    "device_count": 3,
    "display": "string"
  },
  "name": "string",
  "status": "active",
  "type": {
    "label": "Primary",
    "value": "primary"
  },
  "supply": {
    "label": "AC",
    "value": "ac"
  },
  "phase": {
    "label": "Single phase",
    "value": "single-phase"
  },
  "voltage": 8,
  "amperage": 7,
  "max_utilization": 3,
  "comments": "string",
  "cable": {
    "id": "string",
    "url": "string",
    "label": "string",
    "display": "string"
  },
  "cable_peer": {},
  "cable_peer_type": "string",
  "connected_endpoint": {},
  "connected_endpoint_type": "string",
  "connected_endpoint_reachable": true,
  "tags": [
    {
      "id": "string",
      "url": "string",
      "name": "string",
      "slug": "string",
      "color": "string",
      "display": "string"
    },
    {
      "id": "string",
      "url": "string",
      "name": "string",
      "slug": "string",
      "color": "string",
      "display": "string"
    },
    {
      "id": "string",
      "url": "string",
      "name": "string",
      "slug": "string",
      "color": "string",
      "display": "string"
    },
    {
      "id": "string",
      "url": "string",
      "name": "string",
      "slug": "string",
      "color": "string",
      "display": "string"
    },
    {
      "id": "string",
      "url": "string",
      "name": "string",
      "slug": "string",
      "color": "string",
      "display": "string"
    },
    {
      "id": "string",
      "url": "string",
      "name": "string",
      "slug": "string",
      "color": "string",
      "display": "string"
    },
    {
      "id": "string",
      "url": "string",
      "name": "string",
      "slug": "string",
      "color": "string",
      "display": "string"
    },
    {
      "id": "string",
      "url": "string",
      "name": "string",
      "slug": "string",
      "color": "string",
      "display": "string"
    },
    {
      "id": "string",
      "url": "string",
      "name": "string",
      "slug": "string",
      "color": "string",
      "display": "string"
    }
  ],
  "custom_fields": {},
  "created": "string",
  "last_updated": "string",
  "display": "string"
}