{
  "count": 3,
  "next": "string",
  "previous": "string",
  "results": [
    {
      "id": "string",
      "command": "string",
      "subcommand": "string",
      "grant_type": "channel",
      "name": "string",
      "value": "string",
      "display": "string"
    }
  ]
}