{
  "id": "string",
  "url": "string",
  "name": "string",
  "slug": "string",
  "owner_content_type": "string",
  "owner_object_id": "string",
  "owner": {},
  "description": "string",
  "data_schema": "string",
  "created": "string",
  "last_updated": "string",
  "display": "string"
}