{
  "$id": "schema.json",
  "type": "object",
  "schema": "http://json-schema.org/draft-07/schema#",
  "translate": true,
  "dynamicfields": true,
  "properties": {
    "ph_request_type": {
      "type": "string",
      "description": "type of request (internal to adapter)",
      "default": "createNetworkBlock",
      "enum": [
        "createNetworkBlock",
        "getDtcServer",
        "createDtcServer",
        "getDtcPool",
        "createDtcPool",
        "createDtcLbdn"
      ],
      "external_name": "ph_request_type"
    },
    "functionParam": {
      "description": "",
      "parse": false,
      "encode": false,
      "encrypt": {
        "type": "AES",
        "key": ""
      },
      "external_name": "_function"
    },
    "objectReference": {
      "description": "",
      "parse": false,
      "encode": false,
      "encrypt": {
        "type": "AES",
        "key": ""
      },
      "external_name": "object_reference"
    }
  },
  "definitions": {}
}