{
  "success": false,
  "messages": [
    {
      "code": 9,
      "msg": "string",
      "type": "error",
      "extra": {}
    }
  ],
  "data": [
    {
      "count": 1
    },
    {
      "count": 9
    }
  ]
}