{
  "success": false,
  "messages": [
    {
      "code": 7,
      "msg": "string",
      "type": "notice",
      "extra": {}
    },
    {
      "code": 8,
      "msg": "string",
      "type": "notice",
      "extra": {}
    },
    {
      "code": 2,
      "msg": "string",
      "type": "notice",
      "extra": {}
    },
    {
      "code": 3,
      "msg": "string",
      "type": "warning",
      "extra": {}
    },
    {
      "code": 2,
      "msg": "string",
      "type": "notice",
      "extra": {}
    },
    {
      "code": 7,
      "msg": "string",
      "type": "notice",
      "extra": {}
    },
    {
      "code": 3,
      "msg": "string",
      "type": "error",
      "extra": {}
    }
  ],
  "data": [
    {
      "range_delayed_create_time": "string",
      "range_delayed_delete_time": "string",
      "server_class_name": "string",
      "server_class_parameters": [
        {
          "name": "string",
          "value": "string",
          "inheritance": "set",
          "propagation": "propagate",
          "source": "string"
        },
        {
          "name": "string",
          "value": "string",
          "inheritance": "inherited",
          "propagation": "restrict",
          "source": "string"
        },
        {
          "name": "string",
          "value": "string",
          "inheritance": "set",
          "propagation": "restrict",
          "source": "string"
        },
        {
          "name": "string",
          "value": "string",
          "inheritance": "inherited",
          "propagation": "propagate",
          "source": "string"
        },
        {
          "name": "string",
          "value": "string",
          "inheritance": "set",
          "propagation": "propagate",
          "source": "string"
        },
        {
          "name": "string",
          "value": "string",
          "inheritance": "inherited",
          "propagation": "propagate",
          "source": "string"
        },
        {
          "name": "string",
          "value": "string",
          "inheritance": "set",
          "propagation": "restrict",
          "source": "string"
        },
        {
          "name": "string",
          "value": "string",
          "inheritance": "inherited",
          "propagation": "restrict",
          "source": "string"
        },
        {
          "name": "string",
          "value": "string",
          "inheritance": "inherited",
          "propagation": "propagate",
          "source": "string"
        },
        {
          "name": "string",
          "value": "string",
          "inheritance": "set",
          "propagation": "propagate",
          "source": "string"
        }
      ],
      "server_comment": "string",
      "server_id": "string",
      "server_name": "string",
      "server_type": "string",
      "server_version": "string",
      "range_acl": "string",
      "range_class_name": "string",
      "range_class_parameters": [
        {
          "name": "string",
          "value": "string",
          "inheritance": "inherited",
          "propagation": "propagate",
          "source": "string"
        },
        {
          "name": "string",
          "value": "string",
          "inheritance": "inherited",
          "propagation": "propagate",
          "source": "string"
        },
        {
          "name": "string",
          "value": "string",
          "inheritance": "inherited",
          "propagation": "propagate",
          "source": "string"
        },
        {
          "name": "string",
          "value": "string",
          "inheritance": "set",
          "propagation": "propagate",
          "source": "string"
        },
        {
          "name": "string",
          "value": "string",
          "inheritance": "inherited",
          "propagation": "restrict",
          "source": "string"
        },
        {
          "name": "string",
          "value": "string",
          "inheritance": "inherited",
          "propagation": "propagate",
          "source": "string"
        },
        {
          "name": "string",
          "value": "string",
          "inheritance": "set",
          "propagation": "restrict",
          "source": "string"
        },
        {
          "name": "string",
          "value": "string",
          "inheritance": "inherited",
          "propagation": "propagate",
          "source": "string"
        },
        {
          "name": "string",
          "value": "string",
          "inheritance": "set",
          "propagation": "restrict",
          "source": "string"
        },
        {
          "name": "string",
          "value": "string",
          "inheritance": "set",
          "propagation": "propagate",
          "source": "string"
        }
      ],
      "range_end_addr": "string",
      "range_end_address_addr": "string",
      "range_failover_name": "string",
      "range_id": "string",
      "range_lease_count": "string",
      "range_lease_percent": "string",
      "range_name": "string",
      "range_size": "string",
      "range_start_addr": "string",
      "range_start_address_addr": "string",
      "range_state": "string",
      "scope_class_name": "string",
      "scope_class_parameters": [
        {
          "name": "string",
          "value": "string",
          "inheritance": "inherited",
          "propagation": "propagate",
          "source": "string"
        },
        {
          "name": "string",
          "value": "string",
          "inheritance": "set",
          "propagation": "restrict",
          "source": "string"
        },
        {
          "name": "string",
          "value": "string",
          "inheritance": "set",
          "propagation": "restrict",
          "source": "string"
        },
        {
          "name": "string",
          "value": "string",
          "inheritance": "set",
          "propagation": "restrict",
          "source": "string"
        },
        {
          "name": "string",
          "value": "string",
          "inheritance": "inherited",
          "propagation": "propagate",
          "source": "string"
        },
        {
          "name": "string",
          "value": "string",
          "inheritance": "inherited",
          "propagation": "restrict",
          "source": "string"
        },
        {
          "name": "string",
          "value": "string",
          "inheritance": "inherited",
          "propagation": "propagate",
          "source": "string"
        },
        {
          "name": "string",
          "value": "string",
          "inheritance": "inherited",
          "propagation": "restrict",
          "source": "string"
        }
      ],
      "scope_id": "string",
      "scope_if_addr": "string",
      "scope_if_name": "string",
      "scope_name": "string",
      "scope_net_addr": "string",
      "scope_net_mask": "string",
      "scope_space_id": "string",
      "scope_size": "string",
      "scope_start_address_addr": "string",
      "sharednetwork_id": "string",
      "sharednetwork_name": "string",
      "server_addr": "string",
      "range_multistatus": "string",
      "smart_parent_id": "string",
      "smart_parent_name": "string"
    },
    {
      "range_delayed_create_time": "string",
      "range_delayed_delete_time": "string",
      "server_class_name": "string",
      "server_class_parameters": [
        {
          "name": "string",
          "value": "string",
          "inheritance": "set",
          "propagation": "restrict",
          "source": "string"
        },
        {
          "name": "string",
          "value": "string",
          "inheritance": "inherited",
          "propagation": "restrict",
          "source": "string"
        },
        {
          "name": "string",
          "value": "string",
          "inheritance": "set",
          "propagation": "restrict",
          "source": "string"
        },
        {
          "name": "string",
          "value": "string",
          "inheritance": "set",
          "propagation": "propagate",
          "source": "string"
        },
        {
          "name": "string",
          "value": "string",
          "inheritance": "inherited",
          "propagation": "propagate",
          "source": "string"
        },
        {
          "name": "string",
          "value": "string",
          "inheritance": "set",
          "propagation": "propagate",
          "source": "string"
        },
        {
          "name": "string",
          "value": "string",
          "inheritance": "set",
          "propagation": "restrict",
          "source": "string"
        },
        {
          "name": "string",
          "value": "string",
          "inheritance": "set",
          "propagation": "propagate",
          "source": "string"
        },
        {
          "name": "string",
          "value": "string",
          "inheritance": "set",
          "propagation": "restrict",
          "source": "string"
        },
        {
          "name": "string",
          "value": "string",
          "inheritance": "set",
          "propagation": "propagate",
          "source": "string"
        }
      ],
      "server_comment": "string",
      "server_id": "string",
      "server_name": "string",
      "server_type": "string",
      "server_version": "string",
      "range_acl": "string",
      "range_class_name": "string",
      "range_class_parameters": [
        {
          "name": "string",
          "value": "string",
          "inheritance": "inherited",
          "propagation": "restrict",
          "source": "string"
        },
        {
          "name": "string",
          "value": "string",
          "inheritance": "inherited",
          "propagation": "propagate",
          "source": "string"
        },
        {
          "name": "string",
          "value": "string",
          "inheritance": "inherited",
          "propagation": "propagate",
          "source": "string"
        }
      ],
      "range_end_addr": "string",
      "range_end_address_addr": "string",
      "range_failover_name": "string",
      "range_id": "string",
      "range_lease_count": "string",
      "range_lease_percent": "string",
      "range_name": "string",
      "range_size": "string",
      "range_start_addr": "string",
      "range_start_address_addr": "string",
      "range_state": "string",
      "scope_class_name": "string",
      "scope_class_parameters": [
        {
          "name": "string",
          "value": "string",
          "inheritance": "inherited",
          "propagation": "propagate",
          "source": "string"
        },
        {
          "name": "string",
          "value": "string",
          "inheritance": "set",
          "propagation": "propagate",
          "source": "string"
        },
        {
          "name": "string",
          "value": "string",
          "inheritance": "set",
          "propagation": "propagate",
          "source": "string"
        },
        {
          "name": "string",
          "value": "string",
          "inheritance": "inherited",
          "propagation": "restrict",
          "source": "string"
        },
        {
          "name": "string",
          "value": "string",
          "inheritance": "set",
          "propagation": "restrict",
          "source": "string"
        },
        {
          "name": "string",
          "value": "string",
          "inheritance": "inherited",
          "propagation": "propagate",
          "source": "string"
        },
        {
          "name": "string",
          "value": "string",
          "inheritance": "inherited",
          "propagation": "propagate",
          "source": "string"
        },
        {
          "name": "string",
          "value": "string",
          "inheritance": "inherited",
          "propagation": "propagate",
          "source": "string"
        },
        {
          "name": "string",
          "value": "string",
          "inheritance": "set",
          "propagation": "restrict",
          "source": "string"
        }
      ],
      "scope_id": "string",
      "scope_if_addr": "string",
      "scope_if_name": "string",
      "scope_name": "string",
      "scope_net_addr": "string",
      "scope_net_mask": "string",
      "scope_space_id": "string",
      "scope_size": "string",
      "scope_start_address_addr": "string",
      "sharednetwork_id": "string",
      "sharednetwork_name": "string",
      "server_addr": "string",
      "range_multistatus": "string",
      "smart_parent_id": "string",
      "smart_parent_name": "string"
    },
    {
      "range_delayed_create_time": "string",
      "range_delayed_delete_time": "string",
      "server_class_name": "string",
      "server_class_parameters": [
        {
          "name": "string",
          "value": "string",
          "inheritance": "set",
          "propagation": "restrict",
          "source": "string"
        },
        {
          "name": "string",
          "value": "string",
          "inheritance": "inherited",
          "propagation": "propagate",
          "source": "string"
        },
        {
          "name": "string",
          "value": "string",
          "inheritance": "inherited",
          "propagation": "restrict",
          "source": "string"
        },
        {
          "name": "string",
          "value": "string",
          "inheritance": "inherited",
          "propagation": "propagate",
          "source": "string"
        },
        {
          "name": "string",
          "value": "string",
          "inheritance": "inherited",
          "propagation": "restrict",
          "source": "string"
        },
        {
          "name": "string",
          "value": "string",
          "inheritance": "inherited",
          "propagation": "restrict",
          "source": "string"
        },
        {
          "name": "string",
          "value": "string",
          "inheritance": "inherited",
          "propagation": "restrict",
          "source": "string"
        },
        {
          "name": "string",
          "value": "string",
          "inheritance": "set",
          "propagation": "restrict",
          "source": "string"
        }
      ],
      "server_comment": "string",
      "server_id": "string",
      "server_name": "string",
      "server_type": "string",
      "server_version": "string",
      "range_acl": "string",
      "range_class_name": "string",
      "range_class_parameters": [
        {
          "name": "string",
          "value": "string",
          "inheritance": "inherited",
          "propagation": "propagate",
          "source": "string"
        },
        {
          "name": "string",
          "value": "string",
          "inheritance": "set",
          "propagation": "propagate",
          "source": "string"
        },
        {
          "name": "string",
          "value": "string",
          "inheritance": "inherited",
          "propagation": "restrict",
          "source": "string"
        },
        {
          "name": "string",
          "value": "string",
          "inheritance": "inherited",
          "propagation": "propagate",
          "source": "string"
        },
        {
          "name": "string",
          "value": "string",
          "inheritance": "set",
          "propagation": "propagate",
          "source": "string"
        }
      ],
      "range_end_addr": "string",
      "range_end_address_addr": "string",
      "range_failover_name": "string",
      "range_id": "string",
      "range_lease_count": "string",
      "range_lease_percent": "string",
      "range_name": "string",
      "range_size": "string",
      "range_start_addr": "string",
      "range_start_address_addr": "string",
      "range_state": "string",
      "scope_class_name": "string",
      "scope_class_parameters": [
        {
          "name": "string",
          "value": "string",
          "inheritance": "set",
          "propagation": "restrict",
          "source": "string"
        },
        {
          "name": "string",
          "value": "string",
          "inheritance": "set",
          "propagation": "restrict",
          "source": "string"
        },
        {
          "name": "string",
          "value": "string",
          "inheritance": "set",
          "propagation": "propagate",
          "source": "string"
        }
      ],
      "scope_id": "string",
      "scope_if_addr": "string",
      "scope_if_name": "string",
      "scope_name": "string",
      "scope_net_addr": "string",
      "scope_net_mask": "string",
      "scope_space_id": "string",
      "scope_size": "string",
      "scope_start_address_addr": "string",
      "sharednetwork_id": "string",
      "sharednetwork_name": "string",
      "server_addr": "string",
      "range_multistatus": "string",
      "smart_parent_id": "string",
      "smart_parent_name": "string"
    },
    {
      "range_delayed_create_time": "string",
      "range_delayed_delete_time": "string",
      "server_class_name": "string",
      "server_class_parameters": [
        {
          "name": "string",
          "value": "string",
          "inheritance": "inherited",
          "propagation": "propagate",
          "source": "string"
        },
        {
          "name": "string",
          "value": "string",
          "inheritance": "inherited",
          "propagation": "restrict",
          "source": "string"
        },
        {
          "name": "string",
          "value": "string",
          "inheritance": "inherited",
          "propagation": "propagate",
          "source": "string"
        },
        {
          "name": "string",
          "value": "string",
          "inheritance": "inherited",
          "propagation": "propagate",
          "source": "string"
        },
        {
          "name": "string",
          "value": "string",
          "inheritance": "set",
          "propagation": "propagate",
          "source": "string"
        },
        {
          "name": "string",
          "value": "string",
          "inheritance": "set",
          "propagation": "restrict",
          "source": "string"
        }
      ],
      "server_comment": "string",
      "server_id": "string",
      "server_name": "string",
      "server_type": "string",
      "server_version": "string",
      "range_acl": "string",
      "range_class_name": "string",
      "range_class_parameters": [
        {
          "name": "string",
          "value": "string",
          "inheritance": "inherited",
          "propagation": "propagate",
          "source": "string"
        },
        {
          "name": "string",
          "value": "string",
          "inheritance": "inherited",
          "propagation": "propagate",
          "source": "string"
        },
        {
          "name": "string",
          "value": "string",
          "inheritance": "inherited",
          "propagation": "restrict",
          "source": "string"
        },
        {
          "name": "string",
          "value": "string",
          "inheritance": "inherited",
          "propagation": "restrict",
          "source": "string"
        },
        {
          "name": "string",
          "value": "string",
          "inheritance": "set",
          "propagation": "restrict",
          "source": "string"
        },
        {
          "name": "string",
          "value": "string",
          "inheritance": "inherited",
          "propagation": "restrict",
          "source": "string"
        },
        {
          "name": "string",
          "value": "string",
          "inheritance": "inherited",
          "propagation": "propagate",
          "source": "string"
        },
        {
          "name": "string",
          "value": "string",
          "inheritance": "set",
          "propagation": "restrict",
          "source": "string"
        }
      ],
      "range_end_addr": "string",
      "range_end_address_addr": "string",
      "range_failover_name": "string",
      "range_id": "string",
      "range_lease_count": "string",
      "range_lease_percent": "string",
      "range_name": "string",
      "range_size": "string",
      "range_start_addr": "string",
      "range_start_address_addr": "string",
      "range_state": "string",
      "scope_class_name": "string",
      "scope_class_parameters": [
        {
          "name": "string",
          "value": "string",
          "inheritance": "set",
          "propagation": "restrict",
          "source": "string"
        },
        {
          "name": "string",
          "value": "string",
          "inheritance": "set",
          "propagation": "restrict",
          "source": "string"
        },
        {
          "name": "string",
          "value": "string",
          "inheritance": "inherited",
          "propagation": "restrict",
          "source": "string"
        },
        {
          "name": "string",
          "value": "string",
          "inheritance": "inherited",
          "propagation": "restrict",
          "source": "string"
        },
        {
          "name": "string",
          "value": "string",
          "inheritance": "inherited",
          "propagation": "restrict",
          "source": "string"
        },
        {
          "name": "string",
          "value": "string",
          "inheritance": "inherited",
          "propagation": "propagate",
          "source": "string"
        },
        {
          "name": "string",
          "value": "string",
          "inheritance": "set",
          "propagation": "propagate",
          "source": "string"
        },
        {
          "name": "string",
          "value": "string",
          "inheritance": "set",
          "propagation": "propagate",
          "source": "string"
        },
        {
          "name": "string",
          "value": "string",
          "inheritance": "set",
          "propagation": "propagate",
          "source": "string"
        },
        {
          "name": "string",
          "value": "string",
          "inheritance": "set",
          "propagation": "propagate",
          "source": "string"
        }
      ],
      "scope_id": "string",
      "scope_if_addr": "string",
      "scope_if_name": "string",
      "scope_name": "string",
      "scope_net_addr": "string",
      "scope_net_mask": "string",
      "scope_space_id": "string",
      "scope_size": "string",
      "scope_start_address_addr": "string",
      "sharednetwork_id": "string",
      "sharednetwork_name": "string",
      "server_addr": "string",
      "range_multistatus": "string",
      "smart_parent_id": "string",
      "smart_parent_name": "string"
    },
    {
      "range_delayed_create_time": "string",
      "range_delayed_delete_time": "string",
      "server_class_name": "string",
      "server_class_parameters": [
        {
          "name": "string",
          "value": "string",
          "inheritance": "set",
          "propagation": "restrict",
          "source": "string"
        },
        {
          "name": "string",
          "value": "string",
          "inheritance": "set",
          "propagation": "propagate",
          "source": "string"
        },
        {
          "name": "string",
          "value": "string",
          "inheritance": "set",
          "propagation": "restrict",
          "source": "string"
        },
        {
          "name": "string",
          "value": "string",
          "inheritance": "set",
          "propagation": "restrict",
          "source": "string"
        }
      ],
      "server_comment": "string",
      "server_id": "string",
      "server_name": "string",
      "server_type": "string",
      "server_version": "string",
      "range_acl": "string",
      "range_class_name": "string",
      "range_class_parameters": [
        {
          "name": "string",
          "value": "string",
          "inheritance": "inherited",
          "propagation": "propagate",
          "source": "string"
        },
        {
          "name": "string",
          "value": "string",
          "inheritance": "inherited",
          "propagation": "propagate",
          "source": "string"
        },
        {
          "name": "string",
          "value": "string",
          "inheritance": "set",
          "propagation": "propagate",
          "source": "string"
        },
        {
          "name": "string",
          "value": "string",
          "inheritance": "set",
          "propagation": "restrict",
          "source": "string"
        },
        {
          "name": "string",
          "value": "string",
          "inheritance": "set",
          "propagation": "restrict",
          "source": "string"
        },
        {
          "name": "string",
          "value": "string",
          "inheritance": "set",
          "propagation": "restrict",
          "source": "string"
        }
      ],
      "range_end_addr": "string",
      "range_end_address_addr": "string",
      "range_failover_name": "string",
      "range_id": "string",
      "range_lease_count": "string",
      "range_lease_percent": "string",
      "range_name": "string",
      "range_size": "string",
      "range_start_addr": "string",
      "range_start_address_addr": "string",
      "range_state": "string",
      "scope_class_name": "string",
      "scope_class_parameters": [
        {
          "name": "string",
          "value": "string",
          "inheritance": "inherited",
          "propagation": "propagate",
          "source": "string"
        },
        {
          "name": "string",
          "value": "string",
          "inheritance": "inherited",
          "propagation": "propagate",
          "source": "string"
        },
        {
          "name": "string",
          "value": "string",
          "inheritance": "inherited",
          "propagation": "restrict",
          "source": "string"
        },
        {
          "name": "string",
          "value": "string",
          "inheritance": "set",
          "propagation": "propagate",
          "source": "string"
        },
        {
          "name": "string",
          "value": "string",
          "inheritance": "inherited",
          "propagation": "restrict",
          "source": "string"
        },
        {
          "name": "string",
          "value": "string",
          "inheritance": "inherited",
          "propagation": "propagate",
          "source": "string"
        },
        {
          "name": "string",
          "value": "string",
          "inheritance": "set",
          "propagation": "restrict",
          "source": "string"
        },
        {
          "name": "string",
          "value": "string",
          "inheritance": "set",
          "propagation": "propagate",
          "source": "string"
        },
        {
          "name": "string",
          "value": "string",
          "inheritance": "set",
          "propagation": "propagate",
          "source": "string"
        },
        {
          "name": "string",
          "value": "string",
          "inheritance": "set",
          "propagation": "restrict",
          "source": "string"
        }
      ],
      "scope_id": "string",
      "scope_if_addr": "string",
      "scope_if_name": "string",
      "scope_name": "string",
      "scope_net_addr": "string",
      "scope_net_mask": "string",
      "scope_space_id": "string",
      "scope_size": "string",
      "scope_start_address_addr": "string",
      "sharednetwork_id": "string",
      "sharednetwork_name": "string",
      "server_addr": "string",
      "range_multistatus": "string",
      "smart_parent_id": "string",
      "smart_parent_name": "string"
    },
    {
      "range_delayed_create_time": "string",
      "range_delayed_delete_time": "string",
      "server_class_name": "string",
      "server_class_parameters": [
        {
          "name": "string",
          "value": "string",
          "inheritance": "inherited",
          "propagation": "restrict",
          "source": "string"
        }
      ],
      "server_comment": "string",
      "server_id": "string",
      "server_name": "string",
      "server_type": "string",
      "server_version": "string",
      "range_acl": "string",
      "range_class_name": "string",
      "range_class_parameters": [
        {
          "name": "string",
          "value": "string",
          "inheritance": "set",
          "propagation": "propagate",
          "source": "string"
        },
        {
          "name": "string",
          "value": "string",
          "inheritance": "inherited",
          "propagation": "propagate",
          "source": "string"
        },
        {
          "name": "string",
          "value": "string",
          "inheritance": "inherited",
          "propagation": "restrict",
          "source": "string"
        },
        {
          "name": "string",
          "value": "string",
          "inheritance": "set",
          "propagation": "restrict",
          "source": "string"
        }
      ],
      "range_end_addr": "string",
      "range_end_address_addr": "string",
      "range_failover_name": "string",
      "range_id": "string",
      "range_lease_count": "string",
      "range_lease_percent": "string",
      "range_name": "string",
      "range_size": "string",
      "range_start_addr": "string",
      "range_start_address_addr": "string",
      "range_state": "string",
      "scope_class_name": "string",
      "scope_class_parameters": [
        {
          "name": "string",
          "value": "string",
          "inheritance": "inherited",
          "propagation": "restrict",
          "source": "string"
        },
        {
          "name": "string",
          "value": "string",
          "inheritance": "inherited",
          "propagation": "restrict",
          "source": "string"
        },
        {
          "name": "string",
          "value": "string",
          "inheritance": "set",
          "propagation": "propagate",
          "source": "string"
        },
        {
          "name": "string",
          "value": "string",
          "inheritance": "inherited",
          "propagation": "propagate",
          "source": "string"
        },
        {
          "name": "string",
          "value": "string",
          "inheritance": "set",
          "propagation": "propagate",
          "source": "string"
        },
        {
          "name": "string",
          "value": "string",
          "inheritance": "set",
          "propagation": "restrict",
          "source": "string"
        },
        {
          "name": "string",
          "value": "string",
          "inheritance": "inherited",
          "propagation": "propagate",
          "source": "string"
        }
      ],
      "scope_id": "string",
      "scope_if_addr": "string",
      "scope_if_name": "string",
      "scope_name": "string",
      "scope_net_addr": "string",
      "scope_net_mask": "string",
      "scope_space_id": "string",
      "scope_size": "string",
      "scope_start_address_addr": "string",
      "sharednetwork_id": "string",
      "sharednetwork_name": "string",
      "server_addr": "string",
      "range_multistatus": "string",
      "smart_parent_id": "string",
      "smart_parent_name": "string"
    },
    {
      "range_delayed_create_time": "string",
      "range_delayed_delete_time": "string",
      "server_class_name": "string",
      "server_class_parameters": [
        {
          "name": "string",
          "value": "string",
          "inheritance": "set",
          "propagation": "restrict",
          "source": "string"
        },
        {
          "name": "string",
          "value": "string",
          "inheritance": "inherited",
          "propagation": "propagate",
          "source": "string"
        },
        {
          "name": "string",
          "value": "string",
          "inheritance": "inherited",
          "propagation": "restrict",
          "source": "string"
        },
        {
          "name": "string",
          "value": "string",
          "inheritance": "set",
          "propagation": "restrict",
          "source": "string"
        }
      ],
      "server_comment": "string",
      "server_id": "string",
      "server_name": "string",
      "server_type": "string",
      "server_version": "string",
      "range_acl": "string",
      "range_class_name": "string",
      "range_class_parameters": [
        {
          "name": "string",
          "value": "string",
          "inheritance": "inherited",
          "propagation": "propagate",
          "source": "string"
        },
        {
          "name": "string",
          "value": "string",
          "inheritance": "set",
          "propagation": "restrict",
          "source": "string"
        },
        {
          "name": "string",
          "value": "string",
          "inheritance": "inherited",
          "propagation": "restrict",
          "source": "string"
        },
        {
          "name": "string",
          "value": "string",
          "inheritance": "set",
          "propagation": "propagate",
          "source": "string"
        },
        {
          "name": "string",
          "value": "string",
          "inheritance": "set",
          "propagation": "restrict",
          "source": "string"
        },
        {
          "name": "string",
          "value": "string",
          "inheritance": "set",
          "propagation": "propagate",
          "source": "string"
        },
        {
          "name": "string",
          "value": "string",
          "inheritance": "set",
          "propagation": "restrict",
          "source": "string"
        },
        {
          "name": "string",
          "value": "string",
          "inheritance": "set",
          "propagation": "propagate",
          "source": "string"
        },
        {
          "name": "string",
          "value": "string",
          "inheritance": "set",
          "propagation": "restrict",
          "source": "string"
        },
        {
          "name": "string",
          "value": "string",
          "inheritance": "set",
          "propagation": "restrict",
          "source": "string"
        }
      ],
      "range_end_addr": "string",
      "range_end_address_addr": "string",
      "range_failover_name": "string",
      "range_id": "string",
      "range_lease_count": "string",
      "range_lease_percent": "string",
      "range_name": "string",
      "range_size": "string",
      "range_start_addr": "string",
      "range_start_address_addr": "string",
      "range_state": "string",
      "scope_class_name": "string",
      "scope_class_parameters": [
        {
          "name": "string",
          "value": "string",
          "inheritance": "set",
          "propagation": "restrict",
          "source": "string"
        },
        {
          "name": "string",
          "value": "string",
          "inheritance": "set",
          "propagation": "restrict",
          "source": "string"
        },
        {
          "name": "string",
          "value": "string",
          "inheritance": "inherited",
          "propagation": "restrict",
          "source": "string"
        }
      ],
      "scope_id": "string",
      "scope_if_addr": "string",
      "scope_if_name": "string",
      "scope_name": "string",
      "scope_net_addr": "string",
      "scope_net_mask": "string",
      "scope_space_id": "string",
      "scope_size": "string",
      "scope_start_address_addr": "string",
      "sharednetwork_id": "string",
      "sharednetwork_name": "string",
      "server_addr": "string",
      "range_multistatus": "string",
      "smart_parent_id": "string",
      "smart_parent_name": "string"
    }
  ]
}