{
  "success": false,
  "messages": [
    {
      "code": 9,
      "msg": "string",
      "type": "notice",
      "extra": {}
    },
    {
      "code": 4,
      "msg": "string",
      "type": "notice",
      "extra": {}
    },
    {
      "code": 4,
      "msg": "string",
      "type": "notice",
      "extra": {}
    }
  ],
  "data": [
    {
      "count": 5
    },
    {
      "count": 8
    },
    {
      "count": 3
    }
  ]
}