{
  "success": true,
  "messages": [
    {
      "code": 4,
      "msg": "string",
      "type": "error",
      "extra": {}
    },
    {
      "code": 3,
      "msg": "string",
      "type": "warning",
      "extra": {}
    },
    {
      "code": 4,
      "msg": "string",
      "type": "error",
      "extra": {}
    }
  ],
  "data": [
    {
      "count": 1
    },
    {
      "count": 10
    }
  ]
}