{
  "success": false,
  "messages": [
    {
      "code": 8,
      "msg": "string",
      "type": "notice",
      "extra": {}
    },
    {
      "code": 9,
      "msg": "string",
      "type": "warning",
      "extra": {}
    },
    {
      "code": 1,
      "msg": "string",
      "type": "notice",
      "extra": {}
    },
    {
      "code": 9,
      "msg": "string",
      "type": "warning",
      "extra": {}
    }
  ],
  "data": [
    {
      "count": 10
    },
    {
      "count": 10
    },
    {
      "count": 5
    },
    {
      "count": 6
    },
    {
      "count": 5
    },
    {
      "count": 6
    },
    {
      "count": 6
    },
    {
      "count": 9
    }
  ]
}