{
  "success": true,
  "messages": [
    {
      "code": 1,
      "msg": "string",
      "type": "warning",
      "extra": {}
    }
  ],
  "data": [
    {
      "range_id": "string"
    },
    {
      "range_id": "string"
    },
    {
      "range_id": "string"
    },
    {
      "range_id": "string"
    },
    {
      "range_id": "string"
    },
    {
      "range_id": "string"
    },
    {
      "range_id": "string"
    },
    {
      "range_id": "string"
    }
  ]
}