{
  "success": false,
  "messages": [
    {
      "code": 3,
      "msg": "string",
      "type": "error",
      "extra": {}
    },
    {
      "code": 4,
      "msg": "string",
      "type": "error",
      "extra": {}
    },
    {
      "code": 8,
      "msg": "string",
      "type": "warning",
      "extra": {}
    },
    {
      "code": 3,
      "msg": "string",
      "type": "warning",
      "extra": {}
    },
    {
      "code": 6,
      "msg": "string",
      "type": "warning",
      "extra": {}
    },
    {
      "code": 8,
      "msg": "string",
      "type": "error",
      "extra": {}
    },
    {
      "code": 8,
      "msg": "string",
      "type": "warning",
      "extra": {}
    }
  ],
  "data": [
    {
      "scope6_id": "string"
    },
    {
      "scope6_id": "string"
    },
    {
      "scope6_id": "string"
    },
    {
      "scope6_id": "string"
    }
  ]
}