{
  "success": true,
  "messages": [
    {
      "code": 5,
      "msg": "string",
      "type": "error",
      "extra": {}
    }
  ],
  "data": [
    {
      "static_delayed_create_time": "string",
      "static_delayed_delete_time": "string",
      "server_class_name": "string",
      "server_class_parameters": [
        {
          "name": "string",
          "value": "string",
          "inheritance": "set",
          "propagation": "restrict",
          "source": "string"
        },
        {
          "name": "string",
          "value": "string",
          "inheritance": "set",
          "propagation": "propagate",
          "source": "string"
        },
        {
          "name": "string",
          "value": "string",
          "inheritance": "inherited",
          "propagation": "restrict",
          "source": "string"
        },
        {
          "name": "string",
          "value": "string",
          "inheritance": "set",
          "propagation": "propagate",
          "source": "string"
        }
      ],
      "server_id": "string",
      "server_name": "string",
      "server_type": "string",
      "server_version": "string",
      "group_class_name": "string",
      "group_class_parameters": [
        {
          "name": "string",
          "value": "string",
          "inheritance": "inherited",
          "propagation": "propagate",
          "source": "string"
        },
        {
          "name": "string",
          "value": "string",
          "inheritance": "set",
          "propagation": "propagate",
          "source": "string"
        },
        {
          "name": "string",
          "value": "string",
          "inheritance": "set",
          "propagation": "propagate",
          "source": "string"
        },
        {
          "name": "string",
          "value": "string",
          "inheritance": "set",
          "propagation": "propagate",
          "source": "string"
        },
        {
          "name": "string",
          "value": "string",
          "inheritance": "inherited",
          "propagation": "restrict",
          "source": "string"
        },
        {
          "name": "string",
          "value": "string",
          "inheritance": "set",
          "propagation": "restrict",
          "source": "string"
        },
        {
          "name": "string",
          "value": "string",
          "inheritance": "inherited",
          "propagation": "restrict",
          "source": "string"
        },
        {
          "name": "string",
          "value": "string",
          "inheritance": "inherited",
          "propagation": "propagate",
          "source": "string"
        }
      ],
      "group_id": "string",
      "group_name": "string",
      "static_addr": "string",
      "static_class_name": "string",
      "static_class_parameters": [
        {
          "name": "string",
          "value": "string",
          "inheritance": "inherited",
          "propagation": "propagate",
          "source": "string"
        },
        {
          "name": "string",
          "value": "string",
          "inheritance": "inherited",
          "propagation": "propagate",
          "source": "string"
        },
        {
          "name": "string",
          "value": "string",
          "inheritance": "set",
          "propagation": "propagate",
          "source": "string"
        },
        {
          "name": "string",
          "value": "string",
          "inheritance": "set",
          "propagation": "restrict",
          "source": "string"
        },
        {
          "name": "string",
          "value": "string",
          "inheritance": "set",
          "propagation": "restrict",
          "source": "string"
        },
        {
          "name": "string",
          "value": "string",
          "inheritance": "set",
          "propagation": "propagate",
          "source": "string"
        }
      ],
      "static_domain": "string",
      "static_expire_time": "string",
      "static_id": "string",
      "static_address_addr": "string",
      "static_last_seen": "string",
      "static_mac_addr": "string",
      "static_name": "string",
      "scope_class_name": "string",
      "scope_class_parameters": [
        {
          "name": "string",
          "value": "string",
          "inheritance": "set",
          "propagation": "propagate",
          "source": "string"
        }
      ],
      "scope_end_address_addr": "string",
      "scope_id": "string",
      "scope_name": "string",
      "scope_net_addr": "string",
      "scope_net_mask": "string",
      "scope_space_id": "string",
      "scope_size": "string",
      "scope_start_address_addr": "string",
      "static_mac_vendor": "string",
      "static_multistatus": "string",
      "smart_parent_id": "string",
      "smart_parent_name": "string"
    },
    {
      "static_delayed_create_time": "string",
      "static_delayed_delete_time": "string",
      "server_class_name": "string",
      "server_class_parameters": [
        {
          "name": "string",
          "value": "string",
          "inheritance": "set",
          "propagation": "propagate",
          "source": "string"
        },
        {
          "name": "string",
          "value": "string",
          "inheritance": "set",
          "propagation": "restrict",
          "source": "string"
        },
        {
          "name": "string",
          "value": "string",
          "inheritance": "inherited",
          "propagation": "restrict",
          "source": "string"
        },
        {
          "name": "string",
          "value": "string",
          "inheritance": "inherited",
          "propagation": "propagate",
          "source": "string"
        },
        {
          "name": "string",
          "value": "string",
          "inheritance": "inherited",
          "propagation": "restrict",
          "source": "string"
        },
        {
          "name": "string",
          "value": "string",
          "inheritance": "inherited",
          "propagation": "propagate",
          "source": "string"
        },
        {
          "name": "string",
          "value": "string",
          "inheritance": "inherited",
          "propagation": "restrict",
          "source": "string"
        },
        {
          "name": "string",
          "value": "string",
          "inheritance": "inherited",
          "propagation": "restrict",
          "source": "string"
        },
        {
          "name": "string",
          "value": "string",
          "inheritance": "set",
          "propagation": "propagate",
          "source": "string"
        },
        {
          "name": "string",
          "value": "string",
          "inheritance": "inherited",
          "propagation": "propagate",
          "source": "string"
        }
      ],
      "server_id": "string",
      "server_name": "string",
      "server_type": "string",
      "server_version": "string",
      "group_class_name": "string",
      "group_class_parameters": [
        {
          "name": "string",
          "value": "string",
          "inheritance": "set",
          "propagation": "propagate",
          "source": "string"
        },
        {
          "name": "string",
          "value": "string",
          "inheritance": "inherited",
          "propagation": "restrict",
          "source": "string"
        },
        {
          "name": "string",
          "value": "string",
          "inheritance": "inherited",
          "propagation": "restrict",
          "source": "string"
        },
        {
          "name": "string",
          "value": "string",
          "inheritance": "inherited",
          "propagation": "restrict",
          "source": "string"
        }
      ],
      "group_id": "string",
      "group_name": "string",
      "static_addr": "string",
      "static_class_name": "string",
      "static_class_parameters": [
        {
          "name": "string",
          "value": "string",
          "inheritance": "inherited",
          "propagation": "restrict",
          "source": "string"
        },
        {
          "name": "string",
          "value": "string",
          "inheritance": "inherited",
          "propagation": "propagate",
          "source": "string"
        },
        {
          "name": "string",
          "value": "string",
          "inheritance": "inherited",
          "propagation": "propagate",
          "source": "string"
        },
        {
          "name": "string",
          "value": "string",
          "inheritance": "set",
          "propagation": "propagate",
          "source": "string"
        },
        {
          "name": "string",
          "value": "string",
          "inheritance": "inherited",
          "propagation": "restrict",
          "source": "string"
        },
        {
          "name": "string",
          "value": "string",
          "inheritance": "inherited",
          "propagation": "propagate",
          "source": "string"
        },
        {
          "name": "string",
          "value": "string",
          "inheritance": "inherited",
          "propagation": "restrict",
          "source": "string"
        },
        {
          "name": "string",
          "value": "string",
          "inheritance": "set",
          "propagation": "propagate",
          "source": "string"
        },
        {
          "name": "string",
          "value": "string",
          "inheritance": "set",
          "propagation": "restrict",
          "source": "string"
        },
        {
          "name": "string",
          "value": "string",
          "inheritance": "inherited",
          "propagation": "restrict",
          "source": "string"
        }
      ],
      "static_domain": "string",
      "static_expire_time": "string",
      "static_id": "string",
      "static_address_addr": "string",
      "static_last_seen": "string",
      "static_mac_addr": "string",
      "static_name": "string",
      "scope_class_name": "string",
      "scope_class_parameters": [
        {
          "name": "string",
          "value": "string",
          "inheritance": "set",
          "propagation": "restrict",
          "source": "string"
        },
        {
          "name": "string",
          "value": "string",
          "inheritance": "set",
          "propagation": "restrict",
          "source": "string"
        },
        {
          "name": "string",
          "value": "string",
          "inheritance": "set",
          "propagation": "restrict",
          "source": "string"
        },
        {
          "name": "string",
          "value": "string",
          "inheritance": "inherited",
          "propagation": "propagate",
          "source": "string"
        },
        {
          "name": "string",
          "value": "string",
          "inheritance": "set",
          "propagation": "restrict",
          "source": "string"
        },
        {
          "name": "string",
          "value": "string",
          "inheritance": "inherited",
          "propagation": "propagate",
          "source": "string"
        }
      ],
      "scope_end_address_addr": "string",
      "scope_id": "string",
      "scope_name": "string",
      "scope_net_addr": "string",
      "scope_net_mask": "string",
      "scope_space_id": "string",
      "scope_size": "string",
      "scope_start_address_addr": "string",
      "static_mac_vendor": "string",
      "static_multistatus": "string",
      "smart_parent_id": "string",
      "smart_parent_name": "string"
    },
    {
      "static_delayed_create_time": "string",
      "static_delayed_delete_time": "string",
      "server_class_name": "string",
      "server_class_parameters": [
        {
          "name": "string",
          "value": "string",
          "inheritance": "inherited",
          "propagation": "restrict",
          "source": "string"
        },
        {
          "name": "string",
          "value": "string",
          "inheritance": "inherited",
          "propagation": "propagate",
          "source": "string"
        },
        {
          "name": "string",
          "value": "string",
          "inheritance": "set",
          "propagation": "restrict",
          "source": "string"
        },
        {
          "name": "string",
          "value": "string",
          "inheritance": "set",
          "propagation": "propagate",
          "source": "string"
        },
        {
          "name": "string",
          "value": "string",
          "inheritance": "set",
          "propagation": "propagate",
          "source": "string"
        },
        {
          "name": "string",
          "value": "string",
          "inheritance": "inherited",
          "propagation": "restrict",
          "source": "string"
        },
        {
          "name": "string",
          "value": "string",
          "inheritance": "inherited",
          "propagation": "restrict",
          "source": "string"
        },
        {
          "name": "string",
          "value": "string",
          "inheritance": "set",
          "propagation": "propagate",
          "source": "string"
        }
      ],
      "server_id": "string",
      "server_name": "string",
      "server_type": "string",
      "server_version": "string",
      "group_class_name": "string",
      "group_class_parameters": [
        {
          "name": "string",
          "value": "string",
          "inheritance": "inherited",
          "propagation": "restrict",
          "source": "string"
        },
        {
          "name": "string",
          "value": "string",
          "inheritance": "inherited",
          "propagation": "propagate",
          "source": "string"
        },
        {
          "name": "string",
          "value": "string",
          "inheritance": "set",
          "propagation": "propagate",
          "source": "string"
        },
        {
          "name": "string",
          "value": "string",
          "inheritance": "set",
          "propagation": "restrict",
          "source": "string"
        },
        {
          "name": "string",
          "value": "string",
          "inheritance": "set",
          "propagation": "propagate",
          "source": "string"
        },
        {
          "name": "string",
          "value": "string",
          "inheritance": "set",
          "propagation": "restrict",
          "source": "string"
        },
        {
          "name": "string",
          "value": "string",
          "inheritance": "inherited",
          "propagation": "propagate",
          "source": "string"
        },
        {
          "name": "string",
          "value": "string",
          "inheritance": "inherited",
          "propagation": "propagate",
          "source": "string"
        },
        {
          "name": "string",
          "value": "string",
          "inheritance": "inherited",
          "propagation": "restrict",
          "source": "string"
        }
      ],
      "group_id": "string",
      "group_name": "string",
      "static_addr": "string",
      "static_class_name": "string",
      "static_class_parameters": [
        {
          "name": "string",
          "value": "string",
          "inheritance": "inherited",
          "propagation": "propagate",
          "source": "string"
        }
      ],
      "static_domain": "string",
      "static_expire_time": "string",
      "static_id": "string",
      "static_address_addr": "string",
      "static_last_seen": "string",
      "static_mac_addr": "string",
      "static_name": "string",
      "scope_class_name": "string",
      "scope_class_parameters": [
        {
          "name": "string",
          "value": "string",
          "inheritance": "inherited",
          "propagation": "restrict",
          "source": "string"
        },
        {
          "name": "string",
          "value": "string",
          "inheritance": "inherited",
          "propagation": "propagate",
          "source": "string"
        },
        {
          "name": "string",
          "value": "string",
          "inheritance": "inherited",
          "propagation": "restrict",
          "source": "string"
        },
        {
          "name": "string",
          "value": "string",
          "inheritance": "inherited",
          "propagation": "propagate",
          "source": "string"
        },
        {
          "name": "string",
          "value": "string",
          "inheritance": "set",
          "propagation": "restrict",
          "source": "string"
        },
        {
          "name": "string",
          "value": "string",
          "inheritance": "inherited",
          "propagation": "restrict",
          "source": "string"
        },
        {
          "name": "string",
          "value": "string",
          "inheritance": "set",
          "propagation": "propagate",
          "source": "string"
        }
      ],
      "scope_end_address_addr": "string",
      "scope_id": "string",
      "scope_name": "string",
      "scope_net_addr": "string",
      "scope_net_mask": "string",
      "scope_space_id": "string",
      "scope_size": "string",
      "scope_start_address_addr": "string",
      "static_mac_vendor": "string",
      "static_multistatus": "string",
      "smart_parent_id": "string",
      "smart_parent_name": "string"
    }
  ]
}