{
  "success": true,
  "messages": [
    {
      "code": 2,
      "msg": "string",
      "type": "warning",
      "extra": {}
    },
    {
      "code": 8,
      "msg": "string",
      "type": "error",
      "extra": {}
    },
    {
      "code": 2,
      "msg": "string",
      "type": "warning",
      "extra": {}
    },
    {
      "code": 4,
      "msg": "string",
      "type": "warning",
      "extra": {}
    },
    {
      "code": 3,
      "msg": "string",
      "type": "notice",
      "extra": {}
    },
    {
      "code": 2,
      "msg": "string",
      "type": "error",
      "extra": {}
    },
    {
      "code": 3,
      "msg": "string",
      "type": "warning",
      "extra": {}
    }
  ],
  "data": [
    {
      "range6_delayed_time": "string",
      "server6_class_name": "string",
      "server6_class_parameters": [
        {
          "name": "string",
          "value": "string",
          "inheritance": "inherited",
          "propagation": "restrict",
          "source": "string"
        },
        {
          "name": "string",
          "value": "string",
          "inheritance": "inherited",
          "propagation": "propagate",
          "source": "string"
        },
        {
          "name": "string",
          "value": "string",
          "inheritance": "inherited",
          "propagation": "propagate",
          "source": "string"
        },
        {
          "name": "string",
          "value": "string",
          "inheritance": "inherited",
          "propagation": "restrict",
          "source": "string"
        }
      ],
      "server6_comment": "string",
      "server6_id": "string",
      "server6_name": "string",
      "server6_type": "string",
      "server6_version": "string",
      "range6_class_name": "string",
      "range6_class_parameters": [
        {
          "name": "string",
          "value": "string",
          "inheritance": "set",
          "propagation": "restrict",
          "source": "string"
        },
        {
          "name": "string",
          "value": "string",
          "inheritance": "inherited",
          "propagation": "restrict",
          "source": "string"
        },
        {
          "name": "string",
          "value": "string",
          "inheritance": "inherited",
          "propagation": "restrict",
          "source": "string"
        },
        {
          "name": "string",
          "value": "string",
          "inheritance": "inherited",
          "propagation": "propagate",
          "source": "string"
        },
        {
          "name": "string",
          "value": "string",
          "inheritance": "inherited",
          "propagation": "restrict",
          "source": "string"
        },
        {
          "name": "string",
          "value": "string",
          "inheritance": "set",
          "propagation": "propagate",
          "source": "string"
        },
        {
          "name": "string",
          "value": "string",
          "inheritance": "set",
          "propagation": "propagate",
          "source": "string"
        },
        {
          "name": "string",
          "value": "string",
          "inheritance": "inherited",
          "propagation": "restrict",
          "source": "string"
        },
        {
          "name": "string",
          "value": "string",
          "inheritance": "set",
          "propagation": "restrict",
          "source": "string"
        },
        {
          "name": "string",
          "value": "string",
          "inheritance": "set",
          "propagation": "propagate",
          "source": "string"
        }
      ],
      "range6_end_address6_addr": "string",
      "range6_failover_name": "string",
      "range6_id": "string",
      "range6_lease_count": "string",
      "range6_size": "string",
      "range6_start_address6_addr": "string",
      "range6_state": "string",
      "scope6_class_name": "string",
      "scope6_class_parameters": [
        {
          "name": "string",
          "value": "string",
          "inheritance": "set",
          "propagation": "propagate",
          "source": "string"
        },
        {
          "name": "string",
          "value": "string",
          "inheritance": "inherited",
          "propagation": "propagate",
          "source": "string"
        },
        {
          "name": "string",
          "value": "string",
          "inheritance": "set",
          "propagation": "restrict",
          "source": "string"
        },
        {
          "name": "string",
          "value": "string",
          "inheritance": "inherited",
          "propagation": "restrict",
          "source": "string"
        },
        {
          "name": "string",
          "value": "string",
          "inheritance": "inherited",
          "propagation": "restrict",
          "source": "string"
        },
        {
          "name": "string",
          "value": "string",
          "inheritance": "inherited",
          "propagation": "propagate",
          "source": "string"
        }
      ],
      "scope6_end_address6_addr": "string",
      "scope6_id": "string",
      "scope6_name": "string",
      "scope6_prefix": "string",
      "scope6_space_id": "string",
      "scope6_size": "string",
      "scope6_start_address6_addr": "string",
      "sharednetwork6_id": "string",
      "sharednetwork6_name": "string",
      "server6_addr": "string",
      "range6_multistatus": "string",
      "smart_parent_id": "string",
      "smart_parent_name": "string"
    },
    {
      "range6_delayed_time": "string",
      "server6_class_name": "string",
      "server6_class_parameters": [
        {
          "name": "string",
          "value": "string",
          "inheritance": "inherited",
          "propagation": "restrict",
          "source": "string"
        },
        {
          "name": "string",
          "value": "string",
          "inheritance": "set",
          "propagation": "restrict",
          "source": "string"
        },
        {
          "name": "string",
          "value": "string",
          "inheritance": "inherited",
          "propagation": "restrict",
          "source": "string"
        },
        {
          "name": "string",
          "value": "string",
          "inheritance": "inherited",
          "propagation": "restrict",
          "source": "string"
        },
        {
          "name": "string",
          "value": "string",
          "inheritance": "inherited",
          "propagation": "restrict",
          "source": "string"
        },
        {
          "name": "string",
          "value": "string",
          "inheritance": "inherited",
          "propagation": "propagate",
          "source": "string"
        },
        {
          "name": "string",
          "value": "string",
          "inheritance": "inherited",
          "propagation": "restrict",
          "source": "string"
        }
      ],
      "server6_comment": "string",
      "server6_id": "string",
      "server6_name": "string",
      "server6_type": "string",
      "server6_version": "string",
      "range6_class_name": "string",
      "range6_class_parameters": [
        {
          "name": "string",
          "value": "string",
          "inheritance": "inherited",
          "propagation": "restrict",
          "source": "string"
        }
      ],
      "range6_end_address6_addr": "string",
      "range6_failover_name": "string",
      "range6_id": "string",
      "range6_lease_count": "string",
      "range6_size": "string",
      "range6_start_address6_addr": "string",
      "range6_state": "string",
      "scope6_class_name": "string",
      "scope6_class_parameters": [
        {
          "name": "string",
          "value": "string",
          "inheritance": "inherited",
          "propagation": "restrict",
          "source": "string"
        },
        {
          "name": "string",
          "value": "string",
          "inheritance": "inherited",
          "propagation": "propagate",
          "source": "string"
        },
        {
          "name": "string",
          "value": "string",
          "inheritance": "set",
          "propagation": "propagate",
          "source": "string"
        },
        {
          "name": "string",
          "value": "string",
          "inheritance": "set",
          "propagation": "restrict",
          "source": "string"
        },
        {
          "name": "string",
          "value": "string",
          "inheritance": "inherited",
          "propagation": "propagate",
          "source": "string"
        },
        {
          "name": "string",
          "value": "string",
          "inheritance": "inherited",
          "propagation": "restrict",
          "source": "string"
        },
        {
          "name": "string",
          "value": "string",
          "inheritance": "set",
          "propagation": "restrict",
          "source": "string"
        },
        {
          "name": "string",
          "value": "string",
          "inheritance": "inherited",
          "propagation": "restrict",
          "source": "string"
        },
        {
          "name": "string",
          "value": "string",
          "inheritance": "set",
          "propagation": "restrict",
          "source": "string"
        },
        {
          "name": "string",
          "value": "string",
          "inheritance": "inherited",
          "propagation": "propagate",
          "source": "string"
        }
      ],
      "scope6_end_address6_addr": "string",
      "scope6_id": "string",
      "scope6_name": "string",
      "scope6_prefix": "string",
      "scope6_space_id": "string",
      "scope6_size": "string",
      "scope6_start_address6_addr": "string",
      "sharednetwork6_id": "string",
      "sharednetwork6_name": "string",
      "server6_addr": "string",
      "range6_multistatus": "string",
      "smart_parent_id": "string",
      "smart_parent_name": "string"
    },
    {
      "range6_delayed_time": "string",
      "server6_class_name": "string",
      "server6_class_parameters": [
        {
          "name": "string",
          "value": "string",
          "inheritance": "set",
          "propagation": "propagate",
          "source": "string"
        }
      ],
      "server6_comment": "string",
      "server6_id": "string",
      "server6_name": "string",
      "server6_type": "string",
      "server6_version": "string",
      "range6_class_name": "string",
      "range6_class_parameters": [
        {
          "name": "string",
          "value": "string",
          "inheritance": "set",
          "propagation": "propagate",
          "source": "string"
        },
        {
          "name": "string",
          "value": "string",
          "inheritance": "set",
          "propagation": "propagate",
          "source": "string"
        },
        {
          "name": "string",
          "value": "string",
          "inheritance": "set",
          "propagation": "restrict",
          "source": "string"
        },
        {
          "name": "string",
          "value": "string",
          "inheritance": "inherited",
          "propagation": "restrict",
          "source": "string"
        },
        {
          "name": "string",
          "value": "string",
          "inheritance": "inherited",
          "propagation": "propagate",
          "source": "string"
        },
        {
          "name": "string",
          "value": "string",
          "inheritance": "inherited",
          "propagation": "restrict",
          "source": "string"
        },
        {
          "name": "string",
          "value": "string",
          "inheritance": "set",
          "propagation": "propagate",
          "source": "string"
        },
        {
          "name": "string",
          "value": "string",
          "inheritance": "set",
          "propagation": "restrict",
          "source": "string"
        }
      ],
      "range6_end_address6_addr": "string",
      "range6_failover_name": "string",
      "range6_id": "string",
      "range6_lease_count": "string",
      "range6_size": "string",
      "range6_start_address6_addr": "string",
      "range6_state": "string",
      "scope6_class_name": "string",
      "scope6_class_parameters": [
        {
          "name": "string",
          "value": "string",
          "inheritance": "inherited",
          "propagation": "restrict",
          "source": "string"
        },
        {
          "name": "string",
          "value": "string",
          "inheritance": "set",
          "propagation": "restrict",
          "source": "string"
        }
      ],
      "scope6_end_address6_addr": "string",
      "scope6_id": "string",
      "scope6_name": "string",
      "scope6_prefix": "string",
      "scope6_space_id": "string",
      "scope6_size": "string",
      "scope6_start_address6_addr": "string",
      "sharednetwork6_id": "string",
      "sharednetwork6_name": "string",
      "server6_addr": "string",
      "range6_multistatus": "string",
      "smart_parent_id": "string",
      "smart_parent_name": "string"
    },
    {
      "range6_delayed_time": "string",
      "server6_class_name": "string",
      "server6_class_parameters": [
        {
          "name": "string",
          "value": "string",
          "inheritance": "set",
          "propagation": "restrict",
          "source": "string"
        },
        {
          "name": "string",
          "value": "string",
          "inheritance": "inherited",
          "propagation": "restrict",
          "source": "string"
        },
        {
          "name": "string",
          "value": "string",
          "inheritance": "inherited",
          "propagation": "restrict",
          "source": "string"
        },
        {
          "name": "string",
          "value": "string",
          "inheritance": "inherited",
          "propagation": "propagate",
          "source": "string"
        },
        {
          "name": "string",
          "value": "string",
          "inheritance": "inherited",
          "propagation": "restrict",
          "source": "string"
        },
        {
          "name": "string",
          "value": "string",
          "inheritance": "inherited",
          "propagation": "restrict",
          "source": "string"
        },
        {
          "name": "string",
          "value": "string",
          "inheritance": "set",
          "propagation": "propagate",
          "source": "string"
        },
        {
          "name": "string",
          "value": "string",
          "inheritance": "set",
          "propagation": "propagate",
          "source": "string"
        },
        {
          "name": "string",
          "value": "string",
          "inheritance": "inherited",
          "propagation": "restrict",
          "source": "string"
        }
      ],
      "server6_comment": "string",
      "server6_id": "string",
      "server6_name": "string",
      "server6_type": "string",
      "server6_version": "string",
      "range6_class_name": "string",
      "range6_class_parameters": [
        {
          "name": "string",
          "value": "string",
          "inheritance": "set",
          "propagation": "propagate",
          "source": "string"
        },
        {
          "name": "string",
          "value": "string",
          "inheritance": "set",
          "propagation": "restrict",
          "source": "string"
        },
        {
          "name": "string",
          "value": "string",
          "inheritance": "set",
          "propagation": "restrict",
          "source": "string"
        },
        {
          "name": "string",
          "value": "string",
          "inheritance": "set",
          "propagation": "propagate",
          "source": "string"
        }
      ],
      "range6_end_address6_addr": "string",
      "range6_failover_name": "string",
      "range6_id": "string",
      "range6_lease_count": "string",
      "range6_size": "string",
      "range6_start_address6_addr": "string",
      "range6_state": "string",
      "scope6_class_name": "string",
      "scope6_class_parameters": [
        {
          "name": "string",
          "value": "string",
          "inheritance": "set",
          "propagation": "restrict",
          "source": "string"
        },
        {
          "name": "string",
          "value": "string",
          "inheritance": "set",
          "propagation": "restrict",
          "source": "string"
        },
        {
          "name": "string",
          "value": "string",
          "inheritance": "inherited",
          "propagation": "restrict",
          "source": "string"
        },
        {
          "name": "string",
          "value": "string",
          "inheritance": "inherited",
          "propagation": "propagate",
          "source": "string"
        },
        {
          "name": "string",
          "value": "string",
          "inheritance": "set",
          "propagation": "restrict",
          "source": "string"
        },
        {
          "name": "string",
          "value": "string",
          "inheritance": "inherited",
          "propagation": "propagate",
          "source": "string"
        },
        {
          "name": "string",
          "value": "string",
          "inheritance": "set",
          "propagation": "propagate",
          "source": "string"
        }
      ],
      "scope6_end_address6_addr": "string",
      "scope6_id": "string",
      "scope6_name": "string",
      "scope6_prefix": "string",
      "scope6_space_id": "string",
      "scope6_size": "string",
      "scope6_start_address6_addr": "string",
      "sharednetwork6_id": "string",
      "sharednetwork6_name": "string",
      "server6_addr": "string",
      "range6_multistatus": "string",
      "smart_parent_id": "string",
      "smart_parent_name": "string"
    },
    {
      "range6_delayed_time": "string",
      "server6_class_name": "string",
      "server6_class_parameters": [
        {
          "name": "string",
          "value": "string",
          "inheritance": "inherited",
          "propagation": "propagate",
          "source": "string"
        },
        {
          "name": "string",
          "value": "string",
          "inheritance": "set",
          "propagation": "propagate",
          "source": "string"
        },
        {
          "name": "string",
          "value": "string",
          "inheritance": "set",
          "propagation": "propagate",
          "source": "string"
        },
        {
          "name": "string",
          "value": "string",
          "inheritance": "inherited",
          "propagation": "propagate",
          "source": "string"
        },
        {
          "name": "string",
          "value": "string",
          "inheritance": "set",
          "propagation": "propagate",
          "source": "string"
        },
        {
          "name": "string",
          "value": "string",
          "inheritance": "set",
          "propagation": "propagate",
          "source": "string"
        },
        {
          "name": "string",
          "value": "string",
          "inheritance": "set",
          "propagation": "restrict",
          "source": "string"
        }
      ],
      "server6_comment": "string",
      "server6_id": "string",
      "server6_name": "string",
      "server6_type": "string",
      "server6_version": "string",
      "range6_class_name": "string",
      "range6_class_parameters": [
        {
          "name": "string",
          "value": "string",
          "inheritance": "inherited",
          "propagation": "restrict",
          "source": "string"
        },
        {
          "name": "string",
          "value": "string",
          "inheritance": "inherited",
          "propagation": "propagate",
          "source": "string"
        }
      ],
      "range6_end_address6_addr": "string",
      "range6_failover_name": "string",
      "range6_id": "string",
      "range6_lease_count": "string",
      "range6_size": "string",
      "range6_start_address6_addr": "string",
      "range6_state": "string",
      "scope6_class_name": "string",
      "scope6_class_parameters": [
        {
          "name": "string",
          "value": "string",
          "inheritance": "inherited",
          "propagation": "restrict",
          "source": "string"
        },
        {
          "name": "string",
          "value": "string",
          "inheritance": "set",
          "propagation": "propagate",
          "source": "string"
        }
      ],
      "scope6_end_address6_addr": "string",
      "scope6_id": "string",
      "scope6_name": "string",
      "scope6_prefix": "string",
      "scope6_space_id": "string",
      "scope6_size": "string",
      "scope6_start_address6_addr": "string",
      "sharednetwork6_id": "string",
      "sharednetwork6_name": "string",
      "server6_addr": "string",
      "range6_multistatus": "string",
      "smart_parent_id": "string",
      "smart_parent_name": "string"
    }
  ]
}