{
  "success": true,
  "messages": [
    {
      "code": 6,
      "msg": "string",
      "type": "error",
      "extra": {}
    },
    {
      "code": 6,
      "msg": "string",
      "type": "warning",
      "extra": {}
    },
    {
      "code": 5,
      "msg": "string",
      "type": "warning",
      "extra": {}
    }
  ],
  "data": [
    {
      "policy_id": "string"
    },
    {
      "policy_id": "string"
    },
    {
      "policy_id": "string"
    },
    {
      "policy_id": "string"
    }
  ]
}