{
  "success": false,
  "messages": [
    {
      "code": 3,
      "msg": "string",
      "type": "notice",
      "extra": {}
    },
    {
      "code": 7,
      "msg": "string",
      "type": "notice",
      "extra": {}
    },
    {
      "code": 7,
      "msg": "string",
      "type": "warning",
      "extra": {}
    },
    {
      "code": 8,
      "msg": "string",
      "type": "error",
      "extra": {}
    },
    {
      "code": 1,
      "msg": "string",
      "type": "notice",
      "extra": {}
    },
    {
      "code": 3,
      "msg": "string",
      "type": "error",
      "extra": {}
    },
    {
      "code": 5,
      "msg": "string",
      "type": "error",
      "extra": {}
    },
    {
      "code": 6,
      "msg": "string",
      "type": "warning",
      "extra": {}
    }
  ],
  "data": [
    {
      "application_fqdn": "string",
      "gslbserver_id": "string",
      "gslbserver_name": "string",
      "application_id": "string",
      "application_name": "string",
      "pool_affinity_session_time": "string",
      "pool_affinity_state": "string",
      "pool_best_active_nodes": "string",
      "pool_id": "string",
      "pool_inactive_nodes": "string",
      "pool_lb_mode": "string",
      "pool_name": "string",
      "pool_total_nodes": "string",
      "pool_type": "string",
      "pool_weight": "string",
      "pool_delayed_time": "string",
      "gslbserver_type": "string",
      "pool_multistatus": "string",
      "parent_application_id": "string",
      "translated_pool_lb_mode": "string"
    },
    {
      "application_fqdn": "string",
      "gslbserver_id": "string",
      "gslbserver_name": "string",
      "application_id": "string",
      "application_name": "string",
      "pool_affinity_session_time": "string",
      "pool_affinity_state": "string",
      "pool_best_active_nodes": "string",
      "pool_id": "string",
      "pool_inactive_nodes": "string",
      "pool_lb_mode": "string",
      "pool_name": "string",
      "pool_total_nodes": "string",
      "pool_type": "string",
      "pool_weight": "string",
      "pool_delayed_time": "string",
      "gslbserver_type": "string",
      "pool_multistatus": "string",
      "parent_application_id": "string",
      "translated_pool_lb_mode": "string"
    },
    {
      "application_fqdn": "string",
      "gslbserver_id": "string",
      "gslbserver_name": "string",
      "application_id": "string",
      "application_name": "string",
      "pool_affinity_session_time": "string",
      "pool_affinity_state": "string",
      "pool_best_active_nodes": "string",
      "pool_id": "string",
      "pool_inactive_nodes": "string",
      "pool_lb_mode": "string",
      "pool_name": "string",
      "pool_total_nodes": "string",
      "pool_type": "string",
      "pool_weight": "string",
      "pool_delayed_time": "string",
      "gslbserver_type": "string",
      "pool_multistatus": "string",
      "parent_application_id": "string",
      "translated_pool_lb_mode": "string"
    },
    {
      "application_fqdn": "string",
      "gslbserver_id": "string",
      "gslbserver_name": "string",
      "application_id": "string",
      "application_name": "string",
      "pool_affinity_session_time": "string",
      "pool_affinity_state": "string",
      "pool_best_active_nodes": "string",
      "pool_id": "string",
      "pool_inactive_nodes": "string",
      "pool_lb_mode": "string",
      "pool_name": "string",
      "pool_total_nodes": "string",
      "pool_type": "string",
      "pool_weight": "string",
      "pool_delayed_time": "string",
      "gslbserver_type": "string",
      "pool_multistatus": "string",
      "parent_application_id": "string",
      "translated_pool_lb_mode": "string"
    },
    {
      "application_fqdn": "string",
      "gslbserver_id": "string",
      "gslbserver_name": "string",
      "application_id": "string",
      "application_name": "string",
      "pool_affinity_session_time": "string",
      "pool_affinity_state": "string",
      "pool_best_active_nodes": "string",
      "pool_id": "string",
      "pool_inactive_nodes": "string",
      "pool_lb_mode": "string",
      "pool_name": "string",
      "pool_total_nodes": "string",
      "pool_type": "string",
      "pool_weight": "string",
      "pool_delayed_time": "string",
      "gslbserver_type": "string",
      "pool_multistatus": "string",
      "parent_application_id": "string",
      "translated_pool_lb_mode": "string"
    },
    {
      "application_fqdn": "string",
      "gslbserver_id": "string",
      "gslbserver_name": "string",
      "application_id": "string",
      "application_name": "string",
      "pool_affinity_session_time": "string",
      "pool_affinity_state": "string",
      "pool_best_active_nodes": "string",
      "pool_id": "string",
      "pool_inactive_nodes": "string",
      "pool_lb_mode": "string",
      "pool_name": "string",
      "pool_total_nodes": "string",
      "pool_type": "string",
      "pool_weight": "string",
      "pool_delayed_time": "string",
      "gslbserver_type": "string",
      "pool_multistatus": "string",
      "parent_application_id": "string",
      "translated_pool_lb_mode": "string"
    },
    {
      "application_fqdn": "string",
      "gslbserver_id": "string",
      "gslbserver_name": "string",
      "application_id": "string",
      "application_name": "string",
      "pool_affinity_session_time": "string",
      "pool_affinity_state": "string",
      "pool_best_active_nodes": "string",
      "pool_id": "string",
      "pool_inactive_nodes": "string",
      "pool_lb_mode": "string",
      "pool_name": "string",
      "pool_total_nodes": "string",
      "pool_type": "string",
      "pool_weight": "string",
      "pool_delayed_time": "string",
      "gslbserver_type": "string",
      "pool_multistatus": "string",
      "parent_application_id": "string",
      "translated_pool_lb_mode": "string"
    },
    {
      "application_fqdn": "string",
      "gslbserver_id": "string",
      "gslbserver_name": "string",
      "application_id": "string",
      "application_name": "string",
      "pool_affinity_session_time": "string",
      "pool_affinity_state": "string",
      "pool_best_active_nodes": "string",
      "pool_id": "string",
      "pool_inactive_nodes": "string",
      "pool_lb_mode": "string",
      "pool_name": "string",
      "pool_total_nodes": "string",
      "pool_type": "string",
      "pool_weight": "string",
      "pool_delayed_time": "string",
      "gslbserver_type": "string",
      "pool_multistatus": "string",
      "parent_application_id": "string",
      "translated_pool_lb_mode": "string"
    },
    {
      "application_fqdn": "string",
      "gslbserver_id": "string",
      "gslbserver_name": "string",
      "application_id": "string",
      "application_name": "string",
      "pool_affinity_session_time": "string",
      "pool_affinity_state": "string",
      "pool_best_active_nodes": "string",
      "pool_id": "string",
      "pool_inactive_nodes": "string",
      "pool_lb_mode": "string",
      "pool_name": "string",
      "pool_total_nodes": "string",
      "pool_type": "string",
      "pool_weight": "string",
      "pool_delayed_time": "string",
      "gslbserver_type": "string",
      "pool_multistatus": "string",
      "parent_application_id": "string",
      "translated_pool_lb_mode": "string"
    },
    {
      "application_fqdn": "string",
      "gslbserver_id": "string",
      "gslbserver_name": "string",
      "application_id": "string",
      "application_name": "string",
      "pool_affinity_session_time": "string",
      "pool_affinity_state": "string",
      "pool_best_active_nodes": "string",
      "pool_id": "string",
      "pool_inactive_nodes": "string",
      "pool_lb_mode": "string",
      "pool_name": "string",
      "pool_total_nodes": "string",
      "pool_type": "string",
      "pool_weight": "string",
      "pool_delayed_time": "string",
      "gslbserver_type": "string",
      "pool_multistatus": "string",
      "parent_application_id": "string",
      "translated_pool_lb_mode": "string"
    }
  ]
}