{
  "success": true,
  "messages": [
    {
      "code": 10,
      "msg": "string",
      "type": "notice",
      "extra": {}
    },
    {
      "code": 5,
      "msg": "string",
      "type": "warning",
      "extra": {}
    }
  ],
  "data": [
    {
      "count": 4
    },
    {
      "count": 7
    },
    {
      "count": 6
    },
    {
      "count": 1
    },
    {
      "count": 3
    },
    {
      "count": 6
    },
    {
      "count": 1
    },
    {
      "count": 3
    },
    {
      "count": 6
    }
  ]
}