{
  "success": true,
  "messages": [
    {
      "code": 1,
      "msg": "string",
      "type": "notice",
      "extra": {}
    },
    {
      "code": 1,
      "msg": "string",
      "type": "error",
      "extra": {}
    }
  ],
  "data": [
    {
      "static_id": "string",
      "lease_end_time": "string",
      "lease_id": "string",
      "free_end_address_addr": "string",
      "free_scope_size": "string",
      "free_start_address_addr": "string",
      "address_hostaddr": "string",
      "device_id": "string",
      "device_name": "string",
      "interface_id": "string",
      "interface_name": "string",
      "address_addr": "string",
      "address_alias": "string",
      "address_class_name": "string",
      "address_class_parameters": [
        {
          "name": "string",
          "value": "string",
          "inheritance": "inherited",
          "propagation": "propagate",
          "source": "string"
        },
        {
          "name": "string",
          "value": "string",
          "inheritance": "inherited",
          "propagation": "propagate",
          "source": "string"
        },
        {
          "name": "string",
          "value": "string",
          "inheritance": "inherited",
          "propagation": "restrict",
          "source": "string"
        },
        {
          "name": "string",
          "value": "string",
          "inheritance": "set",
          "propagation": "restrict",
          "source": "string"
        },
        {
          "name": "string",
          "value": "string",
          "inheritance": "inherited",
          "propagation": "propagate",
          "source": "string"
        },
        {
          "name": "string",
          "value": "string",
          "inheritance": "inherited",
          "propagation": "restrict",
          "source": "string"
        },
        {
          "name": "string",
          "value": "string",
          "inheritance": "inherited",
          "propagation": "restrict",
          "source": "string"
        },
        {
          "name": "string",
          "value": "string",
          "inheritance": "set",
          "propagation": "propagate",
          "source": "string"
        },
        {
          "name": "string",
          "value": "string",
          "inheritance": "inherited",
          "propagation": "propagate",
          "source": "string"
        },
        {
          "name": "string",
          "value": "string",
          "inheritance": "set",
          "propagation": "propagate",
          "source": "string"
        }
      ],
      "address_id": "string",
      "dev_id": "string",
      "dev_name": "string",
      "port_ifvlan": "string",
      "port_name": "string",
      "port_portnumber": "string",
      "port_slotnumber": "string",
      "address_mac_last_seen": "string",
      "network_lock_network_broadcast": "string",
      "address_mac_addr": "string",
      "address_multistatus": "string",
      "address_name": "string",
      "parent_network_class_name": "string",
      "parent_network_end_hostaddr": "string",
      "parent_network_end_address_addr": "string",
      "parent_network_id": "string",
      "parent_network_name": "string",
      "parent_network_size": "string",
      "parent_network_start_hostaddr": "string",
      "parent_network_start_address_addr": "string",
      "parent_vlsm_network_id": "string",
      "pool_class_name": "string",
      "pool_class_parameters": [
        {
          "name": "string",
          "value": "string",
          "inheritance": "inherited",
          "propagation": "restrict",
          "source": "string"
        },
        {
          "name": "string",
          "value": "string",
          "inheritance": "inherited",
          "propagation": "restrict",
          "source": "string"
        },
        {
          "name": "string",
          "value": "string",
          "inheritance": "inherited",
          "propagation": "propagate",
          "source": "string"
        },
        {
          "name": "string",
          "value": "string",
          "inheritance": "inherited",
          "propagation": "propagate",
          "source": "string"
        },
        {
          "name": "string",
          "value": "string",
          "inheritance": "inherited",
          "propagation": "propagate",
          "source": "string"
        }
      ],
      "pool_end_address_addr": "string",
      "pool_id": "string",
      "pool_name": "string",
      "pool_read_only": "string",
      "pool_size": "string",
      "pool_start_address_addr": "string",
      "space_class_name": "string",
      "space_class_parameters": [
        {
          "name": "string",
          "value": "string",
          "inheritance": "inherited",
          "propagation": "restrict",
          "source": "string"
        },
        {
          "name": "string",
          "value": "string",
          "inheritance": "set",
          "propagation": "propagate",
          "source": "string"
        },
        {
          "name": "string",
          "value": "string",
          "inheritance": "inherited",
          "propagation": "propagate",
          "source": "string"
        }
      ],
      "space_description": "string",
      "space_id": "string",
      "space_is_template": "string",
      "space_name": "string",
      "network_class_name": "string",
      "network_class_parameters": [
        {
          "name": "string",
          "value": "string",
          "inheritance": "set",
          "propagation": "propagate",
          "source": "string"
        },
        {
          "name": "string",
          "value": "string",
          "inheritance": "set",
          "propagation": "restrict",
          "source": "string"
        },
        {
          "name": "string",
          "value": "string",
          "inheritance": "inherited",
          "propagation": "propagate",
          "source": "string"
        },
        {
          "name": "string",
          "value": "string",
          "inheritance": "set",
          "propagation": "propagate",
          "source": "string"
        },
        {
          "name": "string",
          "value": "string",
          "inheritance": "set",
          "propagation": "restrict",
          "source": "string"
        },
        {
          "name": "string",
          "value": "string",
          "inheritance": "set",
          "propagation": "propagate",
          "source": "string"
        },
        {
          "name": "string",
          "value": "string",
          "inheritance": "set",
          "propagation": "propagate",
          "source": "string"
        },
        {
          "name": "string",
          "value": "string",
          "inheritance": "inherited",
          "propagation": "restrict",
          "source": "string"
        },
        {
          "name": "string",
          "value": "string",
          "inheritance": "set",
          "propagation": "restrict",
          "source": "string"
        },
        {
          "name": "string",
          "value": "string",
          "inheritance": "inherited",
          "propagation": "restrict",
          "source": "string"
        }
      ],
      "network_end_address_addr": "string",
      "network_id": "string",
      "network_is_terminal": "string",
      "network_name": "string",
      "network_size": "string",
      "network_start_address_addr": "string",
      "tag_pool_dhcprange": "string",
      "address_type": "string"
    },
    {
      "static_id": "string",
      "lease_end_time": "string",
      "lease_id": "string",
      "free_end_address_addr": "string",
      "free_scope_size": "string",
      "free_start_address_addr": "string",
      "address_hostaddr": "string",
      "device_id": "string",
      "device_name": "string",
      "interface_id": "string",
      "interface_name": "string",
      "address_addr": "string",
      "address_alias": "string",
      "address_class_name": "string",
      "address_class_parameters": [
        {
          "name": "string",
          "value": "string",
          "inheritance": "inherited",
          "propagation": "propagate",
          "source": "string"
        }
      ],
      "address_id": "string",
      "dev_id": "string",
      "dev_name": "string",
      "port_ifvlan": "string",
      "port_name": "string",
      "port_portnumber": "string",
      "port_slotnumber": "string",
      "address_mac_last_seen": "string",
      "network_lock_network_broadcast": "string",
      "address_mac_addr": "string",
      "address_multistatus": "string",
      "address_name": "string",
      "parent_network_class_name": "string",
      "parent_network_end_hostaddr": "string",
      "parent_network_end_address_addr": "string",
      "parent_network_id": "string",
      "parent_network_name": "string",
      "parent_network_size": "string",
      "parent_network_start_hostaddr": "string",
      "parent_network_start_address_addr": "string",
      "parent_vlsm_network_id": "string",
      "pool_class_name": "string",
      "pool_class_parameters": [
        {
          "name": "string",
          "value": "string",
          "inheritance": "inherited",
          "propagation": "propagate",
          "source": "string"
        },
        {
          "name": "string",
          "value": "string",
          "inheritance": "set",
          "propagation": "restrict",
          "source": "string"
        },
        {
          "name": "string",
          "value": "string",
          "inheritance": "inherited",
          "propagation": "restrict",
          "source": "string"
        },
        {
          "name": "string",
          "value": "string",
          "inheritance": "inherited",
          "propagation": "restrict",
          "source": "string"
        },
        {
          "name": "string",
          "value": "string",
          "inheritance": "inherited",
          "propagation": "propagate",
          "source": "string"
        },
        {
          "name": "string",
          "value": "string",
          "inheritance": "set",
          "propagation": "propagate",
          "source": "string"
        },
        {
          "name": "string",
          "value": "string",
          "inheritance": "inherited",
          "propagation": "restrict",
          "source": "string"
        }
      ],
      "pool_end_address_addr": "string",
      "pool_id": "string",
      "pool_name": "string",
      "pool_read_only": "string",
      "pool_size": "string",
      "pool_start_address_addr": "string",
      "space_class_name": "string",
      "space_class_parameters": [
        {
          "name": "string",
          "value": "string",
          "inheritance": "set",
          "propagation": "propagate",
          "source": "string"
        },
        {
          "name": "string",
          "value": "string",
          "inheritance": "inherited",
          "propagation": "propagate",
          "source": "string"
        },
        {
          "name": "string",
          "value": "string",
          "inheritance": "set",
          "propagation": "restrict",
          "source": "string"
        },
        {
          "name": "string",
          "value": "string",
          "inheritance": "set",
          "propagation": "restrict",
          "source": "string"
        },
        {
          "name": "string",
          "value": "string",
          "inheritance": "set",
          "propagation": "propagate",
          "source": "string"
        },
        {
          "name": "string",
          "value": "string",
          "inheritance": "set",
          "propagation": "restrict",
          "source": "string"
        }
      ],
      "space_description": "string",
      "space_id": "string",
      "space_is_template": "string",
      "space_name": "string",
      "network_class_name": "string",
      "network_class_parameters": [
        {
          "name": "string",
          "value": "string",
          "inheritance": "inherited",
          "propagation": "restrict",
          "source": "string"
        },
        {
          "name": "string",
          "value": "string",
          "inheritance": "inherited",
          "propagation": "propagate",
          "source": "string"
        },
        {
          "name": "string",
          "value": "string",
          "inheritance": "set",
          "propagation": "propagate",
          "source": "string"
        },
        {
          "name": "string",
          "value": "string",
          "inheritance": "inherited",
          "propagation": "restrict",
          "source": "string"
        },
        {
          "name": "string",
          "value": "string",
          "inheritance": "set",
          "propagation": "restrict",
          "source": "string"
        }
      ],
      "network_end_address_addr": "string",
      "network_id": "string",
      "network_is_terminal": "string",
      "network_name": "string",
      "network_size": "string",
      "network_start_address_addr": "string",
      "tag_pool_dhcprange": "string",
      "address_type": "string"
    },
    {
      "static_id": "string",
      "lease_end_time": "string",
      "lease_id": "string",
      "free_end_address_addr": "string",
      "free_scope_size": "string",
      "free_start_address_addr": "string",
      "address_hostaddr": "string",
      "device_id": "string",
      "device_name": "string",
      "interface_id": "string",
      "interface_name": "string",
      "address_addr": "string",
      "address_alias": "string",
      "address_class_name": "string",
      "address_class_parameters": [
        {
          "name": "string",
          "value": "string",
          "inheritance": "inherited",
          "propagation": "propagate",
          "source": "string"
        },
        {
          "name": "string",
          "value": "string",
          "inheritance": "set",
          "propagation": "propagate",
          "source": "string"
        },
        {
          "name": "string",
          "value": "string",
          "inheritance": "inherited",
          "propagation": "propagate",
          "source": "string"
        },
        {
          "name": "string",
          "value": "string",
          "inheritance": "set",
          "propagation": "restrict",
          "source": "string"
        },
        {
          "name": "string",
          "value": "string",
          "inheritance": "set",
          "propagation": "propagate",
          "source": "string"
        },
        {
          "name": "string",
          "value": "string",
          "inheritance": "set",
          "propagation": "restrict",
          "source": "string"
        }
      ],
      "address_id": "string",
      "dev_id": "string",
      "dev_name": "string",
      "port_ifvlan": "string",
      "port_name": "string",
      "port_portnumber": "string",
      "port_slotnumber": "string",
      "address_mac_last_seen": "string",
      "network_lock_network_broadcast": "string",
      "address_mac_addr": "string",
      "address_multistatus": "string",
      "address_name": "string",
      "parent_network_class_name": "string",
      "parent_network_end_hostaddr": "string",
      "parent_network_end_address_addr": "string",
      "parent_network_id": "string",
      "parent_network_name": "string",
      "parent_network_size": "string",
      "parent_network_start_hostaddr": "string",
      "parent_network_start_address_addr": "string",
      "parent_vlsm_network_id": "string",
      "pool_class_name": "string",
      "pool_class_parameters": [
        {
          "name": "string",
          "value": "string",
          "inheritance": "inherited",
          "propagation": "propagate",
          "source": "string"
        },
        {
          "name": "string",
          "value": "string",
          "inheritance": "set",
          "propagation": "propagate",
          "source": "string"
        },
        {
          "name": "string",
          "value": "string",
          "inheritance": "set",
          "propagation": "propagate",
          "source": "string"
        },
        {
          "name": "string",
          "value": "string",
          "inheritance": "set",
          "propagation": "propagate",
          "source": "string"
        },
        {
          "name": "string",
          "value": "string",
          "inheritance": "set",
          "propagation": "restrict",
          "source": "string"
        },
        {
          "name": "string",
          "value": "string",
          "inheritance": "inherited",
          "propagation": "restrict",
          "source": "string"
        },
        {
          "name": "string",
          "value": "string",
          "inheritance": "inherited",
          "propagation": "restrict",
          "source": "string"
        }
      ],
      "pool_end_address_addr": "string",
      "pool_id": "string",
      "pool_name": "string",
      "pool_read_only": "string",
      "pool_size": "string",
      "pool_start_address_addr": "string",
      "space_class_name": "string",
      "space_class_parameters": [
        {
          "name": "string",
          "value": "string",
          "inheritance": "set",
          "propagation": "propagate",
          "source": "string"
        },
        {
          "name": "string",
          "value": "string",
          "inheritance": "inherited",
          "propagation": "restrict",
          "source": "string"
        },
        {
          "name": "string",
          "value": "string",
          "inheritance": "inherited",
          "propagation": "propagate",
          "source": "string"
        },
        {
          "name": "string",
          "value": "string",
          "inheritance": "inherited",
          "propagation": "propagate",
          "source": "string"
        },
        {
          "name": "string",
          "value": "string",
          "inheritance": "inherited",
          "propagation": "propagate",
          "source": "string"
        },
        {
          "name": "string",
          "value": "string",
          "inheritance": "set",
          "propagation": "propagate",
          "source": "string"
        },
        {
          "name": "string",
          "value": "string",
          "inheritance": "inherited",
          "propagation": "propagate",
          "source": "string"
        },
        {
          "name": "string",
          "value": "string",
          "inheritance": "set",
          "propagation": "propagate",
          "source": "string"
        },
        {
          "name": "string",
          "value": "string",
          "inheritance": "set",
          "propagation": "restrict",
          "source": "string"
        }
      ],
      "space_description": "string",
      "space_id": "string",
      "space_is_template": "string",
      "space_name": "string",
      "network_class_name": "string",
      "network_class_parameters": [
        {
          "name": "string",
          "value": "string",
          "inheritance": "inherited",
          "propagation": "propagate",
          "source": "string"
        },
        {
          "name": "string",
          "value": "string",
          "inheritance": "inherited",
          "propagation": "restrict",
          "source": "string"
        },
        {
          "name": "string",
          "value": "string",
          "inheritance": "inherited",
          "propagation": "propagate",
          "source": "string"
        }
      ],
      "network_end_address_addr": "string",
      "network_id": "string",
      "network_is_terminal": "string",
      "network_name": "string",
      "network_size": "string",
      "network_start_address_addr": "string",
      "tag_pool_dhcprange": "string",
      "address_type": "string"
    },
    {
      "static_id": "string",
      "lease_end_time": "string",
      "lease_id": "string",
      "free_end_address_addr": "string",
      "free_scope_size": "string",
      "free_start_address_addr": "string",
      "address_hostaddr": "string",
      "device_id": "string",
      "device_name": "string",
      "interface_id": "string",
      "interface_name": "string",
      "address_addr": "string",
      "address_alias": "string",
      "address_class_name": "string",
      "address_class_parameters": [
        {
          "name": "string",
          "value": "string",
          "inheritance": "inherited",
          "propagation": "restrict",
          "source": "string"
        },
        {
          "name": "string",
          "value": "string",
          "inheritance": "inherited",
          "propagation": "propagate",
          "source": "string"
        },
        {
          "name": "string",
          "value": "string",
          "inheritance": "set",
          "propagation": "propagate",
          "source": "string"
        },
        {
          "name": "string",
          "value": "string",
          "inheritance": "set",
          "propagation": "restrict",
          "source": "string"
        },
        {
          "name": "string",
          "value": "string",
          "inheritance": "inherited",
          "propagation": "restrict",
          "source": "string"
        },
        {
          "name": "string",
          "value": "string",
          "inheritance": "inherited",
          "propagation": "propagate",
          "source": "string"
        }
      ],
      "address_id": "string",
      "dev_id": "string",
      "dev_name": "string",
      "port_ifvlan": "string",
      "port_name": "string",
      "port_portnumber": "string",
      "port_slotnumber": "string",
      "address_mac_last_seen": "string",
      "network_lock_network_broadcast": "string",
      "address_mac_addr": "string",
      "address_multistatus": "string",
      "address_name": "string",
      "parent_network_class_name": "string",
      "parent_network_end_hostaddr": "string",
      "parent_network_end_address_addr": "string",
      "parent_network_id": "string",
      "parent_network_name": "string",
      "parent_network_size": "string",
      "parent_network_start_hostaddr": "string",
      "parent_network_start_address_addr": "string",
      "parent_vlsm_network_id": "string",
      "pool_class_name": "string",
      "pool_class_parameters": [
        {
          "name": "string",
          "value": "string",
          "inheritance": "set",
          "propagation": "propagate",
          "source": "string"
        },
        {
          "name": "string",
          "value": "string",
          "inheritance": "inherited",
          "propagation": "propagate",
          "source": "string"
        }
      ],
      "pool_end_address_addr": "string",
      "pool_id": "string",
      "pool_name": "string",
      "pool_read_only": "string",
      "pool_size": "string",
      "pool_start_address_addr": "string",
      "space_class_name": "string",
      "space_class_parameters": [
        {
          "name": "string",
          "value": "string",
          "inheritance": "set",
          "propagation": "propagate",
          "source": "string"
        }
      ],
      "space_description": "string",
      "space_id": "string",
      "space_is_template": "string",
      "space_name": "string",
      "network_class_name": "string",
      "network_class_parameters": [
        {
          "name": "string",
          "value": "string",
          "inheritance": "set",
          "propagation": "propagate",
          "source": "string"
        }
      ],
      "network_end_address_addr": "string",
      "network_id": "string",
      "network_is_terminal": "string",
      "network_name": "string",
      "network_size": "string",
      "network_start_address_addr": "string",
      "tag_pool_dhcprange": "string",
      "address_type": "string"
    },
    {
      "static_id": "string",
      "lease_end_time": "string",
      "lease_id": "string",
      "free_end_address_addr": "string",
      "free_scope_size": "string",
      "free_start_address_addr": "string",
      "address_hostaddr": "string",
      "device_id": "string",
      "device_name": "string",
      "interface_id": "string",
      "interface_name": "string",
      "address_addr": "string",
      "address_alias": "string",
      "address_class_name": "string",
      "address_class_parameters": [
        {
          "name": "string",
          "value": "string",
          "inheritance": "set",
          "propagation": "propagate",
          "source": "string"
        },
        {
          "name": "string",
          "value": "string",
          "inheritance": "set",
          "propagation": "restrict",
          "source": "string"
        }
      ],
      "address_id": "string",
      "dev_id": "string",
      "dev_name": "string",
      "port_ifvlan": "string",
      "port_name": "string",
      "port_portnumber": "string",
      "port_slotnumber": "string",
      "address_mac_last_seen": "string",
      "network_lock_network_broadcast": "string",
      "address_mac_addr": "string",
      "address_multistatus": "string",
      "address_name": "string",
      "parent_network_class_name": "string",
      "parent_network_end_hostaddr": "string",
      "parent_network_end_address_addr": "string",
      "parent_network_id": "string",
      "parent_network_name": "string",
      "parent_network_size": "string",
      "parent_network_start_hostaddr": "string",
      "parent_network_start_address_addr": "string",
      "parent_vlsm_network_id": "string",
      "pool_class_name": "string",
      "pool_class_parameters": [
        {
          "name": "string",
          "value": "string",
          "inheritance": "inherited",
          "propagation": "propagate",
          "source": "string"
        },
        {
          "name": "string",
          "value": "string",
          "inheritance": "set",
          "propagation": "restrict",
          "source": "string"
        },
        {
          "name": "string",
          "value": "string",
          "inheritance": "inherited",
          "propagation": "restrict",
          "source": "string"
        }
      ],
      "pool_end_address_addr": "string",
      "pool_id": "string",
      "pool_name": "string",
      "pool_read_only": "string",
      "pool_size": "string",
      "pool_start_address_addr": "string",
      "space_class_name": "string",
      "space_class_parameters": [
        {
          "name": "string",
          "value": "string",
          "inheritance": "set",
          "propagation": "restrict",
          "source": "string"
        },
        {
          "name": "string",
          "value": "string",
          "inheritance": "inherited",
          "propagation": "restrict",
          "source": "string"
        },
        {
          "name": "string",
          "value": "string",
          "inheritance": "inherited",
          "propagation": "propagate",
          "source": "string"
        }
      ],
      "space_description": "string",
      "space_id": "string",
      "space_is_template": "string",
      "space_name": "string",
      "network_class_name": "string",
      "network_class_parameters": [
        {
          "name": "string",
          "value": "string",
          "inheritance": "set",
          "propagation": "restrict",
          "source": "string"
        },
        {
          "name": "string",
          "value": "string",
          "inheritance": "inherited",
          "propagation": "propagate",
          "source": "string"
        },
        {
          "name": "string",
          "value": "string",
          "inheritance": "set",
          "propagation": "propagate",
          "source": "string"
        },
        {
          "name": "string",
          "value": "string",
          "inheritance": "inherited",
          "propagation": "propagate",
          "source": "string"
        }
      ],
      "network_end_address_addr": "string",
      "network_id": "string",
      "network_is_terminal": "string",
      "network_name": "string",
      "network_size": "string",
      "network_start_address_addr": "string",
      "tag_pool_dhcprange": "string",
      "address_type": "string"
    },
    {
      "static_id": "string",
      "lease_end_time": "string",
      "lease_id": "string",
      "free_end_address_addr": "string",
      "free_scope_size": "string",
      "free_start_address_addr": "string",
      "address_hostaddr": "string",
      "device_id": "string",
      "device_name": "string",
      "interface_id": "string",
      "interface_name": "string",
      "address_addr": "string",
      "address_alias": "string",
      "address_class_name": "string",
      "address_class_parameters": [
        {
          "name": "string",
          "value": "string",
          "inheritance": "set",
          "propagation": "propagate",
          "source": "string"
        },
        {
          "name": "string",
          "value": "string",
          "inheritance": "set",
          "propagation": "restrict",
          "source": "string"
        },
        {
          "name": "string",
          "value": "string",
          "inheritance": "inherited",
          "propagation": "restrict",
          "source": "string"
        },
        {
          "name": "string",
          "value": "string",
          "inheritance": "set",
          "propagation": "restrict",
          "source": "string"
        }
      ],
      "address_id": "string",
      "dev_id": "string",
      "dev_name": "string",
      "port_ifvlan": "string",
      "port_name": "string",
      "port_portnumber": "string",
      "port_slotnumber": "string",
      "address_mac_last_seen": "string",
      "network_lock_network_broadcast": "string",
      "address_mac_addr": "string",
      "address_multistatus": "string",
      "address_name": "string",
      "parent_network_class_name": "string",
      "parent_network_end_hostaddr": "string",
      "parent_network_end_address_addr": "string",
      "parent_network_id": "string",
      "parent_network_name": "string",
      "parent_network_size": "string",
      "parent_network_start_hostaddr": "string",
      "parent_network_start_address_addr": "string",
      "parent_vlsm_network_id": "string",
      "pool_class_name": "string",
      "pool_class_parameters": [
        {
          "name": "string",
          "value": "string",
          "inheritance": "inherited",
          "propagation": "propagate",
          "source": "string"
        },
        {
          "name": "string",
          "value": "string",
          "inheritance": "set",
          "propagation": "restrict",
          "source": "string"
        },
        {
          "name": "string",
          "value": "string",
          "inheritance": "set",
          "propagation": "propagate",
          "source": "string"
        },
        {
          "name": "string",
          "value": "string",
          "inheritance": "set",
          "propagation": "propagate",
          "source": "string"
        },
        {
          "name": "string",
          "value": "string",
          "inheritance": "set",
          "propagation": "propagate",
          "source": "string"
        },
        {
          "name": "string",
          "value": "string",
          "inheritance": "inherited",
          "propagation": "restrict",
          "source": "string"
        }
      ],
      "pool_end_address_addr": "string",
      "pool_id": "string",
      "pool_name": "string",
      "pool_read_only": "string",
      "pool_size": "string",
      "pool_start_address_addr": "string",
      "space_class_name": "string",
      "space_class_parameters": [
        {
          "name": "string",
          "value": "string",
          "inheritance": "inherited",
          "propagation": "propagate",
          "source": "string"
        },
        {
          "name": "string",
          "value": "string",
          "inheritance": "inherited",
          "propagation": "restrict",
          "source": "string"
        },
        {
          "name": "string",
          "value": "string",
          "inheritance": "inherited",
          "propagation": "restrict",
          "source": "string"
        },
        {
          "name": "string",
          "value": "string",
          "inheritance": "set",
          "propagation": "propagate",
          "source": "string"
        },
        {
          "name": "string",
          "value": "string",
          "inheritance": "inherited",
          "propagation": "propagate",
          "source": "string"
        },
        {
          "name": "string",
          "value": "string",
          "inheritance": "set",
          "propagation": "restrict",
          "source": "string"
        },
        {
          "name": "string",
          "value": "string",
          "inheritance": "set",
          "propagation": "propagate",
          "source": "string"
        },
        {
          "name": "string",
          "value": "string",
          "inheritance": "set",
          "propagation": "propagate",
          "source": "string"
        }
      ],
      "space_description": "string",
      "space_id": "string",
      "space_is_template": "string",
      "space_name": "string",
      "network_class_name": "string",
      "network_class_parameters": [
        {
          "name": "string",
          "value": "string",
          "inheritance": "set",
          "propagation": "restrict",
          "source": "string"
        },
        {
          "name": "string",
          "value": "string",
          "inheritance": "set",
          "propagation": "propagate",
          "source": "string"
        },
        {
          "name": "string",
          "value": "string",
          "inheritance": "inherited",
          "propagation": "restrict",
          "source": "string"
        }
      ],
      "network_end_address_addr": "string",
      "network_id": "string",
      "network_is_terminal": "string",
      "network_name": "string",
      "network_size": "string",
      "network_start_address_addr": "string",
      "tag_pool_dhcprange": "string",
      "address_type": "string"
    },
    {
      "static_id": "string",
      "lease_end_time": "string",
      "lease_id": "string",
      "free_end_address_addr": "string",
      "free_scope_size": "string",
      "free_start_address_addr": "string",
      "address_hostaddr": "string",
      "device_id": "string",
      "device_name": "string",
      "interface_id": "string",
      "interface_name": "string",
      "address_addr": "string",
      "address_alias": "string",
      "address_class_name": "string",
      "address_class_parameters": [
        {
          "name": "string",
          "value": "string",
          "inheritance": "inherited",
          "propagation": "restrict",
          "source": "string"
        },
        {
          "name": "string",
          "value": "string",
          "inheritance": "inherited",
          "propagation": "restrict",
          "source": "string"
        },
        {
          "name": "string",
          "value": "string",
          "inheritance": "inherited",
          "propagation": "restrict",
          "source": "string"
        }
      ],
      "address_id": "string",
      "dev_id": "string",
      "dev_name": "string",
      "port_ifvlan": "string",
      "port_name": "string",
      "port_portnumber": "string",
      "port_slotnumber": "string",
      "address_mac_last_seen": "string",
      "network_lock_network_broadcast": "string",
      "address_mac_addr": "string",
      "address_multistatus": "string",
      "address_name": "string",
      "parent_network_class_name": "string",
      "parent_network_end_hostaddr": "string",
      "parent_network_end_address_addr": "string",
      "parent_network_id": "string",
      "parent_network_name": "string",
      "parent_network_size": "string",
      "parent_network_start_hostaddr": "string",
      "parent_network_start_address_addr": "string",
      "parent_vlsm_network_id": "string",
      "pool_class_name": "string",
      "pool_class_parameters": [
        {
          "name": "string",
          "value": "string",
          "inheritance": "set",
          "propagation": "restrict",
          "source": "string"
        },
        {
          "name": "string",
          "value": "string",
          "inheritance": "inherited",
          "propagation": "propagate",
          "source": "string"
        },
        {
          "name": "string",
          "value": "string",
          "inheritance": "set",
          "propagation": "restrict",
          "source": "string"
        },
        {
          "name": "string",
          "value": "string",
          "inheritance": "set",
          "propagation": "propagate",
          "source": "string"
        },
        {
          "name": "string",
          "value": "string",
          "inheritance": "set",
          "propagation": "restrict",
          "source": "string"
        }
      ],
      "pool_end_address_addr": "string",
      "pool_id": "string",
      "pool_name": "string",
      "pool_read_only": "string",
      "pool_size": "string",
      "pool_start_address_addr": "string",
      "space_class_name": "string",
      "space_class_parameters": [
        {
          "name": "string",
          "value": "string",
          "inheritance": "inherited",
          "propagation": "propagate",
          "source": "string"
        },
        {
          "name": "string",
          "value": "string",
          "inheritance": "inherited",
          "propagation": "restrict",
          "source": "string"
        },
        {
          "name": "string",
          "value": "string",
          "inheritance": "inherited",
          "propagation": "propagate",
          "source": "string"
        },
        {
          "name": "string",
          "value": "string",
          "inheritance": "set",
          "propagation": "propagate",
          "source": "string"
        },
        {
          "name": "string",
          "value": "string",
          "inheritance": "set",
          "propagation": "propagate",
          "source": "string"
        }
      ],
      "space_description": "string",
      "space_id": "string",
      "space_is_template": "string",
      "space_name": "string",
      "network_class_name": "string",
      "network_class_parameters": [
        {
          "name": "string",
          "value": "string",
          "inheritance": "set",
          "propagation": "restrict",
          "source": "string"
        },
        {
          "name": "string",
          "value": "string",
          "inheritance": "inherited",
          "propagation": "restrict",
          "source": "string"
        },
        {
          "name": "string",
          "value": "string",
          "inheritance": "inherited",
          "propagation": "propagate",
          "source": "string"
        },
        {
          "name": "string",
          "value": "string",
          "inheritance": "set",
          "propagation": "propagate",
          "source": "string"
        },
        {
          "name": "string",
          "value": "string",
          "inheritance": "inherited",
          "propagation": "propagate",
          "source": "string"
        },
        {
          "name": "string",
          "value": "string",
          "inheritance": "set",
          "propagation": "restrict",
          "source": "string"
        }
      ],
      "network_end_address_addr": "string",
      "network_id": "string",
      "network_is_terminal": "string",
      "network_name": "string",
      "network_size": "string",
      "network_start_address_addr": "string",
      "tag_pool_dhcprange": "string",
      "address_type": "string"
    },
    {
      "static_id": "string",
      "lease_end_time": "string",
      "lease_id": "string",
      "free_end_address_addr": "string",
      "free_scope_size": "string",
      "free_start_address_addr": "string",
      "address_hostaddr": "string",
      "device_id": "string",
      "device_name": "string",
      "interface_id": "string",
      "interface_name": "string",
      "address_addr": "string",
      "address_alias": "string",
      "address_class_name": "string",
      "address_class_parameters": [
        {
          "name": "string",
          "value": "string",
          "inheritance": "inherited",
          "propagation": "restrict",
          "source": "string"
        }
      ],
      "address_id": "string",
      "dev_id": "string",
      "dev_name": "string",
      "port_ifvlan": "string",
      "port_name": "string",
      "port_portnumber": "string",
      "port_slotnumber": "string",
      "address_mac_last_seen": "string",
      "network_lock_network_broadcast": "string",
      "address_mac_addr": "string",
      "address_multistatus": "string",
      "address_name": "string",
      "parent_network_class_name": "string",
      "parent_network_end_hostaddr": "string",
      "parent_network_end_address_addr": "string",
      "parent_network_id": "string",
      "parent_network_name": "string",
      "parent_network_size": "string",
      "parent_network_start_hostaddr": "string",
      "parent_network_start_address_addr": "string",
      "parent_vlsm_network_id": "string",
      "pool_class_name": "string",
      "pool_class_parameters": [
        {
          "name": "string",
          "value": "string",
          "inheritance": "set",
          "propagation": "restrict",
          "source": "string"
        },
        {
          "name": "string",
          "value": "string",
          "inheritance": "set",
          "propagation": "restrict",
          "source": "string"
        },
        {
          "name": "string",
          "value": "string",
          "inheritance": "set",
          "propagation": "restrict",
          "source": "string"
        },
        {
          "name": "string",
          "value": "string",
          "inheritance": "set",
          "propagation": "restrict",
          "source": "string"
        },
        {
          "name": "string",
          "value": "string",
          "inheritance": "set",
          "propagation": "restrict",
          "source": "string"
        }
      ],
      "pool_end_address_addr": "string",
      "pool_id": "string",
      "pool_name": "string",
      "pool_read_only": "string",
      "pool_size": "string",
      "pool_start_address_addr": "string",
      "space_class_name": "string",
      "space_class_parameters": [
        {
          "name": "string",
          "value": "string",
          "inheritance": "set",
          "propagation": "restrict",
          "source": "string"
        },
        {
          "name": "string",
          "value": "string",
          "inheritance": "set",
          "propagation": "restrict",
          "source": "string"
        },
        {
          "name": "string",
          "value": "string",
          "inheritance": "set",
          "propagation": "restrict",
          "source": "string"
        },
        {
          "name": "string",
          "value": "string",
          "inheritance": "set",
          "propagation": "restrict",
          "source": "string"
        },
        {
          "name": "string",
          "value": "string",
          "inheritance": "inherited",
          "propagation": "restrict",
          "source": "string"
        }
      ],
      "space_description": "string",
      "space_id": "string",
      "space_is_template": "string",
      "space_name": "string",
      "network_class_name": "string",
      "network_class_parameters": [
        {
          "name": "string",
          "value": "string",
          "inheritance": "set",
          "propagation": "propagate",
          "source": "string"
        },
        {
          "name": "string",
          "value": "string",
          "inheritance": "inherited",
          "propagation": "propagate",
          "source": "string"
        },
        {
          "name": "string",
          "value": "string",
          "inheritance": "set",
          "propagation": "propagate",
          "source": "string"
        },
        {
          "name": "string",
          "value": "string",
          "inheritance": "set",
          "propagation": "propagate",
          "source": "string"
        },
        {
          "name": "string",
          "value": "string",
          "inheritance": "set",
          "propagation": "propagate",
          "source": "string"
        },
        {
          "name": "string",
          "value": "string",
          "inheritance": "set",
          "propagation": "restrict",
          "source": "string"
        },
        {
          "name": "string",
          "value": "string",
          "inheritance": "inherited",
          "propagation": "propagate",
          "source": "string"
        },
        {
          "name": "string",
          "value": "string",
          "inheritance": "inherited",
          "propagation": "propagate",
          "source": "string"
        },
        {
          "name": "string",
          "value": "string",
          "inheritance": "inherited",
          "propagation": "propagate",
          "source": "string"
        }
      ],
      "network_end_address_addr": "string",
      "network_id": "string",
      "network_is_terminal": "string",
      "network_name": "string",
      "network_size": "string",
      "network_start_address_addr": "string",
      "tag_pool_dhcprange": "string",
      "address_type": "string"
    },
    {
      "static_id": "string",
      "lease_end_time": "string",
      "lease_id": "string",
      "free_end_address_addr": "string",
      "free_scope_size": "string",
      "free_start_address_addr": "string",
      "address_hostaddr": "string",
      "device_id": "string",
      "device_name": "string",
      "interface_id": "string",
      "interface_name": "string",
      "address_addr": "string",
      "address_alias": "string",
      "address_class_name": "string",
      "address_class_parameters": [
        {
          "name": "string",
          "value": "string",
          "inheritance": "set",
          "propagation": "propagate",
          "source": "string"
        },
        {
          "name": "string",
          "value": "string",
          "inheritance": "set",
          "propagation": "restrict",
          "source": "string"
        },
        {
          "name": "string",
          "value": "string",
          "inheritance": "inherited",
          "propagation": "propagate",
          "source": "string"
        },
        {
          "name": "string",
          "value": "string",
          "inheritance": "set",
          "propagation": "restrict",
          "source": "string"
        }
      ],
      "address_id": "string",
      "dev_id": "string",
      "dev_name": "string",
      "port_ifvlan": "string",
      "port_name": "string",
      "port_portnumber": "string",
      "port_slotnumber": "string",
      "address_mac_last_seen": "string",
      "network_lock_network_broadcast": "string",
      "address_mac_addr": "string",
      "address_multistatus": "string",
      "address_name": "string",
      "parent_network_class_name": "string",
      "parent_network_end_hostaddr": "string",
      "parent_network_end_address_addr": "string",
      "parent_network_id": "string",
      "parent_network_name": "string",
      "parent_network_size": "string",
      "parent_network_start_hostaddr": "string",
      "parent_network_start_address_addr": "string",
      "parent_vlsm_network_id": "string",
      "pool_class_name": "string",
      "pool_class_parameters": [
        {
          "name": "string",
          "value": "string",
          "inheritance": "inherited",
          "propagation": "restrict",
          "source": "string"
        },
        {
          "name": "string",
          "value": "string",
          "inheritance": "inherited",
          "propagation": "propagate",
          "source": "string"
        },
        {
          "name": "string",
          "value": "string",
          "inheritance": "set",
          "propagation": "restrict",
          "source": "string"
        },
        {
          "name": "string",
          "value": "string",
          "inheritance": "inherited",
          "propagation": "propagate",
          "source": "string"
        },
        {
          "name": "string",
          "value": "string",
          "inheritance": "inherited",
          "propagation": "restrict",
          "source": "string"
        },
        {
          "name": "string",
          "value": "string",
          "inheritance": "set",
          "propagation": "restrict",
          "source": "string"
        },
        {
          "name": "string",
          "value": "string",
          "inheritance": "inherited",
          "propagation": "propagate",
          "source": "string"
        },
        {
          "name": "string",
          "value": "string",
          "inheritance": "inherited",
          "propagation": "propagate",
          "source": "string"
        },
        {
          "name": "string",
          "value": "string",
          "inheritance": "set",
          "propagation": "propagate",
          "source": "string"
        },
        {
          "name": "string",
          "value": "string",
          "inheritance": "set",
          "propagation": "restrict",
          "source": "string"
        }
      ],
      "pool_end_address_addr": "string",
      "pool_id": "string",
      "pool_name": "string",
      "pool_read_only": "string",
      "pool_size": "string",
      "pool_start_address_addr": "string",
      "space_class_name": "string",
      "space_class_parameters": [
        {
          "name": "string",
          "value": "string",
          "inheritance": "inherited",
          "propagation": "restrict",
          "source": "string"
        },
        {
          "name": "string",
          "value": "string",
          "inheritance": "set",
          "propagation": "restrict",
          "source": "string"
        },
        {
          "name": "string",
          "value": "string",
          "inheritance": "set",
          "propagation": "propagate",
          "source": "string"
        },
        {
          "name": "string",
          "value": "string",
          "inheritance": "inherited",
          "propagation": "restrict",
          "source": "string"
        }
      ],
      "space_description": "string",
      "space_id": "string",
      "space_is_template": "string",
      "space_name": "string",
      "network_class_name": "string",
      "network_class_parameters": [
        {
          "name": "string",
          "value": "string",
          "inheritance": "inherited",
          "propagation": "propagate",
          "source": "string"
        },
        {
          "name": "string",
          "value": "string",
          "inheritance": "set",
          "propagation": "restrict",
          "source": "string"
        },
        {
          "name": "string",
          "value": "string",
          "inheritance": "set",
          "propagation": "restrict",
          "source": "string"
        },
        {
          "name": "string",
          "value": "string",
          "inheritance": "set",
          "propagation": "restrict",
          "source": "string"
        },
        {
          "name": "string",
          "value": "string",
          "inheritance": "set",
          "propagation": "propagate",
          "source": "string"
        },
        {
          "name": "string",
          "value": "string",
          "inheritance": "set",
          "propagation": "propagate",
          "source": "string"
        },
        {
          "name": "string",
          "value": "string",
          "inheritance": "set",
          "propagation": "restrict",
          "source": "string"
        },
        {
          "name": "string",
          "value": "string",
          "inheritance": "inherited",
          "propagation": "restrict",
          "source": "string"
        },
        {
          "name": "string",
          "value": "string",
          "inheritance": "inherited",
          "propagation": "propagate",
          "source": "string"
        }
      ],
      "network_end_address_addr": "string",
      "network_id": "string",
      "network_is_terminal": "string",
      "network_name": "string",
      "network_size": "string",
      "network_start_address_addr": "string",
      "tag_pool_dhcprange": "string",
      "address_type": "string"
    },
    {
      "static_id": "string",
      "lease_end_time": "string",
      "lease_id": "string",
      "free_end_address_addr": "string",
      "free_scope_size": "string",
      "free_start_address_addr": "string",
      "address_hostaddr": "string",
      "device_id": "string",
      "device_name": "string",
      "interface_id": "string",
      "interface_name": "string",
      "address_addr": "string",
      "address_alias": "string",
      "address_class_name": "string",
      "address_class_parameters": [
        {
          "name": "string",
          "value": "string",
          "inheritance": "set",
          "propagation": "restrict",
          "source": "string"
        },
        {
          "name": "string",
          "value": "string",
          "inheritance": "inherited",
          "propagation": "propagate",
          "source": "string"
        },
        {
          "name": "string",
          "value": "string",
          "inheritance": "inherited",
          "propagation": "propagate",
          "source": "string"
        },
        {
          "name": "string",
          "value": "string",
          "inheritance": "set",
          "propagation": "restrict",
          "source": "string"
        }
      ],
      "address_id": "string",
      "dev_id": "string",
      "dev_name": "string",
      "port_ifvlan": "string",
      "port_name": "string",
      "port_portnumber": "string",
      "port_slotnumber": "string",
      "address_mac_last_seen": "string",
      "network_lock_network_broadcast": "string",
      "address_mac_addr": "string",
      "address_multistatus": "string",
      "address_name": "string",
      "parent_network_class_name": "string",
      "parent_network_end_hostaddr": "string",
      "parent_network_end_address_addr": "string",
      "parent_network_id": "string",
      "parent_network_name": "string",
      "parent_network_size": "string",
      "parent_network_start_hostaddr": "string",
      "parent_network_start_address_addr": "string",
      "parent_vlsm_network_id": "string",
      "pool_class_name": "string",
      "pool_class_parameters": [
        {
          "name": "string",
          "value": "string",
          "inheritance": "inherited",
          "propagation": "restrict",
          "source": "string"
        },
        {
          "name": "string",
          "value": "string",
          "inheritance": "inherited",
          "propagation": "propagate",
          "source": "string"
        },
        {
          "name": "string",
          "value": "string",
          "inheritance": "set",
          "propagation": "restrict",
          "source": "string"
        }
      ],
      "pool_end_address_addr": "string",
      "pool_id": "string",
      "pool_name": "string",
      "pool_read_only": "string",
      "pool_size": "string",
      "pool_start_address_addr": "string",
      "space_class_name": "string",
      "space_class_parameters": [
        {
          "name": "string",
          "value": "string",
          "inheritance": "inherited",
          "propagation": "propagate",
          "source": "string"
        },
        {
          "name": "string",
          "value": "string",
          "inheritance": "set",
          "propagation": "propagate",
          "source": "string"
        },
        {
          "name": "string",
          "value": "string",
          "inheritance": "set",
          "propagation": "restrict",
          "source": "string"
        },
        {
          "name": "string",
          "value": "string",
          "inheritance": "inherited",
          "propagation": "propagate",
          "source": "string"
        },
        {
          "name": "string",
          "value": "string",
          "inheritance": "set",
          "propagation": "restrict",
          "source": "string"
        },
        {
          "name": "string",
          "value": "string",
          "inheritance": "inherited",
          "propagation": "propagate",
          "source": "string"
        },
        {
          "name": "string",
          "value": "string",
          "inheritance": "inherited",
          "propagation": "restrict",
          "source": "string"
        }
      ],
      "space_description": "string",
      "space_id": "string",
      "space_is_template": "string",
      "space_name": "string",
      "network_class_name": "string",
      "network_class_parameters": [
        {
          "name": "string",
          "value": "string",
          "inheritance": "set",
          "propagation": "propagate",
          "source": "string"
        },
        {
          "name": "string",
          "value": "string",
          "inheritance": "inherited",
          "propagation": "propagate",
          "source": "string"
        },
        {
          "name": "string",
          "value": "string",
          "inheritance": "set",
          "propagation": "restrict",
          "source": "string"
        },
        {
          "name": "string",
          "value": "string",
          "inheritance": "inherited",
          "propagation": "restrict",
          "source": "string"
        },
        {
          "name": "string",
          "value": "string",
          "inheritance": "set",
          "propagation": "propagate",
          "source": "string"
        },
        {
          "name": "string",
          "value": "string",
          "inheritance": "set",
          "propagation": "propagate",
          "source": "string"
        },
        {
          "name": "string",
          "value": "string",
          "inheritance": "set",
          "propagation": "propagate",
          "source": "string"
        },
        {
          "name": "string",
          "value": "string",
          "inheritance": "set",
          "propagation": "propagate",
          "source": "string"
        },
        {
          "name": "string",
          "value": "string",
          "inheritance": "inherited",
          "propagation": "restrict",
          "source": "string"
        }
      ],
      "network_end_address_addr": "string",
      "network_id": "string",
      "network_is_terminal": "string",
      "network_name": "string",
      "network_size": "string",
      "network_start_address_addr": "string",
      "tag_pool_dhcprange": "string",
      "address_type": "string"
    }
  ]
}