{
  "success": true,
  "messages": [
    {
      "code": 8,
      "msg": "string",
      "type": "notice",
      "extra": {}
    },
    {
      "code": 10,
      "msg": "string",
      "type": "error",
      "extra": {}
    },
    {
      "code": 5,
      "msg": "string",
      "type": "notice",
      "extra": {}
    }
  ],
  "data": [
    {
      "count": 1
    },
    {
      "count": 10
    },
    {
      "count": 10
    },
    {
      "count": 7
    },
    {
      "count": 8
    },
    {
      "count": 4
    }
  ]
}