{
  "success": false,
  "messages": [
    {
      "code": 9,
      "msg": "string",
      "type": "error",
      "extra": {}
    },
    {
      "code": 9,
      "msg": "string",
      "type": "warning",
      "extra": {}
    },
    {
      "code": 9,
      "msg": "string",
      "type": "notice",
      "extra": {}
    },
    {
      "code": 1,
      "msg": "string",
      "type": "warning",
      "extra": {}
    }
  ],
  "data": [
    {
      "network_end_hostaddr": "string",
      "network_end_ip_addr": "string",
      "network_is_in_orphan": "string",
      "network_is_terminal": "string",
      "network_lock_network_broadcast": "string",
      "network_multistatus": "string",
      "parent_network_end_ip_addr": "string",
      "parent_network_is_terminal": "string",
      "parent_space_id": "string",
      "parent_space_name": "string",
      "parent_network_start_ip_addr": "string",
      "parent_network_class_name": "string",
      "parent_network_class_parameters": [
        {
          "name": "string",
          "value": "string",
          "inheritance": "inherited",
          "propagation": "restrict",
          "source": "string"
        },
        {
          "name": "string",
          "value": "string",
          "inheritance": "set",
          "propagation": "restrict",
          "source": "string"
        },
        {
          "name": "string",
          "value": "string",
          "inheritance": "set",
          "propagation": "propagate",
          "source": "string"
        },
        {
          "name": "string",
          "value": "string",
          "inheritance": "set",
          "propagation": "restrict",
          "source": "string"
        },
        {
          "name": "string",
          "value": "string",
          "inheritance": "set",
          "propagation": "restrict",
          "source": "string"
        },
        {
          "name": "string",
          "value": "string",
          "inheritance": "inherited",
          "propagation": "restrict",
          "source": "string"
        },
        {
          "name": "string",
          "value": "string",
          "inheritance": "inherited",
          "propagation": "restrict",
          "source": "string"
        },
        {
          "name": "string",
          "value": "string",
          "inheritance": "inherited",
          "propagation": "propagate",
          "source": "string"
        }
      ],
      "parent_network_id": "string",
      "parent_network_level": "string",
      "parent_network_name": "string",
      "parent_network_path": "string",
      "parent_network_size": "string",
      "parent_vlsm_network_id": "string",
      "space_class_name": "string",
      "space_class_parameters": [
        {
          "name": "string",
          "value": "string",
          "inheritance": "set",
          "propagation": "restrict",
          "source": "string"
        },
        {
          "name": "string",
          "value": "string",
          "inheritance": "set",
          "propagation": "propagate",
          "source": "string"
        },
        {
          "name": "string",
          "value": "string",
          "inheritance": "inherited",
          "propagation": "restrict",
          "source": "string"
        },
        {
          "name": "string",
          "value": "string",
          "inheritance": "set",
          "propagation": "propagate",
          "source": "string"
        },
        {
          "name": "string",
          "value": "string",
          "inheritance": "inherited",
          "propagation": "restrict",
          "source": "string"
        },
        {
          "name": "string",
          "value": "string",
          "inheritance": "inherited",
          "propagation": "restrict",
          "source": "string"
        },
        {
          "name": "string",
          "value": "string",
          "inheritance": "set",
          "propagation": "restrict",
          "source": "string"
        },
        {
          "name": "string",
          "value": "string",
          "inheritance": "inherited",
          "propagation": "propagate",
          "source": "string"
        },
        {
          "name": "string",
          "value": "string",
          "inheritance": "inherited",
          "propagation": "propagate",
          "source": "string"
        },
        {
          "name": "string",
          "value": "string",
          "inheritance": "inherited",
          "propagation": "restrict",
          "source": "string"
        }
      ],
      "space_description": "string",
      "space_id": "string",
      "space_is_template": "string",
      "space_name": "string",
      "space_parent_space_id": "string",
      "network_start_hostaddr": "string",
      "network_start_ip_addr": "string",
      "network_allocated_percent": "string",
      "network_allocated_size": "string",
      "network_class_name": "string",
      "network_class_parameters": [
        {
          "name": "string",
          "value": "string",
          "inheritance": "set",
          "propagation": "restrict",
          "source": "string"
        },
        {
          "name": "string",
          "value": "string",
          "inheritance": "inherited",
          "propagation": "propagate",
          "source": "string"
        },
        {
          "name": "string",
          "value": "string",
          "inheritance": "inherited",
          "propagation": "restrict",
          "source": "string"
        },
        {
          "name": "string",
          "value": "string",
          "inheritance": "inherited",
          "propagation": "propagate",
          "source": "string"
        },
        {
          "name": "string",
          "value": "string",
          "inheritance": "set",
          "propagation": "restrict",
          "source": "string"
        },
        {
          "name": "string",
          "value": "string",
          "inheritance": "set",
          "propagation": "propagate",
          "source": "string"
        },
        {
          "name": "string",
          "value": "string",
          "inheritance": "set",
          "propagation": "propagate",
          "source": "string"
        },
        {
          "name": "string",
          "value": "string",
          "inheritance": "set",
          "propagation": "propagate",
          "source": "string"
        },
        {
          "name": "string",
          "value": "string",
          "inheritance": "set",
          "propagation": "propagate",
          "source": "string"
        }
      ],
      "network_id": "string",
      "network_address_free_size": "string",
      "network_address_used_percent": "string",
      "network_address_used_size": "string",
      "network_is_valid": "string",
      "network_level": "string",
      "network_name": "string",
      "network_path": "string",
      "network_size": "string",
      "network_used_percent": "string",
      "network_used_size": "string",
      "domain_id": "string",
      "domain_name": "string",
      "range_id": "string",
      "range_name": "string",
      "vlan_id": "string",
      "vlan_name": "string",
      "vlan_vlan_id": "string",
      "vlsm_block_id": "string",
      "vlsm_space_id": "string",
      "vlsm_space_name": "string",
      "vlsm_network_id": "string",
      "network_ripe_waiting_state": "string",
      "network_ripe_waiting_status": "string"
    },
    {
      "network_end_hostaddr": "string",
      "network_end_ip_addr": "string",
      "network_is_in_orphan": "string",
      "network_is_terminal": "string",
      "network_lock_network_broadcast": "string",
      "network_multistatus": "string",
      "parent_network_end_ip_addr": "string",
      "parent_network_is_terminal": "string",
      "parent_space_id": "string",
      "parent_space_name": "string",
      "parent_network_start_ip_addr": "string",
      "parent_network_class_name": "string",
      "parent_network_class_parameters": [
        {
          "name": "string",
          "value": "string",
          "inheritance": "set",
          "propagation": "propagate",
          "source": "string"
        },
        {
          "name": "string",
          "value": "string",
          "inheritance": "set",
          "propagation": "restrict",
          "source": "string"
        },
        {
          "name": "string",
          "value": "string",
          "inheritance": "inherited",
          "propagation": "restrict",
          "source": "string"
        }
      ],
      "parent_network_id": "string",
      "parent_network_level": "string",
      "parent_network_name": "string",
      "parent_network_path": "string",
      "parent_network_size": "string",
      "parent_vlsm_network_id": "string",
      "space_class_name": "string",
      "space_class_parameters": [
        {
          "name": "string",
          "value": "string",
          "inheritance": "set",
          "propagation": "propagate",
          "source": "string"
        },
        {
          "name": "string",
          "value": "string",
          "inheritance": "inherited",
          "propagation": "propagate",
          "source": "string"
        }
      ],
      "space_description": "string",
      "space_id": "string",
      "space_is_template": "string",
      "space_name": "string",
      "space_parent_space_id": "string",
      "network_start_hostaddr": "string",
      "network_start_ip_addr": "string",
      "network_allocated_percent": "string",
      "network_allocated_size": "string",
      "network_class_name": "string",
      "network_class_parameters": [
        {
          "name": "string",
          "value": "string",
          "inheritance": "inherited",
          "propagation": "propagate",
          "source": "string"
        },
        {
          "name": "string",
          "value": "string",
          "inheritance": "inherited",
          "propagation": "restrict",
          "source": "string"
        },
        {
          "name": "string",
          "value": "string",
          "inheritance": "set",
          "propagation": "restrict",
          "source": "string"
        },
        {
          "name": "string",
          "value": "string",
          "inheritance": "set",
          "propagation": "propagate",
          "source": "string"
        }
      ],
      "network_id": "string",
      "network_address_free_size": "string",
      "network_address_used_percent": "string",
      "network_address_used_size": "string",
      "network_is_valid": "string",
      "network_level": "string",
      "network_name": "string",
      "network_path": "string",
      "network_size": "string",
      "network_used_percent": "string",
      "network_used_size": "string",
      "domain_id": "string",
      "domain_name": "string",
      "range_id": "string",
      "range_name": "string",
      "vlan_id": "string",
      "vlan_name": "string",
      "vlan_vlan_id": "string",
      "vlsm_block_id": "string",
      "vlsm_space_id": "string",
      "vlsm_space_name": "string",
      "vlsm_network_id": "string",
      "network_ripe_waiting_state": "string",
      "network_ripe_waiting_status": "string"
    }
  ]
}