{
  "success": true,
  "messages": [
    {
      "code": 9,
      "msg": "string",
      "type": "error",
      "extra": {}
    },
    {
      "code": 6,
      "msg": "string",
      "type": "notice",
      "extra": {}
    },
    {
      "code": 9,
      "msg": "string",
      "type": "error",
      "extra": {}
    },
    {
      "code": 9,
      "msg": "string",
      "type": "warning",
      "extra": {}
    },
    {
      "code": 8,
      "msg": "string",
      "type": "error",
      "extra": {}
    }
  ],
  "data": [
    {
      "count": 2
    },
    {
      "count": 1
    },
    {
      "count": 3
    },
    {
      "count": 7
    },
    {
      "count": 9
    },
    {
      "count": 9
    },
    {
      "count": 7
    },
    {
      "count": 3
    },
    {
      "count": 4
    }
  ]
}