{
  "actions": [
    {
      "name": "getAppApplicationList",
      "protocol": "REST",
      "method": "GET",
      "entitypath": "{base_path}/{version}/app_application_list?{query}",
      "requestSchema": "schema.json",
      "responseSchema": "schema.json",
      "timeout": 0,
      "sendEmpty": false,
      "sendGetBody": false,
      "requestDatatype": "JSON",
      "responseDatatype": "JSON",
      "headers": {},
      "responseObjects": [
        {
          "type": "default",
          "key": "",
          "mockFile": "mockdatafiles/getAppApplicationList-default.json"
        }
      ]
    },
    {
      "name": "getAppApplicationCount",
      "protocol": "REST",
      "method": "GET",
      "entitypath": "{base_path}/{version}/app_application_count?{query}",
      "requestSchema": "schema.json",
      "responseSchema": "schema.json",
      "timeout": 0,
      "sendEmpty": false,
      "sendGetBody": false,
      "requestDatatype": "JSON",
      "responseDatatype": "JSON",
      "headers": {},
      "responseObjects": [
        {
          "type": "default",
          "key": "",
          "mockFile": "mockdatafiles/getAppApplicationCount-default.json"
        }
      ]
    },
    {
      "name": "getAppApplicationInfo",
      "protocol": "REST",
      "method": "GET",
      "entitypath": "{base_path}/{version}/app_application_info?{query}",
      "requestSchema": "schema.json",
      "responseSchema": "schema.json",
      "timeout": 0,
      "sendEmpty": false,
      "sendGetBody": false,
      "requestDatatype": "JSON",
      "responseDatatype": "JSON",
      "headers": {},
      "responseObjects": [
        {
          "type": "default",
          "key": "",
          "mockFile": "mockdatafiles/getAppApplicationInfo-default.json"
        }
      ]
    },
    {
      "name": "createAppApplication",
      "protocol": "REST",
      "method": "POST",
      "entitypath": "{base_path}/{version}/app_application_add?{query}",
      "requestSchema": "schema.json",
      "responseSchema": "schema.json",
      "timeout": 0,
      "sendEmpty": false,
      "requestDatatype": "JSON",
      "responseDatatype": "JSON",
      "headers": {},
      "responseObjects": [
        {
          "type": "default",
          "key": "",
          "mockFile": "mockdatafiles/createAppApplication-default.json"
        }
      ]
    },
    {
      "name": "updateAppApplication",
      "protocol": "REST",
      "method": "PUT",
      "entitypath": "{base_path}/{version}/app_application_edit?{query}",
      "requestSchema": "schema.json",
      "responseSchema": "schema.json",
      "timeout": 0,
      "sendEmpty": false,
      "requestDatatype": "JSON",
      "responseDatatype": "JSON",
      "headers": {},
      "responseObjects": [
        {
          "type": "default",
          "key": "",
          "mockFile": "mockdatafiles/updateAppApplication-default.json"
        }
      ]
    },
    {
      "name": "deleteAppApplication",
      "protocol": "REST",
      "method": "DELETE",
      "entitypath": "{base_path}/{version}/app_application_delete?{query}",
      "requestSchema": "schema.json",
      "responseSchema": "schema.json",
      "timeout": 0,
      "sendEmpty": false,
      "requestDatatype": "JSON",
      "responseDatatype": "JSON",
      "headers": {},
      "responseObjects": [
        {
          "type": "default",
          "key": "",
          "mockFile": "mockdatafiles/deleteAppApplication-default.json"
        }
      ]
    },
    {
      "name": "getAppPoolList",
      "protocol": "REST",
      "method": "GET",
      "entitypath": "{base_path}/{version}/app_pool_list?{query}",
      "requestSchema": "schema.json",
      "responseSchema": "schema.json",
      "timeout": 0,
      "sendEmpty": false,
      "sendGetBody": false,
      "requestDatatype": "JSON",
      "responseDatatype": "JSON",
      "headers": {},
      "responseObjects": [
        {
          "type": "default",
          "key": "",
          "mockFile": "mockdatafiles/getAppPoolList-default.json"
        }
      ]
    },
    {
      "name": "getAppPoolCount",
      "protocol": "REST",
      "method": "GET",
      "entitypath": "{base_path}/{version}/app_pool_count?{query}",
      "requestSchema": "schema.json",
      "responseSchema": "schema.json",
      "timeout": 0,
      "sendEmpty": false,
      "sendGetBody": false,
      "requestDatatype": "JSON",
      "responseDatatype": "JSON",
      "headers": {},
      "responseObjects": [
        {
          "type": "default",
          "key": "",
          "mockFile": "mockdatafiles/getAppPoolCount-default.json"
        }
      ]
    },
    {
      "name": "getAppPoolInfo",
      "protocol": "REST",
      "method": "GET",
      "entitypath": "{base_path}/{version}/app_pool_info?{query}",
      "requestSchema": "schema.json",
      "responseSchema": "schema.json",
      "timeout": 0,
      "sendEmpty": false,
      "sendGetBody": false,
      "requestDatatype": "JSON",
      "responseDatatype": "JSON",
      "headers": {},
      "responseObjects": [
        {
          "type": "default",
          "key": "",
          "mockFile": "mockdatafiles/getAppPoolInfo-default.json"
        }
      ]
    },
    {
      "name": "createAppPool",
      "protocol": "REST",
      "method": "POST",
      "entitypath": "{base_path}/{version}/app_pool_add?{query}",
      "requestSchema": "schema.json",
      "responseSchema": "schema.json",
      "timeout": 0,
      "sendEmpty": false,
      "requestDatatype": "JSON",
      "responseDatatype": "JSON",
      "headers": {},
      "responseObjects": [
        {
          "type": "default",
          "key": "",
          "mockFile": "mockdatafiles/createAppPool-default.json"
        }
      ]
    },
    {
      "name": "updateAppPool",
      "protocol": "REST",
      "method": "PUT",
      "entitypath": "{base_path}/{version}/app_pool_edit?{query}",
      "requestSchema": "schema.json",
      "responseSchema": "schema.json",
      "timeout": 0,
      "sendEmpty": false,
      "requestDatatype": "JSON",
      "responseDatatype": "JSON",
      "headers": {},
      "responseObjects": [
        {
          "type": "default",
          "key": "",
          "mockFile": "mockdatafiles/updateAppPool-default.json"
        }
      ]
    },
    {
      "name": "deleteAppPool",
      "protocol": "REST",
      "method": "DELETE",
      "entitypath": "{base_path}/{version}/app_pool_delete?{query}",
      "requestSchema": "schema.json",
      "responseSchema": "schema.json",
      "timeout": 0,
      "sendEmpty": false,
      "requestDatatype": "JSON",
      "responseDatatype": "JSON",
      "headers": {},
      "responseObjects": [
        {
          "type": "default",
          "key": "",
          "mockFile": "mockdatafiles/deleteAppPool-default.json"
        }
      ]
    },
    {
      "name": "getAppNodeList",
      "protocol": "REST",
      "method": "GET",
      "entitypath": "{base_path}/{version}/app_node_list?{query}",
      "requestSchema": "schema.json",
      "responseSchema": "schema.json",
      "timeout": 0,
      "sendEmpty": false,
      "sendGetBody": false,
      "requestDatatype": "JSON",
      "responseDatatype": "JSON",
      "headers": {},
      "responseObjects": [
        {
          "type": "default",
          "key": "",
          "mockFile": "mockdatafiles/getAppNodeList-default.json"
        }
      ]
    },
    {
      "name": "getAppNodeCount",
      "protocol": "REST",
      "method": "GET",
      "entitypath": "{base_path}/{version}/app_node_count?{query}",
      "requestSchema": "schema.json",
      "responseSchema": "schema.json",
      "timeout": 0,
      "sendEmpty": false,
      "sendGetBody": false,
      "requestDatatype": "JSON",
      "responseDatatype": "JSON",
      "headers": {},
      "responseObjects": [
        {
          "type": "default",
          "key": "",
          "mockFile": "mockdatafiles/getAppNodeCount-default.json"
        }
      ]
    },
    {
      "name": "getAppNodeInfo",
      "protocol": "REST",
      "method": "GET",
      "entitypath": "{base_path}/{version}/app_node_info?{query}",
      "requestSchema": "schema.json",
      "responseSchema": "schema.json",
      "timeout": 0,
      "sendEmpty": false,
      "sendGetBody": false,
      "requestDatatype": "JSON",
      "responseDatatype": "JSON",
      "headers": {},
      "responseObjects": [
        {
          "type": "default",
          "key": "",
          "mockFile": "mockdatafiles/getAppNodeInfo-default.json"
        }
      ]
    },
    {
      "name": "createAppNode",
      "protocol": "REST",
      "method": "POST",
      "entitypath": "{base_path}/{version}/app_node_add?{query}",
      "requestSchema": "schema.json",
      "responseSchema": "schema.json",
      "timeout": 0,
      "sendEmpty": false,
      "requestDatatype": "JSON",
      "responseDatatype": "JSON",
      "headers": {},
      "responseObjects": [
        {
          "type": "default",
          "key": "",
          "mockFile": "mockdatafiles/createAppNode-default.json"
        }
      ]
    },
    {
      "name": "updateAppNode",
      "protocol": "REST",
      "method": "PUT",
      "entitypath": "{base_path}/{version}/app_node_edit?{query}",
      "requestSchema": "schema.json",
      "responseSchema": "schema.json",
      "timeout": 0,
      "sendEmpty": false,
      "requestDatatype": "JSON",
      "responseDatatype": "JSON",
      "headers": {},
      "responseObjects": [
        {
          "type": "default",
          "key": "",
          "mockFile": "mockdatafiles/updateAppNode-default.json"
        }
      ]
    },
    {
      "name": "deleteAppNode",
      "protocol": "REST",
      "method": "DELETE",
      "entitypath": "{base_path}/{version}/app_node_delete?{query}",
      "requestSchema": "schema.json",
      "responseSchema": "schema.json",
      "timeout": 0,
      "sendEmpty": false,
      "requestDatatype": "JSON",
      "responseDatatype": "JSON",
      "headers": {},
      "responseObjects": [
        {
          "type": "default",
          "key": "",
          "mockFile": "mockdatafiles/deleteAppNode-default.json"
        }
      ]
    }
  ]
}