{
  "success": false,
  "messages": [
    {
      "code": 1,
      "msg": "string",
      "type": "error",
      "extra": {}
    }
  ],
  "data": [
    {
      "zoneparam_id": "string"
    },
    {
      "zoneparam_id": "string"
    },
    {
      "zoneparam_id": "string"
    },
    {
      "zoneparam_id": "string"
    },
    {
      "zoneparam_id": "string"
    },
    {
      "zoneparam_id": "string"
    },
    {
      "zoneparam_id": "string"
    },
    {
      "zoneparam_id": "string"
    },
    {
      "zoneparam_id": "string"
    }
  ]
}