{
  "success": true,
  "messages": [
    {
      "code": 9,
      "msg": "string",
      "type": "error",
      "extra": {}
    }
  ],
  "data": [
    {
      "acl_delayed_create_time": "string",
      "acl_delayed_delete_time": "string",
      "server_id": "string",
      "server_name": "string",
      "server_type": "string",
      "acl_id": "string",
      "acl_match": "string",
      "acl_name": "string",
      "acl_spawnwith": "string",
      "acl_statement": "string",
      "smart_parent_id": "string"
    },
    {
      "acl_delayed_create_time": "string",
      "acl_delayed_delete_time": "string",
      "server_id": "string",
      "server_name": "string",
      "server_type": "string",
      "acl_id": "string",
      "acl_match": "string",
      "acl_name": "string",
      "acl_spawnwith": "string",
      "acl_statement": "string",
      "smart_parent_id": "string"
    },
    {
      "acl_delayed_create_time": "string",
      "acl_delayed_delete_time": "string",
      "server_id": "string",
      "server_name": "string",
      "server_type": "string",
      "acl_id": "string",
      "acl_match": "string",
      "acl_name": "string",
      "acl_spawnwith": "string",
      "acl_statement": "string",
      "smart_parent_id": "string"
    },
    {
      "acl_delayed_create_time": "string",
      "acl_delayed_delete_time": "string",
      "server_id": "string",
      "server_name": "string",
      "server_type": "string",
      "acl_id": "string",
      "acl_match": "string",
      "acl_name": "string",
      "acl_spawnwith": "string",
      "acl_statement": "string",
      "smart_parent_id": "string"
    },
    {
      "acl_delayed_create_time": "string",
      "acl_delayed_delete_time": "string",
      "server_id": "string",
      "server_name": "string",
      "server_type": "string",
      "acl_id": "string",
      "acl_match": "string",
      "acl_name": "string",
      "acl_spawnwith": "string",
      "acl_statement": "string",
      "smart_parent_id": "string"
    },
    {
      "acl_delayed_create_time": "string",
      "acl_delayed_delete_time": "string",
      "server_id": "string",
      "server_name": "string",
      "server_type": "string",
      "acl_id": "string",
      "acl_match": "string",
      "acl_name": "string",
      "acl_spawnwith": "string",
      "acl_statement": "string",
      "smart_parent_id": "string"
    }
  ]
}