{
  "success": true,
  "messages": [
    {
      "code": 5,
      "msg": "string",
      "type": "warning",
      "extra": {}
    },
    {
      "code": 1,
      "msg": "string",
      "type": "error",
      "extra": {}
    },
    {
      "code": 3,
      "msg": "string",
      "type": "error",
      "extra": {}
    },
    {
      "code": 4,
      "msg": "string",
      "type": "warning",
      "extra": {}
    }
  ],
  "data": [
    {
      "count": 9
    },
    {
      "count": 6
    },
    {
      "count": 10
    },
    {
      "count": 1
    },
    {
      "count": 7
    },
    {
      "count": 1
    },
    {
      "count": 4
    },
    {
      "count": 3
    },
    {
      "count": 1
    }
  ]
}