{
  "success": false,
  "messages": [
    {
      "code": 2,
      "msg": "string",
      "type": "warning",
      "extra": {}
    },
    {
      "code": 5,
      "msg": "string",
      "type": "warning",
      "extra": {}
    },
    {
      "code": 5,
      "msg": "string",
      "type": "notice",
      "extra": {}
    },
    {
      "code": 2,
      "msg": "string",
      "type": "warning",
      "extra": {}
    },
    {
      "code": 3,
      "msg": "string",
      "type": "warning",
      "extra": {}
    },
    {
      "code": 10,
      "msg": "string",
      "type": "error",
      "extra": {}
    },
    {
      "code": 1,
      "msg": "string",
      "type": "warning",
      "extra": {}
    },
    {
      "code": 10,
      "msg": "string",
      "type": "notice",
      "extra": {}
    }
  ],
  "data": [
    {
      "scope_delayed_create_time": "string",
      "scope_delayed_delete_time": "string",
      "server_class_name": "string",
      "server_class_parameters": [
        {
          "name": "string",
          "value": "string",
          "inheritance": "inherited",
          "propagation": "restrict",
          "source": "string"
        }
      ],
      "server_id": "string",
      "server_name": "string",
      "server_type": "string",
      "server_version": "string",
      "failover_id": "string",
      "failover_name": "string",
      "scope_class_name": "string",
      "scope_class_parameters": [
        {
          "name": "string",
          "value": "string",
          "inheritance": "set",
          "propagation": "restrict",
          "source": "string"
        }
      ],
      "scope_end_address_addr": "string",
      "scope_id": "string",
      "scope_name": "string",
      "scope_net_addr": "string",
      "scope_net_mask": "string",
      "scope_space_id": "string",
      "scope_space_name": "string",
      "scope_size": "string",
      "scope_start_address_addr": "string",
      "sharednetwork_id": "string",
      "sharednetwork_name": "string",
      "server_addr": "string",
      "scope_multistatus": "string",
      "smart_arch": "string",
      "smart_parent_id": "string",
      "smart_parent_name": "string"
    },
    {
      "scope_delayed_create_time": "string",
      "scope_delayed_delete_time": "string",
      "server_class_name": "string",
      "server_class_parameters": [
        {
          "name": "string",
          "value": "string",
          "inheritance": "set",
          "propagation": "restrict",
          "source": "string"
        },
        {
          "name": "string",
          "value": "string",
          "inheritance": "inherited",
          "propagation": "propagate",
          "source": "string"
        },
        {
          "name": "string",
          "value": "string",
          "inheritance": "inherited",
          "propagation": "propagate",
          "source": "string"
        },
        {
          "name": "string",
          "value": "string",
          "inheritance": "set",
          "propagation": "propagate",
          "source": "string"
        },
        {
          "name": "string",
          "value": "string",
          "inheritance": "inherited",
          "propagation": "restrict",
          "source": "string"
        },
        {
          "name": "string",
          "value": "string",
          "inheritance": "inherited",
          "propagation": "restrict",
          "source": "string"
        },
        {
          "name": "string",
          "value": "string",
          "inheritance": "inherited",
          "propagation": "restrict",
          "source": "string"
        },
        {
          "name": "string",
          "value": "string",
          "inheritance": "inherited",
          "propagation": "restrict",
          "source": "string"
        },
        {
          "name": "string",
          "value": "string",
          "inheritance": "set",
          "propagation": "restrict",
          "source": "string"
        },
        {
          "name": "string",
          "value": "string",
          "inheritance": "inherited",
          "propagation": "propagate",
          "source": "string"
        }
      ],
      "server_id": "string",
      "server_name": "string",
      "server_type": "string",
      "server_version": "string",
      "failover_id": "string",
      "failover_name": "string",
      "scope_class_name": "string",
      "scope_class_parameters": [
        {
          "name": "string",
          "value": "string",
          "inheritance": "set",
          "propagation": "restrict",
          "source": "string"
        }
      ],
      "scope_end_address_addr": "string",
      "scope_id": "string",
      "scope_name": "string",
      "scope_net_addr": "string",
      "scope_net_mask": "string",
      "scope_space_id": "string",
      "scope_space_name": "string",
      "scope_size": "string",
      "scope_start_address_addr": "string",
      "sharednetwork_id": "string",
      "sharednetwork_name": "string",
      "server_addr": "string",
      "scope_multistatus": "string",
      "smart_arch": "string",
      "smart_parent_id": "string",
      "smart_parent_name": "string"
    },
    {
      "scope_delayed_create_time": "string",
      "scope_delayed_delete_time": "string",
      "server_class_name": "string",
      "server_class_parameters": [
        {
          "name": "string",
          "value": "string",
          "inheritance": "inherited",
          "propagation": "restrict",
          "source": "string"
        },
        {
          "name": "string",
          "value": "string",
          "inheritance": "set",
          "propagation": "propagate",
          "source": "string"
        },
        {
          "name": "string",
          "value": "string",
          "inheritance": "set",
          "propagation": "restrict",
          "source": "string"
        },
        {
          "name": "string",
          "value": "string",
          "inheritance": "inherited",
          "propagation": "restrict",
          "source": "string"
        },
        {
          "name": "string",
          "value": "string",
          "inheritance": "inherited",
          "propagation": "restrict",
          "source": "string"
        }
      ],
      "server_id": "string",
      "server_name": "string",
      "server_type": "string",
      "server_version": "string",
      "failover_id": "string",
      "failover_name": "string",
      "scope_class_name": "string",
      "scope_class_parameters": [
        {
          "name": "string",
          "value": "string",
          "inheritance": "set",
          "propagation": "restrict",
          "source": "string"
        },
        {
          "name": "string",
          "value": "string",
          "inheritance": "inherited",
          "propagation": "restrict",
          "source": "string"
        }
      ],
      "scope_end_address_addr": "string",
      "scope_id": "string",
      "scope_name": "string",
      "scope_net_addr": "string",
      "scope_net_mask": "string",
      "scope_space_id": "string",
      "scope_space_name": "string",
      "scope_size": "string",
      "scope_start_address_addr": "string",
      "sharednetwork_id": "string",
      "sharednetwork_name": "string",
      "server_addr": "string",
      "scope_multistatus": "string",
      "smart_arch": "string",
      "smart_parent_id": "string",
      "smart_parent_name": "string"
    },
    {
      "scope_delayed_create_time": "string",
      "scope_delayed_delete_time": "string",
      "server_class_name": "string",
      "server_class_parameters": [
        {
          "name": "string",
          "value": "string",
          "inheritance": "set",
          "propagation": "propagate",
          "source": "string"
        },
        {
          "name": "string",
          "value": "string",
          "inheritance": "inherited",
          "propagation": "propagate",
          "source": "string"
        },
        {
          "name": "string",
          "value": "string",
          "inheritance": "inherited",
          "propagation": "propagate",
          "source": "string"
        },
        {
          "name": "string",
          "value": "string",
          "inheritance": "inherited",
          "propagation": "restrict",
          "source": "string"
        },
        {
          "name": "string",
          "value": "string",
          "inheritance": "set",
          "propagation": "propagate",
          "source": "string"
        },
        {
          "name": "string",
          "value": "string",
          "inheritance": "inherited",
          "propagation": "propagate",
          "source": "string"
        }
      ],
      "server_id": "string",
      "server_name": "string",
      "server_type": "string",
      "server_version": "string",
      "failover_id": "string",
      "failover_name": "string",
      "scope_class_name": "string",
      "scope_class_parameters": [
        {
          "name": "string",
          "value": "string",
          "inheritance": "inherited",
          "propagation": "propagate",
          "source": "string"
        },
        {
          "name": "string",
          "value": "string",
          "inheritance": "set",
          "propagation": "restrict",
          "source": "string"
        },
        {
          "name": "string",
          "value": "string",
          "inheritance": "set",
          "propagation": "propagate",
          "source": "string"
        },
        {
          "name": "string",
          "value": "string",
          "inheritance": "set",
          "propagation": "propagate",
          "source": "string"
        }
      ],
      "scope_end_address_addr": "string",
      "scope_id": "string",
      "scope_name": "string",
      "scope_net_addr": "string",
      "scope_net_mask": "string",
      "scope_space_id": "string",
      "scope_space_name": "string",
      "scope_size": "string",
      "scope_start_address_addr": "string",
      "sharednetwork_id": "string",
      "sharednetwork_name": "string",
      "server_addr": "string",
      "scope_multistatus": "string",
      "smart_arch": "string",
      "smart_parent_id": "string",
      "smart_parent_name": "string"
    },
    {
      "scope_delayed_create_time": "string",
      "scope_delayed_delete_time": "string",
      "server_class_name": "string",
      "server_class_parameters": [
        {
          "name": "string",
          "value": "string",
          "inheritance": "inherited",
          "propagation": "propagate",
          "source": "string"
        },
        {
          "name": "string",
          "value": "string",
          "inheritance": "set",
          "propagation": "propagate",
          "source": "string"
        },
        {
          "name": "string",
          "value": "string",
          "inheritance": "set",
          "propagation": "restrict",
          "source": "string"
        },
        {
          "name": "string",
          "value": "string",
          "inheritance": "set",
          "propagation": "propagate",
          "source": "string"
        },
        {
          "name": "string",
          "value": "string",
          "inheritance": "set",
          "propagation": "propagate",
          "source": "string"
        },
        {
          "name": "string",
          "value": "string",
          "inheritance": "set",
          "propagation": "propagate",
          "source": "string"
        },
        {
          "name": "string",
          "value": "string",
          "inheritance": "inherited",
          "propagation": "propagate",
          "source": "string"
        }
      ],
      "server_id": "string",
      "server_name": "string",
      "server_type": "string",
      "server_version": "string",
      "failover_id": "string",
      "failover_name": "string",
      "scope_class_name": "string",
      "scope_class_parameters": [
        {
          "name": "string",
          "value": "string",
          "inheritance": "set",
          "propagation": "propagate",
          "source": "string"
        },
        {
          "name": "string",
          "value": "string",
          "inheritance": "inherited",
          "propagation": "propagate",
          "source": "string"
        },
        {
          "name": "string",
          "value": "string",
          "inheritance": "inherited",
          "propagation": "propagate",
          "source": "string"
        },
        {
          "name": "string",
          "value": "string",
          "inheritance": "set",
          "propagation": "propagate",
          "source": "string"
        },
        {
          "name": "string",
          "value": "string",
          "inheritance": "inherited",
          "propagation": "propagate",
          "source": "string"
        },
        {
          "name": "string",
          "value": "string",
          "inheritance": "set",
          "propagation": "propagate",
          "source": "string"
        },
        {
          "name": "string",
          "value": "string",
          "inheritance": "set",
          "propagation": "propagate",
          "source": "string"
        },
        {
          "name": "string",
          "value": "string",
          "inheritance": "inherited",
          "propagation": "propagate",
          "source": "string"
        }
      ],
      "scope_end_address_addr": "string",
      "scope_id": "string",
      "scope_name": "string",
      "scope_net_addr": "string",
      "scope_net_mask": "string",
      "scope_space_id": "string",
      "scope_space_name": "string",
      "scope_size": "string",
      "scope_start_address_addr": "string",
      "sharednetwork_id": "string",
      "sharednetwork_name": "string",
      "server_addr": "string",
      "scope_multistatus": "string",
      "smart_arch": "string",
      "smart_parent_id": "string",
      "smart_parent_name": "string"
    },
    {
      "scope_delayed_create_time": "string",
      "scope_delayed_delete_time": "string",
      "server_class_name": "string",
      "server_class_parameters": [
        {
          "name": "string",
          "value": "string",
          "inheritance": "inherited",
          "propagation": "restrict",
          "source": "string"
        },
        {
          "name": "string",
          "value": "string",
          "inheritance": "inherited",
          "propagation": "restrict",
          "source": "string"
        },
        {
          "name": "string",
          "value": "string",
          "inheritance": "inherited",
          "propagation": "propagate",
          "source": "string"
        },
        {
          "name": "string",
          "value": "string",
          "inheritance": "set",
          "propagation": "restrict",
          "source": "string"
        },
        {
          "name": "string",
          "value": "string",
          "inheritance": "inherited",
          "propagation": "restrict",
          "source": "string"
        },
        {
          "name": "string",
          "value": "string",
          "inheritance": "set",
          "propagation": "restrict",
          "source": "string"
        },
        {
          "name": "string",
          "value": "string",
          "inheritance": "inherited",
          "propagation": "restrict",
          "source": "string"
        },
        {
          "name": "string",
          "value": "string",
          "inheritance": "set",
          "propagation": "restrict",
          "source": "string"
        }
      ],
      "server_id": "string",
      "server_name": "string",
      "server_type": "string",
      "server_version": "string",
      "failover_id": "string",
      "failover_name": "string",
      "scope_class_name": "string",
      "scope_class_parameters": [
        {
          "name": "string",
          "value": "string",
          "inheritance": "set",
          "propagation": "propagate",
          "source": "string"
        },
        {
          "name": "string",
          "value": "string",
          "inheritance": "set",
          "propagation": "restrict",
          "source": "string"
        },
        {
          "name": "string",
          "value": "string",
          "inheritance": "inherited",
          "propagation": "propagate",
          "source": "string"
        }
      ],
      "scope_end_address_addr": "string",
      "scope_id": "string",
      "scope_name": "string",
      "scope_net_addr": "string",
      "scope_net_mask": "string",
      "scope_space_id": "string",
      "scope_space_name": "string",
      "scope_size": "string",
      "scope_start_address_addr": "string",
      "sharednetwork_id": "string",
      "sharednetwork_name": "string",
      "server_addr": "string",
      "scope_multistatus": "string",
      "smart_arch": "string",
      "smart_parent_id": "string",
      "smart_parent_name": "string"
    },
    {
      "scope_delayed_create_time": "string",
      "scope_delayed_delete_time": "string",
      "server_class_name": "string",
      "server_class_parameters": [
        {
          "name": "string",
          "value": "string",
          "inheritance": "set",
          "propagation": "restrict",
          "source": "string"
        },
        {
          "name": "string",
          "value": "string",
          "inheritance": "inherited",
          "propagation": "restrict",
          "source": "string"
        },
        {
          "name": "string",
          "value": "string",
          "inheritance": "inherited",
          "propagation": "restrict",
          "source": "string"
        }
      ],
      "server_id": "string",
      "server_name": "string",
      "server_type": "string",
      "server_version": "string",
      "failover_id": "string",
      "failover_name": "string",
      "scope_class_name": "string",
      "scope_class_parameters": [
        {
          "name": "string",
          "value": "string",
          "inheritance": "set",
          "propagation": "restrict",
          "source": "string"
        },
        {
          "name": "string",
          "value": "string",
          "inheritance": "inherited",
          "propagation": "propagate",
          "source": "string"
        },
        {
          "name": "string",
          "value": "string",
          "inheritance": "inherited",
          "propagation": "propagate",
          "source": "string"
        },
        {
          "name": "string",
          "value": "string",
          "inheritance": "inherited",
          "propagation": "restrict",
          "source": "string"
        },
        {
          "name": "string",
          "value": "string",
          "inheritance": "set",
          "propagation": "restrict",
          "source": "string"
        },
        {
          "name": "string",
          "value": "string",
          "inheritance": "set",
          "propagation": "restrict",
          "source": "string"
        },
        {
          "name": "string",
          "value": "string",
          "inheritance": "inherited",
          "propagation": "propagate",
          "source": "string"
        },
        {
          "name": "string",
          "value": "string",
          "inheritance": "set",
          "propagation": "restrict",
          "source": "string"
        },
        {
          "name": "string",
          "value": "string",
          "inheritance": "set",
          "propagation": "propagate",
          "source": "string"
        },
        {
          "name": "string",
          "value": "string",
          "inheritance": "inherited",
          "propagation": "restrict",
          "source": "string"
        }
      ],
      "scope_end_address_addr": "string",
      "scope_id": "string",
      "scope_name": "string",
      "scope_net_addr": "string",
      "scope_net_mask": "string",
      "scope_space_id": "string",
      "scope_space_name": "string",
      "scope_size": "string",
      "scope_start_address_addr": "string",
      "sharednetwork_id": "string",
      "sharednetwork_name": "string",
      "server_addr": "string",
      "scope_multistatus": "string",
      "smart_arch": "string",
      "smart_parent_id": "string",
      "smart_parent_name": "string"
    },
    {
      "scope_delayed_create_time": "string",
      "scope_delayed_delete_time": "string",
      "server_class_name": "string",
      "server_class_parameters": [
        {
          "name": "string",
          "value": "string",
          "inheritance": "inherited",
          "propagation": "restrict",
          "source": "string"
        },
        {
          "name": "string",
          "value": "string",
          "inheritance": "inherited",
          "propagation": "restrict",
          "source": "string"
        }
      ],
      "server_id": "string",
      "server_name": "string",
      "server_type": "string",
      "server_version": "string",
      "failover_id": "string",
      "failover_name": "string",
      "scope_class_name": "string",
      "scope_class_parameters": [
        {
          "name": "string",
          "value": "string",
          "inheritance": "inherited",
          "propagation": "restrict",
          "source": "string"
        },
        {
          "name": "string",
          "value": "string",
          "inheritance": "inherited",
          "propagation": "restrict",
          "source": "string"
        },
        {
          "name": "string",
          "value": "string",
          "inheritance": "inherited",
          "propagation": "restrict",
          "source": "string"
        },
        {
          "name": "string",
          "value": "string",
          "inheritance": "set",
          "propagation": "propagate",
          "source": "string"
        }
      ],
      "scope_end_address_addr": "string",
      "scope_id": "string",
      "scope_name": "string",
      "scope_net_addr": "string",
      "scope_net_mask": "string",
      "scope_space_id": "string",
      "scope_space_name": "string",
      "scope_size": "string",
      "scope_start_address_addr": "string",
      "sharednetwork_id": "string",
      "sharednetwork_name": "string",
      "server_addr": "string",
      "scope_multistatus": "string",
      "smart_arch": "string",
      "smart_parent_id": "string",
      "smart_parent_name": "string"
    },
    {
      "scope_delayed_create_time": "string",
      "scope_delayed_delete_time": "string",
      "server_class_name": "string",
      "server_class_parameters": [
        {
          "name": "string",
          "value": "string",
          "inheritance": "set",
          "propagation": "restrict",
          "source": "string"
        },
        {
          "name": "string",
          "value": "string",
          "inheritance": "inherited",
          "propagation": "propagate",
          "source": "string"
        },
        {
          "name": "string",
          "value": "string",
          "inheritance": "set",
          "propagation": "propagate",
          "source": "string"
        },
        {
          "name": "string",
          "value": "string",
          "inheritance": "inherited",
          "propagation": "restrict",
          "source": "string"
        },
        {
          "name": "string",
          "value": "string",
          "inheritance": "set",
          "propagation": "restrict",
          "source": "string"
        },
        {
          "name": "string",
          "value": "string",
          "inheritance": "inherited",
          "propagation": "propagate",
          "source": "string"
        },
        {
          "name": "string",
          "value": "string",
          "inheritance": "inherited",
          "propagation": "restrict",
          "source": "string"
        },
        {
          "name": "string",
          "value": "string",
          "inheritance": "inherited",
          "propagation": "restrict",
          "source": "string"
        }
      ],
      "server_id": "string",
      "server_name": "string",
      "server_type": "string",
      "server_version": "string",
      "failover_id": "string",
      "failover_name": "string",
      "scope_class_name": "string",
      "scope_class_parameters": [
        {
          "name": "string",
          "value": "string",
          "inheritance": "set",
          "propagation": "propagate",
          "source": "string"
        },
        {
          "name": "string",
          "value": "string",
          "inheritance": "inherited",
          "propagation": "restrict",
          "source": "string"
        }
      ],
      "scope_end_address_addr": "string",
      "scope_id": "string",
      "scope_name": "string",
      "scope_net_addr": "string",
      "scope_net_mask": "string",
      "scope_space_id": "string",
      "scope_space_name": "string",
      "scope_size": "string",
      "scope_start_address_addr": "string",
      "sharednetwork_id": "string",
      "sharednetwork_name": "string",
      "server_addr": "string",
      "scope_multistatus": "string",
      "smart_arch": "string",
      "smart_parent_id": "string",
      "smart_parent_name": "string"
    },
    {
      "scope_delayed_create_time": "string",
      "scope_delayed_delete_time": "string",
      "server_class_name": "string",
      "server_class_parameters": [
        {
          "name": "string",
          "value": "string",
          "inheritance": "inherited",
          "propagation": "restrict",
          "source": "string"
        },
        {
          "name": "string",
          "value": "string",
          "inheritance": "set",
          "propagation": "restrict",
          "source": "string"
        },
        {
          "name": "string",
          "value": "string",
          "inheritance": "set",
          "propagation": "propagate",
          "source": "string"
        },
        {
          "name": "string",
          "value": "string",
          "inheritance": "set",
          "propagation": "restrict",
          "source": "string"
        },
        {
          "name": "string",
          "value": "string",
          "inheritance": "inherited",
          "propagation": "propagate",
          "source": "string"
        }
      ],
      "server_id": "string",
      "server_name": "string",
      "server_type": "string",
      "server_version": "string",
      "failover_id": "string",
      "failover_name": "string",
      "scope_class_name": "string",
      "scope_class_parameters": [
        {
          "name": "string",
          "value": "string",
          "inheritance": "set",
          "propagation": "restrict",
          "source": "string"
        },
        {
          "name": "string",
          "value": "string",
          "inheritance": "inherited",
          "propagation": "propagate",
          "source": "string"
        },
        {
          "name": "string",
          "value": "string",
          "inheritance": "set",
          "propagation": "propagate",
          "source": "string"
        },
        {
          "name": "string",
          "value": "string",
          "inheritance": "inherited",
          "propagation": "propagate",
          "source": "string"
        },
        {
          "name": "string",
          "value": "string",
          "inheritance": "set",
          "propagation": "restrict",
          "source": "string"
        },
        {
          "name": "string",
          "value": "string",
          "inheritance": "set",
          "propagation": "restrict",
          "source": "string"
        }
      ],
      "scope_end_address_addr": "string",
      "scope_id": "string",
      "scope_name": "string",
      "scope_net_addr": "string",
      "scope_net_mask": "string",
      "scope_space_id": "string",
      "scope_space_name": "string",
      "scope_size": "string",
      "scope_start_address_addr": "string",
      "sharednetwork_id": "string",
      "sharednetwork_name": "string",
      "server_addr": "string",
      "scope_multistatus": "string",
      "smart_arch": "string",
      "smart_parent_id": "string",
      "smart_parent_name": "string"
    }
  ]
}