{
  "success": true,
  "messages": [
    {
      "code": 1,
      "msg": "string",
      "type": "error",
      "extra": {}
    },
    {
      "code": 8,
      "msg": "string",
      "type": "error",
      "extra": {}
    },
    {
      "code": 5,
      "msg": "string",
      "type": "notice",
      "extra": {}
    },
    {
      "code": 6,
      "msg": "string",
      "type": "error",
      "extra": {}
    },
    {
      "code": 4,
      "msg": "string",
      "type": "warning",
      "extra": {}
    }
  ],
  "data": [
    {
      "policy_delayed_time": "string",
      "server_id": "string",
      "server_name": "string",
      "policy_description": "string",
      "policy_id": "string",
      "policy_name": "string",
      "policy_readonly": "string",
      "parent_policy_id": "string"
    },
    {
      "policy_delayed_time": "string",
      "server_id": "string",
      "server_name": "string",
      "policy_description": "string",
      "policy_id": "string",
      "policy_name": "string",
      "policy_readonly": "string",
      "parent_policy_id": "string"
    },
    {
      "policy_delayed_time": "string",
      "server_id": "string",
      "server_name": "string",
      "policy_description": "string",
      "policy_id": "string",
      "policy_name": "string",
      "policy_readonly": "string",
      "parent_policy_id": "string"
    },
    {
      "policy_delayed_time": "string",
      "server_id": "string",
      "server_name": "string",
      "policy_description": "string",
      "policy_id": "string",
      "policy_name": "string",
      "policy_readonly": "string",
      "parent_policy_id": "string"
    },
    {
      "policy_delayed_time": "string",
      "server_id": "string",
      "server_name": "string",
      "policy_description": "string",
      "policy_id": "string",
      "policy_name": "string",
      "policy_readonly": "string",
      "parent_policy_id": "string"
    },
    {
      "policy_delayed_time": "string",
      "server_id": "string",
      "server_name": "string",
      "policy_description": "string",
      "policy_id": "string",
      "policy_name": "string",
      "policy_readonly": "string",
      "parent_policy_id": "string"
    }
  ]
}