{
  "actions": [
    {
      "name": "getGuardianPolicyList",
      "protocol": "REST",
      "method": "GET",
      "entitypath": "{base_path}/{version}/guardian_policy_list?{query}",
      "requestSchema": "schema.json",
      "responseSchema": "schema.json",
      "timeout": 0,
      "sendEmpty": false,
      "sendGetBody": false,
      "requestDatatype": "JSON",
      "responseDatatype": "JSON",
      "headers": {},
      "responseObjects": [
        {
          "type": "default",
          "key": "",
          "mockFile": "mockdatafiles/getGuardianPolicyList-default.json"
        }
      ]
    },
    {
      "name": "getGuardianPolicyCount",
      "protocol": "REST",
      "method": "GET",
      "entitypath": "{base_path}/{version}/guardian_policy_count?{query}",
      "requestSchema": "schema.json",
      "responseSchema": "schema.json",
      "timeout": 0,
      "sendEmpty": false,
      "sendGetBody": false,
      "requestDatatype": "JSON",
      "responseDatatype": "JSON",
      "headers": {},
      "responseObjects": [
        {
          "type": "default",
          "key": "",
          "mockFile": "mockdatafiles/getGuardianPolicyCount-default.json"
        }
      ]
    },
    {
      "name": "getGuardianPolicyInfo",
      "protocol": "REST",
      "method": "GET",
      "entitypath": "{base_path}/{version}/guardian_policy_info?{query}",
      "requestSchema": "schema.json",
      "responseSchema": "schema.json",
      "timeout": 0,
      "sendEmpty": false,
      "sendGetBody": false,
      "requestDatatype": "JSON",
      "responseDatatype": "JSON",
      "headers": {},
      "responseObjects": [
        {
          "type": "default",
          "key": "",
          "mockFile": "mockdatafiles/getGuardianPolicyInfo-default.json"
        }
      ]
    },
    {
      "name": "createGuardianPolicy",
      "protocol": "REST",
      "method": "POST",
      "entitypath": "{base_path}/{version}/guardian_policy_add?{query}",
      "requestSchema": "schema.json",
      "responseSchema": "schema.json",
      "timeout": 0,
      "sendEmpty": false,
      "requestDatatype": "JSON",
      "responseDatatype": "JSON",
      "headers": {},
      "responseObjects": [
        {
          "type": "default",
          "key": "",
          "mockFile": "mockdatafiles/createGuardianPolicy-default.json"
        }
      ]
    },
    {
      "name": "updateGuardianPolicy",
      "protocol": "REST",
      "method": "PUT",
      "entitypath": "{base_path}/{version}/guardian_policy_edit?{query}",
      "requestSchema": "schema.json",
      "responseSchema": "schema.json",
      "timeout": 0,
      "sendEmpty": false,
      "requestDatatype": "JSON",
      "responseDatatype": "JSON",
      "headers": {},
      "responseObjects": [
        {
          "type": "default",
          "key": "",
          "mockFile": "mockdatafiles/updateGuardianPolicy-default.json"
        }
      ]
    },
    {
      "name": "deleteGuardianPolicy",
      "protocol": "REST",
      "method": "DELETE",
      "entitypath": "{base_path}/{version}/guardian_policy_delete?{query}",
      "requestSchema": "schema.json",
      "responseSchema": "schema.json",
      "timeout": 0,
      "sendEmpty": false,
      "requestDatatype": "JSON",
      "responseDatatype": "JSON",
      "headers": {},
      "responseObjects": [
        {
          "type": "default",
          "key": "",
          "mockFile": "mockdatafiles/deleteGuardianPolicy-default.json"
        }
      ]
    }
  ]
}