{
  "success": false,
  "messages": [
    {
      "code": 2,
      "msg": "string",
      "type": "notice",
      "extra": {}
    }
  ],
  "data": [
    {
      "static_id": "string"
    },
    {
      "static_id": "string"
    },
    {
      "static_id": "string"
    },
    {
      "static_id": "string"
    },
    {
      "static_id": "string"
    },
    {
      "static_id": "string"
    },
    {
      "static_id": "string"
    }
  ]
}