{
  "name": "adapter-efficientip_solidserver",
  "webName": "Adapter for Integration to EfficientIP SOLIDserver",
  "supportLevel": "community",
  "vendor": "EfficientIP",
  "product": "SOLIDserver",
  "techAlliance": false,
  "osVersion": [],
  "apiVersions": [],
  "iapVersions": [
    "2021.1.x",
    "2021.2.x",
    "2022.1.x",
    "2023.1.x"
  ],
  "method": "REST",
  "type": "Adapter",
  "domains": [
    "Inventory",
    "Network Services"
  ],
  "tags": [
    "Network Infrastructure Changes",
    "Configuration & Compliance"
  ],
  "useCases": [
    "Device Onboarding",
    "Assign Network & IP",
    "Create A Record",
    "Run network compliance checks and remediation",
    "Golden Configuration",
    "Bulk IP Address Allocation",
    "DNS Management"
  ],
  "deprecated": {
    "isDeprecated": false
  },
  "brokerSince": "",
  "authMethods": [
    {
      "type": "Basic Auth",
      "primary": true
    }
  ],
  "documentation": {
    "storeLink": "",
    "npmLink": "https://www.npmjs.com/package/@itentialopensource/adapter-efficientip_solidserver",
    "repoLink": "https://gitlab.com/itentialopensource/adapters/adapter-efficientip_solidserver",
    "docLink": "https://gitlab.com/itentialopensource/adapters/adapter-efficientip_solidserver/-/blob/master/README.md?ref_type=heads",
    "demoLinks": [],
    "trainingLinks": [
      {
        "title": "Itential Academy",
        "link": "https://www.itential.com/itential-academy/"
      }
    ],
    "faqLink": "https://docs.itential.com/opensource/docs/troubleshooting-an-adapter",
    "contributeLink": "https://gitlab.com/itentialopensource/adapters/contributing-guide",
    "issueLink": "https://itential.atlassian.net/servicedesk/customer/portals",
    "webLink": "https://www.itential.com/adapters/efficient-ip-solidserver/",
    "vendorLink": "https://efficientip.com/",
    "productLink": "https://efficientip.com/products/solidserver-ddi/",
    "apiLinks": [
      {
        "title": "API documents for Efficientip Solidserver",
        "link": "https://efficientip.com/blog/getting-started-with-solidserver-rest-apis/",
        "public": true
      }
    ],
    "workshopLinks": [],
    "workshopHomePage": "https://www.itential.com/get-started/"
  },
  "assets": [],
  "relatedItems": {
    "adapters": [],
    "integrations": [],
    "ecosystemApplications": [],
    "workflowProjects": [],
    "transformationProjects": [],
    "exampleProjects": []
  }
}