{
  "success": false,
  "messages": [
    {
      "code": 9,
      "msg": "string",
      "type": "notice",
      "extra": {}
    },
    {
      "code": 4,
      "msg": "string",
      "type": "warning",
      "extra": {}
    },
    {
      "code": 6,
      "msg": "string",
      "type": "notice",
      "extra": {}
    },
    {
      "code": 6,
      "msg": "string",
      "type": "notice",
      "extra": {}
    }
  ],
  "data": [
    {
      "aclentry_delayed_create_time": "string",
      "aclentry_delayed_delete_time": "string",
      "server_id": "string",
      "server_name": "string",
      "server_type": "string",
      "acl_id": "string",
      "acl_name": "string",
      "aclentry_id": "string",
      "aclentry_value": "string",
      "smart_parent_id": "string"
    },
    {
      "aclentry_delayed_create_time": "string",
      "aclentry_delayed_delete_time": "string",
      "server_id": "string",
      "server_name": "string",
      "server_type": "string",
      "acl_id": "string",
      "acl_name": "string",
      "aclentry_id": "string",
      "aclentry_value": "string",
      "smart_parent_id": "string"
    },
    {
      "aclentry_delayed_create_time": "string",
      "aclentry_delayed_delete_time": "string",
      "server_id": "string",
      "server_name": "string",
      "server_type": "string",
      "acl_id": "string",
      "acl_name": "string",
      "aclentry_id": "string",
      "aclentry_value": "string",
      "smart_parent_id": "string"
    },
    {
      "aclentry_delayed_create_time": "string",
      "aclentry_delayed_delete_time": "string",
      "server_id": "string",
      "server_name": "string",
      "server_type": "string",
      "acl_id": "string",
      "acl_name": "string",
      "aclentry_id": "string",
      "aclentry_value": "string",
      "smart_parent_id": "string"
    },
    {
      "aclentry_delayed_create_time": "string",
      "aclentry_delayed_delete_time": "string",
      "server_id": "string",
      "server_name": "string",
      "server_type": "string",
      "acl_id": "string",
      "acl_name": "string",
      "aclentry_id": "string",
      "aclentry_value": "string",
      "smart_parent_id": "string"
    }
  ]
}