{
  "success": true,
  "messages": [
    {
      "code": 9,
      "msg": "string",
      "type": "error",
      "extra": {}
    },
    {
      "code": 4,
      "msg": "string",
      "type": "warning",
      "extra": {}
    },
    {
      "code": 8,
      "msg": "string",
      "type": "notice",
      "extra": {}
    },
    {
      "code": 10,
      "msg": "string",
      "type": "warning",
      "extra": {}
    },
    {
      "code": 10,
      "msg": "string",
      "type": "warning",
      "extra": {}
    },
    {
      "code": 7,
      "msg": "string",
      "type": "error",
      "extra": {}
    },
    {
      "code": 9,
      "msg": "string",
      "type": "error",
      "extra": {}
    },
    {
      "code": 10,
      "msg": "string",
      "type": "error",
      "extra": {}
    },
    {
      "code": 10,
      "msg": "string",
      "type": "warning",
      "extra": {}
    },
    {
      "code": 7,
      "msg": "string",
      "type": "warning",
      "extra": {}
    }
  ],
  "data": [
    {
      "address6_id": "string"
    },
    {
      "address6_id": "string"
    },
    {
      "address6_id": "string"
    },
    {
      "address6_id": "string"
    },
    {
      "address6_id": "string"
    },
    {
      "address6_id": "string"
    },
    {
      "address6_id": "string"
    },
    {
      "address6_id": "string"
    },
    {
      "address6_id": "string"
    }
  ]
}