{
  "success": true,
  "messages": [
    {
      "code": 7,
      "msg": "string",
      "type": "warning",
      "extra": {}
    },
    {
      "code": 8,
      "msg": "string",
      "type": "warning",
      "extra": {}
    },
    {
      "code": 4,
      "msg": "string",
      "type": "warning",
      "extra": {}
    },
    {
      "code": 4,
      "msg": "string",
      "type": "error",
      "extra": {}
    },
    {
      "code": 5,
      "msg": "string",
      "type": "warning",
      "extra": {}
    },
    {
      "code": 3,
      "msg": "string",
      "type": "error",
      "extra": {}
    },
    {
      "code": 7,
      "msg": "string",
      "type": "error",
      "extra": {}
    },
    {
      "code": 5,
      "msg": "string",
      "type": "error",
      "extra": {}
    },
    {
      "code": 4,
      "msg": "string",
      "type": "notice",
      "extra": {}
    }
  ],
  "data": [
    {
      "count": 7
    },
    {
      "count": 10
    },
    {
      "count": 7
    }
  ]
}