{
  "success": true,
  "messages": [
    {
      "code": 1,
      "msg": "string",
      "type": "warning",
      "extra": {}
    },
    {
      "code": 5,
      "msg": "string",
      "type": "notice",
      "extra": {}
    },
    {
      "code": 4,
      "msg": "string",
      "type": "error",
      "extra": {}
    },
    {
      "code": 4,
      "msg": "string",
      "type": "warning",
      "extra": {}
    },
    {
      "code": 2,
      "msg": "string",
      "type": "warning",
      "extra": {}
    }
  ],
  "data": [
    {
      "server_class_name": "string",
      "server_id": "string",
      "server_name": "string",
      "server_type": "string",
      "server_version": "string",
      "lease_addr": "string",
      "lease_circuit_id": "string",
      "lease_client_ident": "string",
      "lease_clientname": "string",
      "lease_domain": "string",
      "lease_end_time": "string",
      "lease_fingerbank_os": "string",
      "lease_first_time": "string",
      "lease_id": "string",
      "lease_address_addr": "string",
      "lease_mac_addr": "string",
      "lease_name": "string",
      "lease_period": "string",
      "lease_remote_id": "string",
      "lease_time": "string",
      "lease_vendor_id": "string",
      "range_class_name": "string",
      "range_class_parameters": [
        {
          "name": "string",
          "value": "string",
          "inheritance": "inherited",
          "propagation": "restrict",
          "source": "string"
        },
        {
          "name": "string",
          "value": "string",
          "inheritance": "inherited",
          "propagation": "propagate",
          "source": "string"
        },
        {
          "name": "string",
          "value": "string",
          "inheritance": "inherited",
          "propagation": "propagate",
          "source": "string"
        },
        {
          "name": "string",
          "value": "string",
          "inheritance": "inherited",
          "propagation": "restrict",
          "source": "string"
        },
        {
          "name": "string",
          "value": "string",
          "inheritance": "set",
          "propagation": "propagate",
          "source": "string"
        },
        {
          "name": "string",
          "value": "string",
          "inheritance": "set",
          "propagation": "restrict",
          "source": "string"
        },
        {
          "name": "string",
          "value": "string",
          "inheritance": "inherited",
          "propagation": "restrict",
          "source": "string"
        },
        {
          "name": "string",
          "value": "string",
          "inheritance": "set",
          "propagation": "restrict",
          "source": "string"
        }
      ],
      "range_end_addr": "string",
      "range_failover_name": "string",
      "range_id": "string",
      "range_name": "string",
      "range_start_addr": "string",
      "scope_class_name": "string",
      "scope_id": "string",
      "scope_name": "string",
      "scope_net_addr": "string",
      "scope_size": "string",
      "server_addr": "string",
      "lease_mac_vendor": "string",
      "lease_multistatus": "string",
      "parameter_request_list": "string",
      "percent": "string",
      "time_to_expire": "string",
      "smart_parent_id": "string",
      "smart_parent_name": "string"
    },
    {
      "server_class_name": "string",
      "server_id": "string",
      "server_name": "string",
      "server_type": "string",
      "server_version": "string",
      "lease_addr": "string",
      "lease_circuit_id": "string",
      "lease_client_ident": "string",
      "lease_clientname": "string",
      "lease_domain": "string",
      "lease_end_time": "string",
      "lease_fingerbank_os": "string",
      "lease_first_time": "string",
      "lease_id": "string",
      "lease_address_addr": "string",
      "lease_mac_addr": "string",
      "lease_name": "string",
      "lease_period": "string",
      "lease_remote_id": "string",
      "lease_time": "string",
      "lease_vendor_id": "string",
      "range_class_name": "string",
      "range_class_parameters": [
        {
          "name": "string",
          "value": "string",
          "inheritance": "inherited",
          "propagation": "propagate",
          "source": "string"
        },
        {
          "name": "string",
          "value": "string",
          "inheritance": "set",
          "propagation": "restrict",
          "source": "string"
        },
        {
          "name": "string",
          "value": "string",
          "inheritance": "inherited",
          "propagation": "propagate",
          "source": "string"
        }
      ],
      "range_end_addr": "string",
      "range_failover_name": "string",
      "range_id": "string",
      "range_name": "string",
      "range_start_addr": "string",
      "scope_class_name": "string",
      "scope_id": "string",
      "scope_name": "string",
      "scope_net_addr": "string",
      "scope_size": "string",
      "server_addr": "string",
      "lease_mac_vendor": "string",
      "lease_multistatus": "string",
      "parameter_request_list": "string",
      "percent": "string",
      "time_to_expire": "string",
      "smart_parent_id": "string",
      "smart_parent_name": "string"
    },
    {
      "server_class_name": "string",
      "server_id": "string",
      "server_name": "string",
      "server_type": "string",
      "server_version": "string",
      "lease_addr": "string",
      "lease_circuit_id": "string",
      "lease_client_ident": "string",
      "lease_clientname": "string",
      "lease_domain": "string",
      "lease_end_time": "string",
      "lease_fingerbank_os": "string",
      "lease_first_time": "string",
      "lease_id": "string",
      "lease_address_addr": "string",
      "lease_mac_addr": "string",
      "lease_name": "string",
      "lease_period": "string",
      "lease_remote_id": "string",
      "lease_time": "string",
      "lease_vendor_id": "string",
      "range_class_name": "string",
      "range_class_parameters": [
        {
          "name": "string",
          "value": "string",
          "inheritance": "set",
          "propagation": "propagate",
          "source": "string"
        },
        {
          "name": "string",
          "value": "string",
          "inheritance": "inherited",
          "propagation": "restrict",
          "source": "string"
        },
        {
          "name": "string",
          "value": "string",
          "inheritance": "inherited",
          "propagation": "restrict",
          "source": "string"
        },
        {
          "name": "string",
          "value": "string",
          "inheritance": "set",
          "propagation": "propagate",
          "source": "string"
        },
        {
          "name": "string",
          "value": "string",
          "inheritance": "set",
          "propagation": "propagate",
          "source": "string"
        },
        {
          "name": "string",
          "value": "string",
          "inheritance": "set",
          "propagation": "restrict",
          "source": "string"
        },
        {
          "name": "string",
          "value": "string",
          "inheritance": "set",
          "propagation": "propagate",
          "source": "string"
        },
        {
          "name": "string",
          "value": "string",
          "inheritance": "set",
          "propagation": "restrict",
          "source": "string"
        }
      ],
      "range_end_addr": "string",
      "range_failover_name": "string",
      "range_id": "string",
      "range_name": "string",
      "range_start_addr": "string",
      "scope_class_name": "string",
      "scope_id": "string",
      "scope_name": "string",
      "scope_net_addr": "string",
      "scope_size": "string",
      "server_addr": "string",
      "lease_mac_vendor": "string",
      "lease_multistatus": "string",
      "parameter_request_list": "string",
      "percent": "string",
      "time_to_expire": "string",
      "smart_parent_id": "string",
      "smart_parent_name": "string"
    },
    {
      "server_class_name": "string",
      "server_id": "string",
      "server_name": "string",
      "server_type": "string",
      "server_version": "string",
      "lease_addr": "string",
      "lease_circuit_id": "string",
      "lease_client_ident": "string",
      "lease_clientname": "string",
      "lease_domain": "string",
      "lease_end_time": "string",
      "lease_fingerbank_os": "string",
      "lease_first_time": "string",
      "lease_id": "string",
      "lease_address_addr": "string",
      "lease_mac_addr": "string",
      "lease_name": "string",
      "lease_period": "string",
      "lease_remote_id": "string",
      "lease_time": "string",
      "lease_vendor_id": "string",
      "range_class_name": "string",
      "range_class_parameters": [
        {
          "name": "string",
          "value": "string",
          "inheritance": "set",
          "propagation": "restrict",
          "source": "string"
        },
        {
          "name": "string",
          "value": "string",
          "inheritance": "inherited",
          "propagation": "restrict",
          "source": "string"
        },
        {
          "name": "string",
          "value": "string",
          "inheritance": "inherited",
          "propagation": "propagate",
          "source": "string"
        }
      ],
      "range_end_addr": "string",
      "range_failover_name": "string",
      "range_id": "string",
      "range_name": "string",
      "range_start_addr": "string",
      "scope_class_name": "string",
      "scope_id": "string",
      "scope_name": "string",
      "scope_net_addr": "string",
      "scope_size": "string",
      "server_addr": "string",
      "lease_mac_vendor": "string",
      "lease_multistatus": "string",
      "parameter_request_list": "string",
      "percent": "string",
      "time_to_expire": "string",
      "smart_parent_id": "string",
      "smart_parent_name": "string"
    },
    {
      "server_class_name": "string",
      "server_id": "string",
      "server_name": "string",
      "server_type": "string",
      "server_version": "string",
      "lease_addr": "string",
      "lease_circuit_id": "string",
      "lease_client_ident": "string",
      "lease_clientname": "string",
      "lease_domain": "string",
      "lease_end_time": "string",
      "lease_fingerbank_os": "string",
      "lease_first_time": "string",
      "lease_id": "string",
      "lease_address_addr": "string",
      "lease_mac_addr": "string",
      "lease_name": "string",
      "lease_period": "string",
      "lease_remote_id": "string",
      "lease_time": "string",
      "lease_vendor_id": "string",
      "range_class_name": "string",
      "range_class_parameters": [
        {
          "name": "string",
          "value": "string",
          "inheritance": "set",
          "propagation": "propagate",
          "source": "string"
        },
        {
          "name": "string",
          "value": "string",
          "inheritance": "inherited",
          "propagation": "restrict",
          "source": "string"
        },
        {
          "name": "string",
          "value": "string",
          "inheritance": "set",
          "propagation": "restrict",
          "source": "string"
        },
        {
          "name": "string",
          "value": "string",
          "inheritance": "inherited",
          "propagation": "restrict",
          "source": "string"
        }
      ],
      "range_end_addr": "string",
      "range_failover_name": "string",
      "range_id": "string",
      "range_name": "string",
      "range_start_addr": "string",
      "scope_class_name": "string",
      "scope_id": "string",
      "scope_name": "string",
      "scope_net_addr": "string",
      "scope_size": "string",
      "server_addr": "string",
      "lease_mac_vendor": "string",
      "lease_multistatus": "string",
      "parameter_request_list": "string",
      "percent": "string",
      "time_to_expire": "string",
      "smart_parent_id": "string",
      "smart_parent_name": "string"
    },
    {
      "server_class_name": "string",
      "server_id": "string",
      "server_name": "string",
      "server_type": "string",
      "server_version": "string",
      "lease_addr": "string",
      "lease_circuit_id": "string",
      "lease_client_ident": "string",
      "lease_clientname": "string",
      "lease_domain": "string",
      "lease_end_time": "string",
      "lease_fingerbank_os": "string",
      "lease_first_time": "string",
      "lease_id": "string",
      "lease_address_addr": "string",
      "lease_mac_addr": "string",
      "lease_name": "string",
      "lease_period": "string",
      "lease_remote_id": "string",
      "lease_time": "string",
      "lease_vendor_id": "string",
      "range_class_name": "string",
      "range_class_parameters": [
        {
          "name": "string",
          "value": "string",
          "inheritance": "inherited",
          "propagation": "propagate",
          "source": "string"
        },
        {
          "name": "string",
          "value": "string",
          "inheritance": "set",
          "propagation": "propagate",
          "source": "string"
        },
        {
          "name": "string",
          "value": "string",
          "inheritance": "inherited",
          "propagation": "restrict",
          "source": "string"
        },
        {
          "name": "string",
          "value": "string",
          "inheritance": "inherited",
          "propagation": "propagate",
          "source": "string"
        }
      ],
      "range_end_addr": "string",
      "range_failover_name": "string",
      "range_id": "string",
      "range_name": "string",
      "range_start_addr": "string",
      "scope_class_name": "string",
      "scope_id": "string",
      "scope_name": "string",
      "scope_net_addr": "string",
      "scope_size": "string",
      "server_addr": "string",
      "lease_mac_vendor": "string",
      "lease_multistatus": "string",
      "parameter_request_list": "string",
      "percent": "string",
      "time_to_expire": "string",
      "smart_parent_id": "string",
      "smart_parent_name": "string"
    },
    {
      "server_class_name": "string",
      "server_id": "string",
      "server_name": "string",
      "server_type": "string",
      "server_version": "string",
      "lease_addr": "string",
      "lease_circuit_id": "string",
      "lease_client_ident": "string",
      "lease_clientname": "string",
      "lease_domain": "string",
      "lease_end_time": "string",
      "lease_fingerbank_os": "string",
      "lease_first_time": "string",
      "lease_id": "string",
      "lease_address_addr": "string",
      "lease_mac_addr": "string",
      "lease_name": "string",
      "lease_period": "string",
      "lease_remote_id": "string",
      "lease_time": "string",
      "lease_vendor_id": "string",
      "range_class_name": "string",
      "range_class_parameters": [
        {
          "name": "string",
          "value": "string",
          "inheritance": "set",
          "propagation": "restrict",
          "source": "string"
        },
        {
          "name": "string",
          "value": "string",
          "inheritance": "inherited",
          "propagation": "restrict",
          "source": "string"
        },
        {
          "name": "string",
          "value": "string",
          "inheritance": "set",
          "propagation": "restrict",
          "source": "string"
        },
        {
          "name": "string",
          "value": "string",
          "inheritance": "inherited",
          "propagation": "propagate",
          "source": "string"
        },
        {
          "name": "string",
          "value": "string",
          "inheritance": "set",
          "propagation": "restrict",
          "source": "string"
        },
        {
          "name": "string",
          "value": "string",
          "inheritance": "set",
          "propagation": "restrict",
          "source": "string"
        },
        {
          "name": "string",
          "value": "string",
          "inheritance": "set",
          "propagation": "restrict",
          "source": "string"
        },
        {
          "name": "string",
          "value": "string",
          "inheritance": "inherited",
          "propagation": "restrict",
          "source": "string"
        }
      ],
      "range_end_addr": "string",
      "range_failover_name": "string",
      "range_id": "string",
      "range_name": "string",
      "range_start_addr": "string",
      "scope_class_name": "string",
      "scope_id": "string",
      "scope_name": "string",
      "scope_net_addr": "string",
      "scope_size": "string",
      "server_addr": "string",
      "lease_mac_vendor": "string",
      "lease_multistatus": "string",
      "parameter_request_list": "string",
      "percent": "string",
      "time_to_expire": "string",
      "smart_parent_id": "string",
      "smart_parent_name": "string"
    },
    {
      "server_class_name": "string",
      "server_id": "string",
      "server_name": "string",
      "server_type": "string",
      "server_version": "string",
      "lease_addr": "string",
      "lease_circuit_id": "string",
      "lease_client_ident": "string",
      "lease_clientname": "string",
      "lease_domain": "string",
      "lease_end_time": "string",
      "lease_fingerbank_os": "string",
      "lease_first_time": "string",
      "lease_id": "string",
      "lease_address_addr": "string",
      "lease_mac_addr": "string",
      "lease_name": "string",
      "lease_period": "string",
      "lease_remote_id": "string",
      "lease_time": "string",
      "lease_vendor_id": "string",
      "range_class_name": "string",
      "range_class_parameters": [
        {
          "name": "string",
          "value": "string",
          "inheritance": "inherited",
          "propagation": "propagate",
          "source": "string"
        },
        {
          "name": "string",
          "value": "string",
          "inheritance": "set",
          "propagation": "propagate",
          "source": "string"
        },
        {
          "name": "string",
          "value": "string",
          "inheritance": "inherited",
          "propagation": "restrict",
          "source": "string"
        },
        {
          "name": "string",
          "value": "string",
          "inheritance": "set",
          "propagation": "propagate",
          "source": "string"
        },
        {
          "name": "string",
          "value": "string",
          "inheritance": "set",
          "propagation": "restrict",
          "source": "string"
        },
        {
          "name": "string",
          "value": "string",
          "inheritance": "inherited",
          "propagation": "restrict",
          "source": "string"
        },
        {
          "name": "string",
          "value": "string",
          "inheritance": "set",
          "propagation": "restrict",
          "source": "string"
        }
      ],
      "range_end_addr": "string",
      "range_failover_name": "string",
      "range_id": "string",
      "range_name": "string",
      "range_start_addr": "string",
      "scope_class_name": "string",
      "scope_id": "string",
      "scope_name": "string",
      "scope_net_addr": "string",
      "scope_size": "string",
      "server_addr": "string",
      "lease_mac_vendor": "string",
      "lease_multistatus": "string",
      "parameter_request_list": "string",
      "percent": "string",
      "time_to_expire": "string",
      "smart_parent_id": "string",
      "smart_parent_name": "string"
    },
    {
      "server_class_name": "string",
      "server_id": "string",
      "server_name": "string",
      "server_type": "string",
      "server_version": "string",
      "lease_addr": "string",
      "lease_circuit_id": "string",
      "lease_client_ident": "string",
      "lease_clientname": "string",
      "lease_domain": "string",
      "lease_end_time": "string",
      "lease_fingerbank_os": "string",
      "lease_first_time": "string",
      "lease_id": "string",
      "lease_address_addr": "string",
      "lease_mac_addr": "string",
      "lease_name": "string",
      "lease_period": "string",
      "lease_remote_id": "string",
      "lease_time": "string",
      "lease_vendor_id": "string",
      "range_class_name": "string",
      "range_class_parameters": [
        {
          "name": "string",
          "value": "string",
          "inheritance": "inherited",
          "propagation": "propagate",
          "source": "string"
        },
        {
          "name": "string",
          "value": "string",
          "inheritance": "inherited",
          "propagation": "propagate",
          "source": "string"
        },
        {
          "name": "string",
          "value": "string",
          "inheritance": "set",
          "propagation": "propagate",
          "source": "string"
        },
        {
          "name": "string",
          "value": "string",
          "inheritance": "set",
          "propagation": "propagate",
          "source": "string"
        },
        {
          "name": "string",
          "value": "string",
          "inheritance": "inherited",
          "propagation": "propagate",
          "source": "string"
        },
        {
          "name": "string",
          "value": "string",
          "inheritance": "inherited",
          "propagation": "restrict",
          "source": "string"
        },
        {
          "name": "string",
          "value": "string",
          "inheritance": "set",
          "propagation": "propagate",
          "source": "string"
        },
        {
          "name": "string",
          "value": "string",
          "inheritance": "inherited",
          "propagation": "propagate",
          "source": "string"
        },
        {
          "name": "string",
          "value": "string",
          "inheritance": "set",
          "propagation": "propagate",
          "source": "string"
        },
        {
          "name": "string",
          "value": "string",
          "inheritance": "set",
          "propagation": "restrict",
          "source": "string"
        }
      ],
      "range_end_addr": "string",
      "range_failover_name": "string",
      "range_id": "string",
      "range_name": "string",
      "range_start_addr": "string",
      "scope_class_name": "string",
      "scope_id": "string",
      "scope_name": "string",
      "scope_net_addr": "string",
      "scope_size": "string",
      "server_addr": "string",
      "lease_mac_vendor": "string",
      "lease_multistatus": "string",
      "parameter_request_list": "string",
      "percent": "string",
      "time_to_expire": "string",
      "smart_parent_id": "string",
      "smart_parent_name": "string"
    }
  ]
}