{
  "success": false,
  "messages": [
    {
      "code": 1,
      "msg": "string",
      "type": "error",
      "extra": {}
    },
    {
      "code": 5,
      "msg": "string",
      "type": "warning",
      "extra": {}
    },
    {
      "code": 7,
      "msg": "string",
      "type": "warning",
      "extra": {}
    }
  ],
  "data": [
    {
      "count": 7
    },
    {
      "count": 7
    },
    {
      "count": 2
    },
    {
      "count": 7
    },
    {
      "count": 1
    }
  ]
}