{
  "success": false,
  "messages": [
    {
      "code": 4,
      "msg": "string",
      "type": "warning",
      "extra": {}
    },
    {
      "code": 3,
      "msg": "string",
      "type": "notice",
      "extra": {}
    },
    {
      "code": 2,
      "msg": "string",
      "type": "warning",
      "extra": {}
    },
    {
      "code": 10,
      "msg": "string",
      "type": "error",
      "extra": {}
    },
    {
      "code": 7,
      "msg": "string",
      "type": "notice",
      "extra": {}
    },
    {
      "code": 3,
      "msg": "string",
      "type": "notice",
      "extra": {}
    },
    {
      "code": 7,
      "msg": "string",
      "type": "error",
      "extra": {}
    },
    {
      "code": 1,
      "msg": "string",
      "type": "error",
      "extra": {}
    }
  ],
  "data": [
    {
      "count": 8
    },
    {
      "count": 6
    },
    {
      "count": 3
    },
    {
      "count": 4
    }
  ]
}