{
  "success": false,
  "messages": [
    {
      "code": 9,
      "msg": "string",
      "type": "error",
      "extra": {}
    },
    {
      "code": 7,
      "msg": "string",
      "type": "warning",
      "extra": {}
    },
    {
      "code": 7,
      "msg": "string",
      "type": "warning",
      "extra": {}
    },
    {
      "code": 1,
      "msg": "string",
      "type": "notice",
      "extra": {}
    },
    {
      "code": 2,
      "msg": "string",
      "type": "error",
      "extra": {}
    },
    {
      "code": 7,
      "msg": "string",
      "type": "warning",
      "extra": {}
    }
  ],
  "data": [
    {
      "static6_id": "string"
    },
    {
      "static6_id": "string"
    },
    {
      "static6_id": "string"
    }
  ]
}