{
  "success": false,
  "messages": [
    {
      "code": 2,
      "msg": "string",
      "type": "warning",
      "extra": {}
    },
    {
      "code": 5,
      "msg": "string",
      "type": "notice",
      "extra": {}
    },
    {
      "code": 7,
      "msg": "string",
      "type": "warning",
      "extra": {}
    },
    {
      "code": 8,
      "msg": "string",
      "type": "notice",
      "extra": {}
    },
    {
      "code": 2,
      "msg": "string",
      "type": "error",
      "extra": {}
    },
    {
      "code": 9,
      "msg": "string",
      "type": "error",
      "extra": {}
    },
    {
      "code": 9,
      "msg": "string",
      "type": "notice",
      "extra": {}
    },
    {
      "code": 8,
      "msg": "string",
      "type": "notice",
      "extra": {}
    }
  ],
  "data": [
    {
      "server_aws_keyid": "string",
      "server_allow_query": "string",
      "server_allow_query_cache": "string",
      "server_allow_recursion": "string",
      "server_allow_transfer": "string",
      "server_also_notify": "string",
      "server_ans_key": "string",
      "server_class_name": "string",
      "server_class_parameters": [
        {
          "name": "string",
          "value": "string",
          "inheritance": "inherited",
          "propagation": "propagate",
          "source": "string"
        },
        {
          "name": "string",
          "value": "string",
          "inheritance": "inherited",
          "propagation": "propagate",
          "source": "string"
        },
        {
          "name": "string",
          "value": "string",
          "inheritance": "set",
          "propagation": "restrict",
          "source": "string"
        },
        {
          "name": "string",
          "value": "string",
          "inheritance": "inherited",
          "propagation": "propagate",
          "source": "string"
        }
      ],
      "server_cloud": "string",
      "server_comment": "string",
      "server_force_hybrid": "string",
      "server_forward": "string",
      "server_forwarders": "string",
      "server_hybrid": "string",
      "server_id": "string",
      "server_key_name": "string",
      "server_key_proto": "string",
      "server_key_value": "string",
      "server_name": "string",
      "server_notify": "string",
      "server_recursion": "string",
      "server_role": "string",
      "server_state": "string",
      "server_synching": "string",
      "server_type": "string",
      "server_version": "string",
      "server_blast_enabled": "string",
      "server_blast_status": "string",
      "server_gslb_supported": "string",
      "server_guardian_gui_management_supported": "string",
      "server_guardian_supported": "string",
      "server_dnssec_validation": "string",
      "server_gss_enabled": "string",
      "server_gss_keytab_id": "string",
      "server_addr": "string",
      "server_ip_id": "string",
      "server_ipm_hsm_enabled": "string",
      "server_ipm_login": "string",
      "server_ipm_is_package": "string",
      "server_ipm_protocol": "string",
      "server_ipm_type": "string",
      "server_isolated": "string",
      "server_ldap_domain": "string",
      "server_ldap_password": "string",
      "server_ldap_user": "string",
      "server_multistatus": "string",
      "server_querylog_state": "string",
      "space_id": "string",
      "space_name": "string",
      "server_snmp_id": "string",
      "server_stat_enabled": "string",
      "server_stat_niceness": "string",
      "server_stat_period": "string",
      "server_stat_time": "string",
      "total_smart_members": "string",
      "smart_arch": "string",
      "smart_members_name": "string",
      "smart_parent_arch": "string",
      "smart_parent_id": "string",
      "smart_parent_name": "string",
      "smart_public_ns_list": "string",
      "server_windns_port": "string",
      "server_windns_protocol": "string",
      "server_windns_use_ssl": "string"
    },
    {
      "server_aws_keyid": "string",
      "server_allow_query": "string",
      "server_allow_query_cache": "string",
      "server_allow_recursion": "string",
      "server_allow_transfer": "string",
      "server_also_notify": "string",
      "server_ans_key": "string",
      "server_class_name": "string",
      "server_class_parameters": [
        {
          "name": "string",
          "value": "string",
          "inheritance": "inherited",
          "propagation": "restrict",
          "source": "string"
        },
        {
          "name": "string",
          "value": "string",
          "inheritance": "inherited",
          "propagation": "restrict",
          "source": "string"
        },
        {
          "name": "string",
          "value": "string",
          "inheritance": "inherited",
          "propagation": "restrict",
          "source": "string"
        },
        {
          "name": "string",
          "value": "string",
          "inheritance": "set",
          "propagation": "propagate",
          "source": "string"
        },
        {
          "name": "string",
          "value": "string",
          "inheritance": "inherited",
          "propagation": "propagate",
          "source": "string"
        },
        {
          "name": "string",
          "value": "string",
          "inheritance": "inherited",
          "propagation": "propagate",
          "source": "string"
        },
        {
          "name": "string",
          "value": "string",
          "inheritance": "inherited",
          "propagation": "propagate",
          "source": "string"
        },
        {
          "name": "string",
          "value": "string",
          "inheritance": "inherited",
          "propagation": "restrict",
          "source": "string"
        },
        {
          "name": "string",
          "value": "string",
          "inheritance": "inherited",
          "propagation": "propagate",
          "source": "string"
        }
      ],
      "server_cloud": "string",
      "server_comment": "string",
      "server_force_hybrid": "string",
      "server_forward": "string",
      "server_forwarders": "string",
      "server_hybrid": "string",
      "server_id": "string",
      "server_key_name": "string",
      "server_key_proto": "string",
      "server_key_value": "string",
      "server_name": "string",
      "server_notify": "string",
      "server_recursion": "string",
      "server_role": "string",
      "server_state": "string",
      "server_synching": "string",
      "server_type": "string",
      "server_version": "string",
      "server_blast_enabled": "string",
      "server_blast_status": "string",
      "server_gslb_supported": "string",
      "server_guardian_gui_management_supported": "string",
      "server_guardian_supported": "string",
      "server_dnssec_validation": "string",
      "server_gss_enabled": "string",
      "server_gss_keytab_id": "string",
      "server_addr": "string",
      "server_ip_id": "string",
      "server_ipm_hsm_enabled": "string",
      "server_ipm_login": "string",
      "server_ipm_is_package": "string",
      "server_ipm_protocol": "string",
      "server_ipm_type": "string",
      "server_isolated": "string",
      "server_ldap_domain": "string",
      "server_ldap_password": "string",
      "server_ldap_user": "string",
      "server_multistatus": "string",
      "server_querylog_state": "string",
      "space_id": "string",
      "space_name": "string",
      "server_snmp_id": "string",
      "server_stat_enabled": "string",
      "server_stat_niceness": "string",
      "server_stat_period": "string",
      "server_stat_time": "string",
      "total_smart_members": "string",
      "smart_arch": "string",
      "smart_members_name": "string",
      "smart_parent_arch": "string",
      "smart_parent_id": "string",
      "smart_parent_name": "string",
      "smart_public_ns_list": "string",
      "server_windns_port": "string",
      "server_windns_protocol": "string",
      "server_windns_use_ssl": "string"
    },
    {
      "server_aws_keyid": "string",
      "server_allow_query": "string",
      "server_allow_query_cache": "string",
      "server_allow_recursion": "string",
      "server_allow_transfer": "string",
      "server_also_notify": "string",
      "server_ans_key": "string",
      "server_class_name": "string",
      "server_class_parameters": [
        {
          "name": "string",
          "value": "string",
          "inheritance": "inherited",
          "propagation": "propagate",
          "source": "string"
        },
        {
          "name": "string",
          "value": "string",
          "inheritance": "set",
          "propagation": "restrict",
          "source": "string"
        },
        {
          "name": "string",
          "value": "string",
          "inheritance": "set",
          "propagation": "propagate",
          "source": "string"
        },
        {
          "name": "string",
          "value": "string",
          "inheritance": "set",
          "propagation": "propagate",
          "source": "string"
        },
        {
          "name": "string",
          "value": "string",
          "inheritance": "inherited",
          "propagation": "propagate",
          "source": "string"
        },
        {
          "name": "string",
          "value": "string",
          "inheritance": "inherited",
          "propagation": "restrict",
          "source": "string"
        },
        {
          "name": "string",
          "value": "string",
          "inheritance": "inherited",
          "propagation": "propagate",
          "source": "string"
        }
      ],
      "server_cloud": "string",
      "server_comment": "string",
      "server_force_hybrid": "string",
      "server_forward": "string",
      "server_forwarders": "string",
      "server_hybrid": "string",
      "server_id": "string",
      "server_key_name": "string",
      "server_key_proto": "string",
      "server_key_value": "string",
      "server_name": "string",
      "server_notify": "string",
      "server_recursion": "string",
      "server_role": "string",
      "server_state": "string",
      "server_synching": "string",
      "server_type": "string",
      "server_version": "string",
      "server_blast_enabled": "string",
      "server_blast_status": "string",
      "server_gslb_supported": "string",
      "server_guardian_gui_management_supported": "string",
      "server_guardian_supported": "string",
      "server_dnssec_validation": "string",
      "server_gss_enabled": "string",
      "server_gss_keytab_id": "string",
      "server_addr": "string",
      "server_ip_id": "string",
      "server_ipm_hsm_enabled": "string",
      "server_ipm_login": "string",
      "server_ipm_is_package": "string",
      "server_ipm_protocol": "string",
      "server_ipm_type": "string",
      "server_isolated": "string",
      "server_ldap_domain": "string",
      "server_ldap_password": "string",
      "server_ldap_user": "string",
      "server_multistatus": "string",
      "server_querylog_state": "string",
      "space_id": "string",
      "space_name": "string",
      "server_snmp_id": "string",
      "server_stat_enabled": "string",
      "server_stat_niceness": "string",
      "server_stat_period": "string",
      "server_stat_time": "string",
      "total_smart_members": "string",
      "smart_arch": "string",
      "smart_members_name": "string",
      "smart_parent_arch": "string",
      "smart_parent_id": "string",
      "smart_parent_name": "string",
      "smart_public_ns_list": "string",
      "server_windns_port": "string",
      "server_windns_protocol": "string",
      "server_windns_use_ssl": "string"
    },
    {
      "server_aws_keyid": "string",
      "server_allow_query": "string",
      "server_allow_query_cache": "string",
      "server_allow_recursion": "string",
      "server_allow_transfer": "string",
      "server_also_notify": "string",
      "server_ans_key": "string",
      "server_class_name": "string",
      "server_class_parameters": [
        {
          "name": "string",
          "value": "string",
          "inheritance": "set",
          "propagation": "propagate",
          "source": "string"
        },
        {
          "name": "string",
          "value": "string",
          "inheritance": "set",
          "propagation": "restrict",
          "source": "string"
        },
        {
          "name": "string",
          "value": "string",
          "inheritance": "set",
          "propagation": "propagate",
          "source": "string"
        },
        {
          "name": "string",
          "value": "string",
          "inheritance": "inherited",
          "propagation": "restrict",
          "source": "string"
        },
        {
          "name": "string",
          "value": "string",
          "inheritance": "set",
          "propagation": "restrict",
          "source": "string"
        },
        {
          "name": "string",
          "value": "string",
          "inheritance": "set",
          "propagation": "propagate",
          "source": "string"
        },
        {
          "name": "string",
          "value": "string",
          "inheritance": "set",
          "propagation": "propagate",
          "source": "string"
        },
        {
          "name": "string",
          "value": "string",
          "inheritance": "set",
          "propagation": "propagate",
          "source": "string"
        }
      ],
      "server_cloud": "string",
      "server_comment": "string",
      "server_force_hybrid": "string",
      "server_forward": "string",
      "server_forwarders": "string",
      "server_hybrid": "string",
      "server_id": "string",
      "server_key_name": "string",
      "server_key_proto": "string",
      "server_key_value": "string",
      "server_name": "string",
      "server_notify": "string",
      "server_recursion": "string",
      "server_role": "string",
      "server_state": "string",
      "server_synching": "string",
      "server_type": "string",
      "server_version": "string",
      "server_blast_enabled": "string",
      "server_blast_status": "string",
      "server_gslb_supported": "string",
      "server_guardian_gui_management_supported": "string",
      "server_guardian_supported": "string",
      "server_dnssec_validation": "string",
      "server_gss_enabled": "string",
      "server_gss_keytab_id": "string",
      "server_addr": "string",
      "server_ip_id": "string",
      "server_ipm_hsm_enabled": "string",
      "server_ipm_login": "string",
      "server_ipm_is_package": "string",
      "server_ipm_protocol": "string",
      "server_ipm_type": "string",
      "server_isolated": "string",
      "server_ldap_domain": "string",
      "server_ldap_password": "string",
      "server_ldap_user": "string",
      "server_multistatus": "string",
      "server_querylog_state": "string",
      "space_id": "string",
      "space_name": "string",
      "server_snmp_id": "string",
      "server_stat_enabled": "string",
      "server_stat_niceness": "string",
      "server_stat_period": "string",
      "server_stat_time": "string",
      "total_smart_members": "string",
      "smart_arch": "string",
      "smart_members_name": "string",
      "smart_parent_arch": "string",
      "smart_parent_id": "string",
      "smart_parent_name": "string",
      "smart_public_ns_list": "string",
      "server_windns_port": "string",
      "server_windns_protocol": "string",
      "server_windns_use_ssl": "string"
    }
  ]
}