{
  "success": false,
  "messages": [
    {
      "code": 5,
      "msg": "string",
      "type": "error",
      "extra": {}
    },
    {
      "code": 10,
      "msg": "string",
      "type": "notice",
      "extra": {}
    },
    {
      "code": 5,
      "msg": "string",
      "type": "notice",
      "extra": {}
    },
    {
      "code": 4,
      "msg": "string",
      "type": "warning",
      "extra": {}
    },
    {
      "code": 9,
      "msg": "string",
      "type": "error",
      "extra": {}
    }
  ],
  "data": [
    {
      "count": 6
    },
    {
      "count": 1
    },
    {
      "count": 9
    }
  ]
}