{
  "success": false,
  "messages": [
    {
      "code": 2,
      "msg": "string",
      "type": "notice",
      "extra": {}
    },
    {
      "code": 2,
      "msg": "string",
      "type": "notice",
      "extra": {}
    }
  ],
  "data": [
    {
      "count": 5
    },
    {
      "count": 2
    },
    {
      "count": 3
    },
    {
      "count": 5
    },
    {
      "count": 6
    },
    {
      "count": 5
    },
    {
      "count": 2
    },
    {
      "count": 9
    },
    {
      "count": 9
    }
  ]
}