{
  "success": true,
  "messages": [
    {
      "code": 6,
      "msg": "string",
      "type": "warning",
      "extra": {}
    },
    {
      "code": 2,
      "msg": "string",
      "type": "warning",
      "extra": {}
    },
    {
      "code": 3,
      "msg": "string",
      "type": "error",
      "extra": {}
    },
    {
      "code": 1,
      "msg": "string",
      "type": "notice",
      "extra": {}
    },
    {
      "code": 3,
      "msg": "string",
      "type": "error",
      "extra": {}
    }
  ],
  "data": [
    {
      "view_id": "string"
    }
  ]
}