{
  "success": false,
  "messages": [
    {
      "code": 6,
      "msg": "string",
      "type": "error",
      "extra": {}
    },
    {
      "code": 7,
      "msg": "string",
      "type": "warning",
      "extra": {}
    },
    {
      "code": 10,
      "msg": "string",
      "type": "notice",
      "extra": {}
    }
  ],
  "data": [
    {
      "application_class_name": "string",
      "application_class_parameters": [
        {
          "name": "string",
          "value": "string",
          "inheritance": "inherited",
          "propagation": "restrict",
          "source": "string"
        },
        {
          "name": "string",
          "value": "string",
          "inheritance": "inherited",
          "propagation": "restrict",
          "source": "string"
        },
        {
          "name": "string",
          "value": "string",
          "inheritance": "set",
          "propagation": "restrict",
          "source": "string"
        },
        {
          "name": "string",
          "value": "string",
          "inheritance": "set",
          "propagation": "propagate",
          "source": "string"
        },
        {
          "name": "string",
          "value": "string",
          "inheritance": "inherited",
          "propagation": "propagate",
          "source": "string"
        }
      ],
      "application_fqdn": "string",
      "gslbserver_id": "string",
      "gslbserver_list": "string",
      "gslbserver_name": "string",
      "gslbserver_status": "string",
      "application_id": "string",
      "application_inactive_nodes": "string",
      "application_name": "string",
      "application_total_nodes": "string",
      "application_delayed_time": "string",
      "gslbserver_type": "string",
      "application_multistatus": "string",
      "parent_application_id": "string",
      "parent_application_name": "string"
    },
    {
      "application_class_name": "string",
      "application_class_parameters": [
        {
          "name": "string",
          "value": "string",
          "inheritance": "set",
          "propagation": "propagate",
          "source": "string"
        },
        {
          "name": "string",
          "value": "string",
          "inheritance": "inherited",
          "propagation": "propagate",
          "source": "string"
        }
      ],
      "application_fqdn": "string",
      "gslbserver_id": "string",
      "gslbserver_list": "string",
      "gslbserver_name": "string",
      "gslbserver_status": "string",
      "application_id": "string",
      "application_inactive_nodes": "string",
      "application_name": "string",
      "application_total_nodes": "string",
      "application_delayed_time": "string",
      "gslbserver_type": "string",
      "application_multistatus": "string",
      "parent_application_id": "string",
      "parent_application_name": "string"
    },
    {
      "application_class_name": "string",
      "application_class_parameters": [
        {
          "name": "string",
          "value": "string",
          "inheritance": "set",
          "propagation": "propagate",
          "source": "string"
        },
        {
          "name": "string",
          "value": "string",
          "inheritance": "set",
          "propagation": "restrict",
          "source": "string"
        },
        {
          "name": "string",
          "value": "string",
          "inheritance": "set",
          "propagation": "propagate",
          "source": "string"
        },
        {
          "name": "string",
          "value": "string",
          "inheritance": "set",
          "propagation": "propagate",
          "source": "string"
        },
        {
          "name": "string",
          "value": "string",
          "inheritance": "inherited",
          "propagation": "propagate",
          "source": "string"
        }
      ],
      "application_fqdn": "string",
      "gslbserver_id": "string",
      "gslbserver_list": "string",
      "gslbserver_name": "string",
      "gslbserver_status": "string",
      "application_id": "string",
      "application_inactive_nodes": "string",
      "application_name": "string",
      "application_total_nodes": "string",
      "application_delayed_time": "string",
      "gslbserver_type": "string",
      "application_multistatus": "string",
      "parent_application_id": "string",
      "parent_application_name": "string"
    },
    {
      "application_class_name": "string",
      "application_class_parameters": [
        {
          "name": "string",
          "value": "string",
          "inheritance": "inherited",
          "propagation": "restrict",
          "source": "string"
        },
        {
          "name": "string",
          "value": "string",
          "inheritance": "inherited",
          "propagation": "propagate",
          "source": "string"
        }
      ],
      "application_fqdn": "string",
      "gslbserver_id": "string",
      "gslbserver_list": "string",
      "gslbserver_name": "string",
      "gslbserver_status": "string",
      "application_id": "string",
      "application_inactive_nodes": "string",
      "application_name": "string",
      "application_total_nodes": "string",
      "application_delayed_time": "string",
      "gslbserver_type": "string",
      "application_multistatus": "string",
      "parent_application_id": "string",
      "parent_application_name": "string"
    },
    {
      "application_class_name": "string",
      "application_class_parameters": [
        {
          "name": "string",
          "value": "string",
          "inheritance": "set",
          "propagation": "restrict",
          "source": "string"
        },
        {
          "name": "string",
          "value": "string",
          "inheritance": "inherited",
          "propagation": "restrict",
          "source": "string"
        },
        {
          "name": "string",
          "value": "string",
          "inheritance": "inherited",
          "propagation": "restrict",
          "source": "string"
        },
        {
          "name": "string",
          "value": "string",
          "inheritance": "inherited",
          "propagation": "propagate",
          "source": "string"
        }
      ],
      "application_fqdn": "string",
      "gslbserver_id": "string",
      "gslbserver_list": "string",
      "gslbserver_name": "string",
      "gslbserver_status": "string",
      "application_id": "string",
      "application_inactive_nodes": "string",
      "application_name": "string",
      "application_total_nodes": "string",
      "application_delayed_time": "string",
      "gslbserver_type": "string",
      "application_multistatus": "string",
      "parent_application_id": "string",
      "parent_application_name": "string"
    },
    {
      "application_class_name": "string",
      "application_class_parameters": [
        {
          "name": "string",
          "value": "string",
          "inheritance": "inherited",
          "propagation": "propagate",
          "source": "string"
        },
        {
          "name": "string",
          "value": "string",
          "inheritance": "inherited",
          "propagation": "restrict",
          "source": "string"
        },
        {
          "name": "string",
          "value": "string",
          "inheritance": "set",
          "propagation": "propagate",
          "source": "string"
        },
        {
          "name": "string",
          "value": "string",
          "inheritance": "set",
          "propagation": "propagate",
          "source": "string"
        }
      ],
      "application_fqdn": "string",
      "gslbserver_id": "string",
      "gslbserver_list": "string",
      "gslbserver_name": "string",
      "gslbserver_status": "string",
      "application_id": "string",
      "application_inactive_nodes": "string",
      "application_name": "string",
      "application_total_nodes": "string",
      "application_delayed_time": "string",
      "gslbserver_type": "string",
      "application_multistatus": "string",
      "parent_application_id": "string",
      "parent_application_name": "string"
    },
    {
      "application_class_name": "string",
      "application_class_parameters": [
        {
          "name": "string",
          "value": "string",
          "inheritance": "set",
          "propagation": "restrict",
          "source": "string"
        },
        {
          "name": "string",
          "value": "string",
          "inheritance": "set",
          "propagation": "propagate",
          "source": "string"
        }
      ],
      "application_fqdn": "string",
      "gslbserver_id": "string",
      "gslbserver_list": "string",
      "gslbserver_name": "string",
      "gslbserver_status": "string",
      "application_id": "string",
      "application_inactive_nodes": "string",
      "application_name": "string",
      "application_total_nodes": "string",
      "application_delayed_time": "string",
      "gslbserver_type": "string",
      "application_multistatus": "string",
      "parent_application_id": "string",
      "parent_application_name": "string"
    },
    {
      "application_class_name": "string",
      "application_class_parameters": [
        {
          "name": "string",
          "value": "string",
          "inheritance": "inherited",
          "propagation": "restrict",
          "source": "string"
        },
        {
          "name": "string",
          "value": "string",
          "inheritance": "inherited",
          "propagation": "propagate",
          "source": "string"
        },
        {
          "name": "string",
          "value": "string",
          "inheritance": "set",
          "propagation": "restrict",
          "source": "string"
        },
        {
          "name": "string",
          "value": "string",
          "inheritance": "set",
          "propagation": "propagate",
          "source": "string"
        },
        {
          "name": "string",
          "value": "string",
          "inheritance": "inherited",
          "propagation": "propagate",
          "source": "string"
        },
        {
          "name": "string",
          "value": "string",
          "inheritance": "set",
          "propagation": "restrict",
          "source": "string"
        },
        {
          "name": "string",
          "value": "string",
          "inheritance": "inherited",
          "propagation": "propagate",
          "source": "string"
        },
        {
          "name": "string",
          "value": "string",
          "inheritance": "inherited",
          "propagation": "propagate",
          "source": "string"
        }
      ],
      "application_fqdn": "string",
      "gslbserver_id": "string",
      "gslbserver_list": "string",
      "gslbserver_name": "string",
      "gslbserver_status": "string",
      "application_id": "string",
      "application_inactive_nodes": "string",
      "application_name": "string",
      "application_total_nodes": "string",
      "application_delayed_time": "string",
      "gslbserver_type": "string",
      "application_multistatus": "string",
      "parent_application_id": "string",
      "parent_application_name": "string"
    },
    {
      "application_class_name": "string",
      "application_class_parameters": [
        {
          "name": "string",
          "value": "string",
          "inheritance": "set",
          "propagation": "restrict",
          "source": "string"
        },
        {
          "name": "string",
          "value": "string",
          "inheritance": "inherited",
          "propagation": "propagate",
          "source": "string"
        },
        {
          "name": "string",
          "value": "string",
          "inheritance": "inherited",
          "propagation": "restrict",
          "source": "string"
        },
        {
          "name": "string",
          "value": "string",
          "inheritance": "set",
          "propagation": "propagate",
          "source": "string"
        }
      ],
      "application_fqdn": "string",
      "gslbserver_id": "string",
      "gslbserver_list": "string",
      "gslbserver_name": "string",
      "gslbserver_status": "string",
      "application_id": "string",
      "application_inactive_nodes": "string",
      "application_name": "string",
      "application_total_nodes": "string",
      "application_delayed_time": "string",
      "gslbserver_type": "string",
      "application_multistatus": "string",
      "parent_application_id": "string",
      "parent_application_name": "string"
    },
    {
      "application_class_name": "string",
      "application_class_parameters": [
        {
          "name": "string",
          "value": "string",
          "inheritance": "set",
          "propagation": "propagate",
          "source": "string"
        },
        {
          "name": "string",
          "value": "string",
          "inheritance": "inherited",
          "propagation": "propagate",
          "source": "string"
        },
        {
          "name": "string",
          "value": "string",
          "inheritance": "set",
          "propagation": "restrict",
          "source": "string"
        },
        {
          "name": "string",
          "value": "string",
          "inheritance": "set",
          "propagation": "restrict",
          "source": "string"
        },
        {
          "name": "string",
          "value": "string",
          "inheritance": "set",
          "propagation": "restrict",
          "source": "string"
        },
        {
          "name": "string",
          "value": "string",
          "inheritance": "set",
          "propagation": "propagate",
          "source": "string"
        },
        {
          "name": "string",
          "value": "string",
          "inheritance": "inherited",
          "propagation": "restrict",
          "source": "string"
        },
        {
          "name": "string",
          "value": "string",
          "inheritance": "inherited",
          "propagation": "restrict",
          "source": "string"
        },
        {
          "name": "string",
          "value": "string",
          "inheritance": "set",
          "propagation": "propagate",
          "source": "string"
        }
      ],
      "application_fqdn": "string",
      "gslbserver_id": "string",
      "gslbserver_list": "string",
      "gslbserver_name": "string",
      "gslbserver_status": "string",
      "application_id": "string",
      "application_inactive_nodes": "string",
      "application_name": "string",
      "application_total_nodes": "string",
      "application_delayed_time": "string",
      "gslbserver_type": "string",
      "application_multistatus": "string",
      "parent_application_id": "string",
      "parent_application_name": "string"
    }
  ]
}