{  
  "type": "oci/container",
  "id": 1,
  "href": "oci/container/1",
  "transientAttributes": {},
  "name": "001.02",
  "_type": "RACK",
  "vendor": "ERICSSON",
  "model": "",
  "unitOfMeasure": "Inch",
  "networkId": "",
  "serialNumber": "",
  "status": "Live",
  "dimensionUnits": "INCHES",
  "dimDepth": 0,
  "dimHeight": 0,
  "dimWidth": 0,
  "key": {
    "type": "oci/containerKey",
    "keyValue": 1
  }
}