[
   {
     "type": "oci/cardtemplate",
     "id": 1,
     "href": "oci/cardtemplate/1",
     "transientAttributes": {},
     "_type": "CardType1",
     "slotOccupancy": 1,
     "status": "Ordered",
     "name": "MIKETESTsfafdf",
     "key": {
       "type": "oci/cardtemplateKey",
       "keyValue": 1
     }
   }
 ]