[
  {
    "type": "oci/slot",
    "id": 1,
    "href": "oci/slot/1",
    "transientAttributes": {},
    "name": "4",
    "relOrder": 1,
    "dimensionUnits": "INCHES",
    "dimDepth": 0,
    "dimDistToBase": 0,
    "dimHeight": 0,
    "dimWidth": 0,
    "key": {
      "type": "oci/slotKey",
      "keyValue": 1
    }
  },
  {
    "type": "oci/slot",
    "id": 2,
    "href": "oci/slot/2",
    "transientAttributes": {},
    "name": "6",
    "relOrder": 1,
    "dimensionUnits": "INCHES",
    "dimDepth": 0,
    "dimDistToBase": 0,
    "dimHeight": 0,
    "dimWidth": 0,
    "key": {
      "type": "oci/slotKey",
      "keyValue": 2
    }
  },
  {
    "type": "oci/slot",
    "id": 3,
    "href": "oci/slot/3",
    "transientAttributes": {},
    "name": "7",
    "relOrder": 1,
    "dimensionUnits": "INCHES",
    "dimDepth": 0,
    "dimDistToBase": 0,
    "dimHeight": 0,
    "dimWidth": 0,
    "key": {
      "type": "oci/slotKey",
      "keyValue": 3
    }
  },
  {
    "type": "oci/slot",
    "id": 4,
    "href": "oci/slot/4",
    "transientAttributes": {},
    "name": "8",
    "relOrder": 1,
    "dimensionUnits": "INCHES",
    "dimDepth": 0,
    "dimDistToBase": 0,
    "dimHeight": 0,
    "dimWidth": 0,
    "key": {
      "type": "oci/slotKey",
      "keyValue": 4
    }
  }
]