[
  {
    "type": "oci/container",
    "id": 1,
    "href": "oci/container/1",
    "transientAttributes": {},
    "name": "001.02",
    "_type": "RACK",
    "vendor": "ERICSSON",
    "model": "",
    "unitOfMeasure": "Inch",
    "networkId": "",
    "serialNumber": "",
    "status": "Live",
    "dimensionUnits": "INCHES",
    "dimDepth": 0,
    "dimHeight": 0,
    "dimWidth": 0,
    "key": {
      "type": "oci/containerKey",
      "keyValue": 1
    }
  },
  {
    "type": "oci/container",
    "id": 2,
    "href": "oci/container/2",
    "transientAttributes": {},
    "name": "001.02",
    "_type": "RACK",
    "vendor": "ERICSSON",
    "model": "",
    "unitOfMeasure": "Inch",
    "networkId": "",
    "serialNumber": "",
    "status": "Live",
    "dimensionUnits": "INCHES",
    "dimDepth": 0,
    "dimHeight": 0,
    "dimWidth": 0,
    "key": {
      "type": "oci/containerKey",
      "keyValue": 2
    }
  },
  {
    "type": "oci/shelf",
    "id": 63,
    "href": "oci/shelf/63",
    "transientAttributes": {},
    "name": "001.02.1F.CATALYST 6509-E SWITCH",
    "_type": "SWITCH",
    "vendor": "CISCO",
    "model": "6509-E",
    "swRev": "",
    "unitOfMeasure": "Inch",
    "networkId": "",
    "serialNumber": "",
    "inServiceDate": "2007-01-10T00:00:00.000Z",
    "status": "Live",
    "dimensionUnits": "INCHES",
    "dimDepth": 0,
    "dimDistToBase": 0,
    "dimHeight": 0,
    "dimWidth": 0,
    "shelf": "",
    "key": {
      "type": "oci/shelfKey",
      "keyValue": 63
    }
  },
  {
    "type": "oci/shelf",
    "id": 64,
    "href": "oci/shelf/64",
    "transientAttributes": {},
    "name": "CORE-ATL-1",
    "_type": "ROUTER",
    "vendor": "CISCO",
    "model": "CSR1000v",
    "status": "Live",
    "lastModifiedOn": "2018-08-16T04:34:09.108Z",
    "lastModifiedBy": "jonathonspaeth",
    "lockedOn": "2018-08-16T04:32:36.336Z",
    "lockedBy": "jonathonspaeth",
    "lockOwner": "session:d8bcd38a-7d9b-4177-b589-80f464829755",
    "key": {
      "type": "oci/shelfKey",
      "keyValue": 64
    }
  }
]