{
  "actions": [
    {
      "name": "getAutoDiscoveryNetworks",
      "protocol": "REST",
      "method": "GET",
      "entitypath": "{base_path}/{version}/api/1.0/auto_discovery/networks/?{query}",
      "requestSchema": "schema.json",
      "responseSchema": "schema.json",
      "timeout": 0,
      "sendEmpty": false,
      "sendGetBody": false,
      "requestDatatype": "JSON",
      "responseDatatype": "JSON",
      "headers": {},
      "responseObjects": [
        {
          "type": "default",
          "key": "",
          "mockFile": ""
        }
      ]
    },
    {
      "name": "postAutoDiscoveryNetworks",
      "protocol": "REST",
      "method": "POST",
      "entitypath": "{base_path}/{version}/api/1.0/auto_discovery/networks/?{query}",
      "requestSchema": "schema.json",
      "responseSchema": "schema.json",
      "timeout": 0,
      "sendEmpty": false,
      "requestDatatype": "FORM",
      "responseDatatype": "JSON",
      "headers": {},
      "responseObjects": [
        {
          "type": "default",
          "key": "",
          "mockFile": ""
        }
      ]
    },
    {
      "name": "putAutoDiscoveryNetworks",
      "protocol": "REST",
      "method": "PUT",
      "entitypath": "{base_path}/{version}/api/1.0/auto_discovery/networks/?{query}",
      "requestSchema": "schema.json",
      "responseSchema": "schema.json",
      "timeout": 0,
      "sendEmpty": false,
      "requestDatatype": "FORM",
      "responseDatatype": "JSON",
      "headers": {},
      "responseObjects": [
        {
          "type": "default",
          "key": "",
          "mockFile": ""
        }
      ]
    },
    {
      "name": "getAutoDiscoverynmap",
      "protocol": "REST",
      "method": "GET",
      "entitypath": "{base_path}/{version}/api/1.0/auto_discovery/nmap/?{query}",
      "requestSchema": "schema.json",
      "responseSchema": "schema.json",
      "timeout": 0,
      "sendEmpty": false,
      "sendGetBody": false,
      "requestDatatype": "JSON",
      "responseDatatype": "JSON",
      "headers": {},
      "responseObjects": [
        {
          "type": "default",
          "key": "",
          "mockFile": ""
        }
      ]
    },
    {
      "name": "postAutoDiscoverynmap",
      "protocol": "REST",
      "method": "POST",
      "entitypath": "{base_path}/{version}/api/1.0/auto_discovery/nmap/?{query}",
      "requestSchema": "schema.json",
      "responseSchema": "schema.json",
      "timeout": 0,
      "sendEmpty": false,
      "requestDatatype": "FORM",
      "responseDatatype": "JSON",
      "headers": {},
      "responseObjects": [
        {
          "type": "default",
          "key": "",
          "mockFile": ""
        }
      ]
    },
    {
      "name": "putAutoDiscoverynmap",
      "protocol": "REST",
      "method": "PUT",
      "entitypath": "{base_path}/{version}/api/1.0/auto_discovery/nmap/?{query}",
      "requestSchema": "schema.json",
      "responseSchema": "schema.json",
      "timeout": 0,
      "sendEmpty": false,
      "requestDatatype": "FORM",
      "responseDatatype": "JSON",
      "headers": {},
      "responseObjects": [
        {
          "type": "default",
          "key": "",
          "mockFile": ""
        }
      ]
    },
    {
      "name": "getAutoDiscoveryPingsweep",
      "protocol": "REST",
      "method": "GET",
      "entitypath": "{base_path}/{version}/api/1.0/auto_discovery/pingsweep/?{query}",
      "requestSchema": "schema.json",
      "responseSchema": "schema.json",
      "timeout": 0,
      "sendEmpty": false,
      "sendGetBody": false,
      "requestDatatype": "JSON",
      "responseDatatype": "JSON",
      "headers": {},
      "responseObjects": [
        {
          "type": "default",
          "key": "",
          "mockFile": ""
        }
      ]
    },
    {
      "name": "postAutoDiscoveryPingsweep",
      "protocol": "REST",
      "method": "POST",
      "entitypath": "{base_path}/{version}/api/1.0/auto_discovery/pingsweep/?{query}",
      "requestSchema": "schema.json",
      "responseSchema": "schema.json",
      "timeout": 0,
      "sendEmpty": false,
      "requestDatatype": "FORM",
      "responseDatatype": "JSON",
      "headers": {},
      "responseObjects": [
        {
          "type": "default",
          "key": "",
          "mockFile": ""
        }
      ]
    },
    {
      "name": "putAutoDiscoveryPingsweep",
      "protocol": "REST",
      "method": "PUT",
      "entitypath": "{base_path}/{version}/api/1.0/auto_discovery/pingsweep/?{query}",
      "requestSchema": "schema.json",
      "responseSchema": "schema.json",
      "timeout": 0,
      "sendEmpty": false,
      "requestDatatype": "FORM",
      "responseDatatype": "JSON",
      "headers": {},
      "responseObjects": [
        {
          "type": "default",
          "key": "",
          "mockFile": ""
        }
      ]
    },
    {
      "name": "postAutoDiscoveryBladeDisc",
      "protocol": "REST",
      "method": "POST",
      "entitypath": "{base_path}/{version}/api/1.0/auto_discovery/blade_disc/?{query}",
      "requestSchema": "schema.json",
      "responseSchema": "schema.json",
      "timeout": 0,
      "sendEmpty": false,
      "requestDatatype": "FORM",
      "responseDatatype": "JSON",
      "headers": {},
      "responseObjects": [
        {
          "type": "default",
          "key": "",
          "mockFile": ""
        }
      ]
    },
    {
      "name": "putAutoDiscoveryBladeDisc",
      "protocol": "REST",
      "method": "PUT",
      "entitypath": "{base_path}/{version}/api/1.0/auto_discovery/blade_disc/?{query}",
      "requestSchema": "schema.json",
      "responseSchema": "schema.json",
      "timeout": 0,
      "sendEmpty": false,
      "requestDatatype": "FORM",
      "responseDatatype": "JSON",
      "headers": {},
      "responseObjects": [
        {
          "type": "default",
          "key": "",
          "mockFile": ""
        }
      ]
    },
    {
      "name": "postAutoDiscoveryPowerDisc",
      "protocol": "REST",
      "method": "POST",
      "entitypath": "{base_path}/{version}/api/1.0/auto_discovery/power_disc/?{query}",
      "requestSchema": "schema.json",
      "responseSchema": "schema.json",
      "timeout": 0,
      "sendEmpty": false,
      "requestDatatype": "FORM",
      "responseDatatype": "JSON",
      "headers": {},
      "responseObjects": [
        {
          "type": "default",
          "key": "",
          "mockFile": ""
        }
      ]
    },
    {
      "name": "putAutoDiscoveryPowerDisc",
      "protocol": "REST",
      "method": "PUT",
      "entitypath": "{base_path}/{version}/api/1.0/auto_discovery/power_disc/?{query}",
      "requestSchema": "schema.json",
      "responseSchema": "schema.json",
      "timeout": 0,
      "sendEmpty": false,
      "requestDatatype": "FORM",
      "responseDatatype": "JSON",
      "headers": {},
      "responseObjects": [
        {
          "type": "default",
          "key": "",
          "mockFile": ""
        }
      ]
    },
    {
      "name": "getAutoDiscoveryvServer",
      "protocol": "REST",
      "method": "GET",
      "entitypath": "{base_path}/{version}/api/1.0/auto_discovery/vserver/?{query}",
      "requestSchema": "schema.json",
      "responseSchema": "schema.json",
      "timeout": 0,
      "sendEmpty": false,
      "sendGetBody": false,
      "requestDatatype": "JSON",
      "responseDatatype": "JSON",
      "headers": {},
      "responseObjects": [
        {
          "type": "default",
          "key": "",
          "mockFile": ""
        }
      ]
    },
    {
      "name": "postAutoDiscoveryVserver",
      "protocol": "REST",
      "method": "POST",
      "entitypath": "{base_path}/{version}/api/1.0/auto_discovery/vserver/?{query}",
      "requestSchema": "schema.json",
      "responseSchema": "schema.json",
      "timeout": 0,
      "sendEmpty": false,
      "requestDatatype": "FORM",
      "responseDatatype": "JSON",
      "headers": {},
      "responseObjects": [
        {
          "type": "default",
          "key": "",
          "mockFile": ""
        }
      ]
    },
    {
      "name": "putAutoDiscoveryVserver",
      "protocol": "REST",
      "method": "PUT",
      "entitypath": "{base_path}/{version}/api/1.0/auto_discovery/vserver/?{query}",
      "requestSchema": "schema.json",
      "responseSchema": "schema.json",
      "timeout": 0,
      "sendEmpty": false,
      "requestDatatype": "FORM",
      "responseDatatype": "JSON",
      "headers": {},
      "responseObjects": [
        {
          "type": "default",
          "key": "",
          "mockFile": ""
        }
      ]
    },
    {
      "name": "getAutoDiscoveryCloudaccount",
      "protocol": "REST",
      "method": "GET",
      "entitypath": "{base_path}/{version}/api/1.0/auto_discovery/cloudaccount/?{query}",
      "requestSchema": "schema.json",
      "responseSchema": "schema.json",
      "timeout": 0,
      "sendEmpty": false,
      "sendGetBody": false,
      "requestDatatype": "JSON",
      "responseDatatype": "JSON",
      "headers": {},
      "responseObjects": [
        {
          "type": "default",
          "key": "",
          "mockFile": ""
        }
      ]
    },
    {
      "name": "postAutoDiscoveryCloudaccount",
      "protocol": "REST",
      "method": "POST",
      "entitypath": "{base_path}/{version}/api/1.0/auto_discovery/cloudaccount/?{query}",
      "requestSchema": "schema.json",
      "responseSchema": "schema.json",
      "timeout": 0,
      "sendEmpty": false,
      "requestDatatype": "FORM",
      "responseDatatype": "JSON",
      "headers": {},
      "responseObjects": [
        {
          "type": "default",
          "key": "",
          "mockFile": ""
        }
      ]
    },
    {
      "name": "putAutoDiscoveryCloudaccount",
      "protocol": "REST",
      "method": "PUT",
      "entitypath": "{base_path}/{version}/api/1.0/auto_discovery/cloudaccount/?{query}",
      "requestSchema": "schema.json",
      "responseSchema": "schema.json",
      "timeout": 0,
      "sendEmpty": false,
      "requestDatatype": "FORM",
      "responseDatatype": "JSON",
      "headers": {},
      "responseObjects": [
        {
          "type": "default",
          "key": "",
          "mockFile": ""
        }
      ]
    },
    {
      "name": "getCloudInfrastructure",
      "protocol": "REST",
      "method": "GET",
      "entitypath": "{base_path}/{version}/api/2.0/cloud_infrastructure/?{query}",
      "requestSchema": "schema.json",
      "responseSchema": "schema.json",
      "timeout": 0,
      "sendEmpty": false,
      "sendGetBody": false,
      "requestDatatype": "JSON",
      "responseDatatype": "JSON",
      "headers": {},
      "responseObjects": [
        {
          "type": "default",
          "key": "",
          "mockFile": ""
        }
      ]
    },
    {
      "name": "postCloudInfrastructure",
      "protocol": "REST",
      "method": "POST",
      "entitypath": "{base_path}/{version}/api/2.0/cloud_infrastructure/?{query}",
      "requestSchema": "schema.json",
      "responseSchema": "schema.json",
      "timeout": 0,
      "sendEmpty": false,
      "requestDatatype": "FORM",
      "responseDatatype": "JSON",
      "headers": {},
      "responseObjects": [
        {
          "type": "default",
          "key": "",
          "mockFile": ""
        }
      ]
    },
    {
      "name": "deleteCloudInfrastructure",
      "protocol": "REST",
      "method": "DELETE",
      "entitypath": "{base_path}/{version}/api/2.0/cloud_infrastructure/{pathv1}/?{query}",
      "requestSchema": "schema.json",
      "responseSchema": "schema.json",
      "timeout": 0,
      "sendEmpty": false,
      "requestDatatype": "JSON",
      "responseDatatype": "JSON",
      "headers": {},
      "responseObjects": [
        {
          "type": "default",
          "key": "",
          "mockFile": ""
        }
      ]
    },
    {
      "name": "putCustomFieldCloudInfrastructure",
      "protocol": "REST",
      "method": "PUT",
      "entitypath": "{base_path}/{version}/api/1.0/custom_fields/cloud_infrastructure/?{query}",
      "requestSchema": "schema.json",
      "responseSchema": "schema.json",
      "timeout": 0,
      "sendEmpty": false,
      "requestDatatype": "FORM",
      "responseDatatype": "JSON",
      "headers": {},
      "responseObjects": [
        {
          "type": "default",
          "key": "",
          "mockFile": ""
        }
      ]
    },
    {
      "name": "getCloudResource",
      "protocol": "REST",
      "method": "GET",
      "entitypath": "{base_path}/{version}/api/2.0/resource/?{query}",
      "requestSchema": "schema.json",
      "responseSchema": "schema.json",
      "timeout": 0,
      "sendEmpty": false,
      "sendGetBody": false,
      "requestDatatype": "JSON",
      "responseDatatype": "JSON",
      "headers": {},
      "responseObjects": [
        {
          "type": "default",
          "key": "",
          "mockFile": ""
        }
      ]
    },
    {
      "name": "postCloudResource",
      "protocol": "REST",
      "method": "POST",
      "entitypath": "{base_path}/{version}/api/2.0/resource/?{query}",
      "requestSchema": "schema.json",
      "responseSchema": "schema.json",
      "timeout": 0,
      "sendEmpty": false,
      "requestDatatype": "FORM",
      "responseDatatype": "JSON",
      "headers": {},
      "responseObjects": [
        {
          "type": "default",
          "key": "",
          "mockFile": ""
        }
      ]
    },
    {
      "name": "deleteCloudResource",
      "protocol": "REST",
      "method": "DELETE",
      "entitypath": "{base_path}/{version}/api/2.0/resource/{pathv1}/?{query}",
      "requestSchema": "schema.json",
      "responseSchema": "schema.json",
      "timeout": 0,
      "sendEmpty": false,
      "requestDatatype": "JSON",
      "responseDatatype": "JSON",
      "headers": {},
      "responseObjects": [
        {
          "type": "default",
          "key": "",
          "mockFile": ""
        }
      ]
    },
    {
      "name": "putCustomFieldCloudResource",
      "protocol": "REST",
      "method": "PUT",
      "entitypath": "{base_path}/{version}/api/1.0/custom_fields/resource/?{query}",
      "requestSchema": "schema.json",
      "responseSchema": "schema.json",
      "timeout": 0,
      "sendEmpty": false,
      "requestDatatype": "FORM",
      "responseDatatype": "JSON",
      "headers": {},
      "responseObjects": [
        {
          "type": "default",
          "key": "",
          "mockFile": ""
        }
      ]
    },
    {
      "name": "getResourceRelationship",
      "protocol": "REST",
      "method": "GET",
      "entitypath": "{base_path}/{version}/api/2.0/resource_relationship/?{query}",
      "requestSchema": "schema.json",
      "responseSchema": "schema.json",
      "timeout": 0,
      "sendEmpty": false,
      "sendGetBody": false,
      "requestDatatype": "JSON",
      "responseDatatype": "JSON",
      "headers": {},
      "responseObjects": [
        {
          "type": "default",
          "key": "",
          "mockFile": ""
        }
      ]
    },
    {
      "name": "deleteResourceRelationship",
      "protocol": "REST",
      "method": "DELETE",
      "entitypath": "{base_path}/{version}/api/2.0/resource_relationship/{pathv1}/?{query}",
      "requestSchema": "schema.json",
      "responseSchema": "schema.json",
      "timeout": 0,
      "sendEmpty": false,
      "requestDatatype": "JSON",
      "responseDatatype": "JSON",
      "headers": {},
      "responseObjects": [
        {
          "type": "default",
          "key": "",
          "mockFile": ""
        }
      ]
    },
    {
      "name": "getAutoDiscoverySnmpDisc",
      "protocol": "REST",
      "method": "GET",
      "entitypath": "{base_path}/{version}/api/1.0/auto_discovery/snmp_disc/?{query}",
      "requestSchema": "schema.json",
      "responseSchema": "schema.json",
      "timeout": 0,
      "sendEmpty": false,
      "sendGetBody": false,
      "requestDatatype": "JSON",
      "responseDatatype": "JSON",
      "headers": {},
      "responseObjects": [
        {
          "type": "default",
          "key": "",
          "mockFile": ""
        }
      ]
    },
    {
      "name": "postAutoDiscoverySnmpDisc",
      "protocol": "REST",
      "method": "POST",
      "entitypath": "{base_path}/{version}/api/1.0/auto_discovery/snmp_disc/?{query}",
      "requestSchema": "schema.json",
      "responseSchema": "schema.json",
      "timeout": 0,
      "sendEmpty": false,
      "requestDatatype": "FORM",
      "responseDatatype": "JSON",
      "headers": {},
      "responseObjects": [
        {
          "type": "default",
          "key": "",
          "mockFile": ""
        }
      ]
    },
    {
      "name": "putAutoDiscoverySnmpDisc",
      "protocol": "REST",
      "method": "PUT",
      "entitypath": "{base_path}/{version}/api/1.0/auto_discovery/snmp_disc/?{query}",
      "requestSchema": "schema.json",
      "responseSchema": "schema.json",
      "timeout": 0,
      "sendEmpty": false,
      "requestDatatype": "FORM",
      "responseDatatype": "JSON",
      "headers": {},
      "responseObjects": [
        {
          "type": "default",
          "key": "",
          "mockFile": ""
        }
      ]
    },
    {
      "name": "getAutoDiscoveryIpmi",
      "protocol": "REST",
      "method": "GET",
      "entitypath": "{base_path}/{version}/api/1.0/auto_discovery/ipmi/?{query}",
      "requestSchema": "schema.json",
      "responseSchema": "schema.json",
      "timeout": 0,
      "sendEmpty": false,
      "sendGetBody": false,
      "requestDatatype": "JSON",
      "responseDatatype": "JSON",
      "headers": {},
      "responseObjects": [
        {
          "type": "default",
          "key": "",
          "mockFile": ""
        }
      ]
    },
    {
      "name": "postAutoDiscoveryIpmi",
      "protocol": "REST",
      "method": "POST",
      "entitypath": "{base_path}/{version}/api/1.0/auto_discovery/ipmi/?{query}",
      "requestSchema": "schema.json",
      "responseSchema": "schema.json",
      "timeout": 0,
      "sendEmpty": false,
      "requestDatatype": "FORM",
      "responseDatatype": "JSON",
      "headers": {},
      "responseObjects": [
        {
          "type": "default",
          "key": "",
          "mockFile": ""
        }
      ]
    },
    {
      "name": "putAutoDiscoveryIpmi",
      "protocol": "REST",
      "method": "PUT",
      "entitypath": "{base_path}/{version}/api/1.0/auto_discovery/ipmi/?{query}",
      "requestSchema": "schema.json",
      "responseSchema": "schema.json",
      "timeout": 0,
      "sendEmpty": false,
      "requestDatatype": "FORM",
      "responseDatatype": "JSON",
      "headers": {},
      "responseObjects": [
        {
          "type": "default",
          "key": "",
          "mockFile": ""
        }
      ]
    },
    {
      "name": "getAutoDiscoveryUcs",
      "protocol": "REST",
      "method": "GET",
      "entitypath": "{base_path}/{version}/api/1.0/auto_discovery/ucs/?{query}",
      "requestSchema": "schema.json",
      "responseSchema": "schema.json",
      "timeout": 0,
      "sendEmpty": false,
      "sendGetBody": false,
      "requestDatatype": "JSON",
      "responseDatatype": "JSON",
      "headers": {},
      "responseObjects": [
        {
          "type": "default",
          "key": "",
          "mockFile": ""
        }
      ]
    },
    {
      "name": "postAutoDiscoveryUcs",
      "protocol": "REST",
      "method": "POST",
      "entitypath": "{base_path}/{version}/api/1.0/auto_discovery/ucs/?{query}",
      "requestSchema": "schema.json",
      "responseSchema": "schema.json",
      "timeout": 0,
      "sendEmpty": false,
      "requestDatatype": "FORM",
      "responseDatatype": "JSON",
      "headers": {},
      "responseObjects": [
        {
          "type": "default",
          "key": "",
          "mockFile": ""
        }
      ]
    },
    {
      "name": "putAutoDiscoveryUcs",
      "protocol": "REST",
      "method": "PUT",
      "entitypath": "{base_path}/{version}/api/1.0/auto_discovery/ucs/?{query}",
      "requestSchema": "schema.json",
      "responseSchema": "schema.json",
      "timeout": 0,
      "sendEmpty": false,
      "requestDatatype": "FORM",
      "responseDatatype": "JSON",
      "headers": {},
      "responseObjects": [
        {
          "type": "default",
          "key": "",
          "mockFile": ""
        }
      ]
    },
    {
      "name": "getAutoDiscoveryDns",
      "protocol": "REST",
      "method": "GET",
      "entitypath": "{base_path}/{version}/api/1.0/auto_discovery/dns/?{query}",
      "requestSchema": "schema.json",
      "responseSchema": "schema.json",
      "timeout": 0,
      "sendEmpty": false,
      "sendGetBody": false,
      "requestDatatype": "JSON",
      "responseDatatype": "JSON",
      "headers": {},
      "responseObjects": [
        {
          "type": "default",
          "key": "",
          "mockFile": ""
        }
      ]
    },
    {
      "name": "postAutoDiscoveryDns",
      "protocol": "REST",
      "method": "POST",
      "entitypath": "{base_path}/{version}/api/1.0/auto_discovery/dns/?{query}",
      "requestSchema": "schema.json",
      "responseSchema": "schema.json",
      "timeout": 0,
      "sendEmpty": false,
      "requestDatatype": "FORM",
      "responseDatatype": "JSON",
      "headers": {},
      "responseObjects": [
        {
          "type": "default",
          "key": "",
          "mockFile": ""
        }
      ]
    },
    {
      "name": "putAutoDiscoveryDns",
      "protocol": "REST",
      "method": "PUT",
      "entitypath": "{base_path}/{version}/api/1.0/auto_discovery/dns/?{query}",
      "requestSchema": "schema.json",
      "responseSchema": "schema.json",
      "timeout": 0,
      "sendEmpty": false,
      "requestDatatype": "FORM",
      "responseDatatype": "JSON",
      "headers": {},
      "responseObjects": [
        {
          "type": "default",
          "key": "",
          "mockFile": ""
        }
      ]
    },
    {
      "name": "getAutoDiscoveryCertificate",
      "protocol": "REST",
      "method": "GET",
      "entitypath": "{base_path}/{version}/api/1.0/auto_discovery/certificate/?{query}",
      "requestSchema": "schema.json",
      "responseSchema": "schema.json",
      "timeout": 0,
      "sendEmpty": false,
      "sendGetBody": false,
      "requestDatatype": "JSON",
      "responseDatatype": "JSON",
      "headers": {},
      "responseObjects": [
        {
          "type": "default",
          "key": "",
          "mockFile": ""
        }
      ]
    },
    {
      "name": "postAutoDiscoveryCertificate",
      "protocol": "REST",
      "method": "POST",
      "entitypath": "{base_path}/{version}/api/1.0/auto_discovery/certificate/?{query}",
      "requestSchema": "schema.json",
      "responseSchema": "schema.json",
      "timeout": 0,
      "sendEmpty": false,
      "requestDatatype": "FORM",
      "responseDatatype": "JSON",
      "headers": {},
      "responseObjects": [
        {
          "type": "default",
          "key": "",
          "mockFile": ""
        }
      ]
    },
    {
      "name": "putAutoDiscoveryCertificate",
      "protocol": "REST",
      "method": "PUT",
      "entitypath": "{base_path}/{version}/api/1.0/auto_discovery/certificate/?{query}",
      "requestSchema": "schema.json",
      "responseSchema": "schema.json",
      "timeout": 0,
      "sendEmpty": false,
      "requestDatatype": "FORM",
      "responseDatatype": "JSON",
      "headers": {},
      "responseObjects": [
        {
          "type": "default",
          "key": "",
          "mockFile": ""
        }
      ]
    }
  ]
}