{
  "$id": "schema.json",
  "type": "object",
  "schema": "http://json-schema.org/draft-07/schema#",
  "translate": true,
  "dynamicfields": true,
  "properties": {
    "ph_request_type": {
      "type": "string",
      "description": "type of request (internal to adapter)",
      "default": "getCustomers",
      "enum": [
        "getCustomers",
        "postCustomers",
        "deleteCustomers",
        "postUpdateCustomerContacts",
        "putCustomFields"
      ],
      "external_name": "ph_request_type"
    },
    "includeCols": {
      "type": "string",
      "description": "do not return all columns just the ones specified. For example, ?include_cols=name, device_id, rack will only result in name, device_id, and rack included in the output. ...(description truncated)",
      "parse": false,
      "encode": false,
      "encrypt": {
        "type": "AES",
        "key": ""
      },
      "external_name": "include_cols"
    }
  },
  "definitions": {}
}