{
  "appcomps": "string",
  "appcomp_ids": "string",
  "device": "string",
  "device_id": 10,
  "first_detected": "string",
  "last_updated": "string",
  "service_detail_id": 7,
  "service_display_name": "string",
  "service_id": 9,
  "state": "string",
  "startmode": "string",
  "user": "string",
  "user_id": 1,
  "vendor": "string",
  "vendor_id": 10,
  "cmd_paths": [
    ""
  ],
  "ignore_client_connections": false,
  "topology_status": "string",
  "pinned": false
}