{
  "$id": "schema.json",
  "type": "object",
  "schema": "http://json-schema.org/draft-07/schema#",
  "translate": true,
  "dynamicfields": true,
  "properties": {
    "ph_request_type": {
      "type": "string",
      "description": "type of request (internal to adapter)",
      "default": "getRacks",
      "enum": [
        "getRacks",
        "postRacks",
        "getRacksID",
        "deleteRacksID",
        "putCustomFieldsRack"
      ],
      "external_name": "ph_request_type"
    },
    "buildingId": {
      "type": "string",
      "description": "filter by building ID (Added in v5.9.0)",
      "parse": false,
      "encode": false,
      "encrypt": {
        "type": "AES",
        "key": ""
      },
      "external_name": "building_id"
    },
    "roomId": {
      "type": "string",
      "description": "filter by room ID (Added in v5.9.0)",
      "parse": false,
      "encode": false,
      "encrypt": {
        "type": "AES",
        "key": ""
      },
      "external_name": "room_id"
    },
    "assetNo": {
      "type": "string",
      "description": "filter by asset number",
      "parse": false,
      "encode": false,
      "encrypt": {
        "type": "AES",
        "key": ""
      },
      "external_name": "asset_no"
    },
    "iD": {
      "type": "number",
      "description": "rack id",
      "parse": false,
      "encode": false,
      "encrypt": {
        "type": "AES",
        "key": ""
      },
      "external_name": "ID"
    }
  },
  "definitions": {}
}