{
  "actions": [
    {
      "name": "getServices",
      "protocol": "REST",
      "method": "GET",
      "entitypath": "{base_path}/{version}/api/1.0/services/?{query}",
      "requestSchema": "schema.json",
      "responseSchema": "schema.json",
      "timeout": 0,
      "sendEmpty": false,
      "sendGetBody": false,
      "requestDatatype": "JSON",
      "responseDatatype": "JSON",
      "headers": {},
      "responseObjects": [
        {
          "type": "default",
          "key": "",
          "mockFile": ""
        }
      ]
    },
    {
      "name": "postServices",
      "protocol": "REST",
      "method": "POST",
      "entitypath": "{base_path}/{version}/api/1.0/services/?{query}",
      "requestSchema": "schema.json",
      "responseSchema": "schema.json",
      "timeout": 0,
      "sendEmpty": false,
      "requestDatatype": "FORM",
      "responseDatatype": "JSON",
      "headers": {},
      "responseObjects": [
        {
          "type": "default",
          "key": "",
          "mockFile": ""
        }
      ]
    },
    {
      "name": "deleteServices",
      "protocol": "REST",
      "method": "DELETE",
      "entitypath": "{base_path}/{version}/api/1.0/services/{pathv1}/?{query}",
      "requestSchema": "schema.json",
      "responseSchema": "schema.json",
      "timeout": 0,
      "sendEmpty": false,
      "requestDatatype": "JSON",
      "responseDatatype": "JSON",
      "headers": {},
      "responseObjects": [
        {
          "type": "default",
          "key": "",
          "mockFile": ""
        }
      ]
    },
    {
      "name": "getServiceDetails",
      "protocol": "REST",
      "method": "GET",
      "entitypath": "{base_path}/{version}/api/1.0/service_details/?{query}",
      "requestSchema": "schema.json",
      "responseSchema": "schema.json",
      "timeout": 0,
      "sendEmpty": false,
      "sendGetBody": false,
      "requestDatatype": "JSON",
      "responseDatatype": "JSON",
      "headers": {},
      "responseObjects": [
        {
          "type": "default",
          "key": "",
          "mockFile": ""
        }
      ]
    },
    {
      "name": "postServiceDetails",
      "protocol": "REST",
      "method": "POST",
      "entitypath": "{base_path}/{version}/api/1.0/service_details/?{query}",
      "requestSchema": "schema.json",
      "responseSchema": "schema.json",
      "timeout": 0,
      "sendEmpty": false,
      "requestDatatype": "FORM",
      "responseDatatype": "JSON",
      "headers": {},
      "responseObjects": [
        {
          "type": "default",
          "key": "",
          "mockFile": ""
        }
      ]
    },
    {
      "name": "deleteServiceDetails",
      "protocol": "REST",
      "method": "DELETE",
      "entitypath": "{base_path}/{version}/api/1.0/service_detail/{pathv1}/?{query}",
      "requestSchema": "schema.json",
      "responseSchema": "schema.json",
      "timeout": 0,
      "sendEmpty": false,
      "requestDatatype": "JSON",
      "responseDatatype": "JSON",
      "headers": {},
      "responseObjects": [
        {
          "type": "default",
          "key": "",
          "mockFile": ""
        }
      ]
    },
    {
      "name": "getServicePorts",
      "protocol": "REST",
      "method": "GET",
      "entitypath": "{base_path}/{version}/api/1.0/service_ports/?{query}",
      "requestSchema": "schema.json",
      "responseSchema": "schema.json",
      "timeout": 0,
      "sendEmpty": false,
      "sendGetBody": false,
      "requestDatatype": "JSON",
      "responseDatatype": "JSON",
      "headers": {},
      "responseObjects": [
        {
          "type": "default",
          "key": "",
          "mockFile": ""
        }
      ]
    },
    {
      "name": "postServicePorts",
      "protocol": "REST",
      "method": "POST",
      "entitypath": "{base_path}/{version}/api/1.0/service_ports/?{query}",
      "requestSchema": "schema.json",
      "responseSchema": "schema.json",
      "timeout": 0,
      "sendEmpty": false,
      "requestDatatype": "FORM",
      "responseDatatype": "JSON",
      "headers": {},
      "responseObjects": [
        {
          "type": "default",
          "key": "",
          "mockFile": ""
        }
      ]
    },
    {
      "name": "deleteServicePorts",
      "protocol": "REST",
      "method": "DELETE",
      "entitypath": "{base_path}/{version}/api/1.0/service_ports/{pathv1}/?{query}",
      "requestSchema": "schema.json",
      "responseSchema": "schema.json",
      "timeout": 0,
      "sendEmpty": false,
      "requestDatatype": "JSON",
      "responseDatatype": "JSON",
      "headers": {},
      "responseObjects": [
        {
          "type": "default",
          "key": "",
          "mockFile": ""
        }
      ]
    },
    {
      "name": "getListenerConnectionStats",
      "protocol": "REST",
      "method": "GET",
      "entitypath": "{base_path}/{version}/api/1.0/listener_connection_stats/?{query}",
      "requestSchema": "schema.json",
      "responseSchema": "schema.json",
      "timeout": 0,
      "sendEmpty": false,
      "sendGetBody": false,
      "requestDatatype": "JSON",
      "responseDatatype": "JSON",
      "headers": {},
      "responseObjects": [
        {
          "type": "default",
          "key": "",
          "mockFile": ""
        }
      ]
    },
    {
      "name": "getNetworkShares",
      "protocol": "REST",
      "method": "GET",
      "entitypath": "{base_path}/{version}/api/1.0/network_shares/?{query}",
      "requestSchema": "schema.json",
      "responseSchema": "schema.json",
      "timeout": 0,
      "sendEmpty": false,
      "sendGetBody": false,
      "requestDatatype": "JSON",
      "responseDatatype": "JSON",
      "headers": {},
      "responseObjects": [
        {
          "type": "default",
          "key": "",
          "mockFile": ""
        }
      ]
    },
    {
      "name": "getApi20ListenerConnectionStats",
      "protocol": "REST",
      "method": "GET",
      "entitypath": "{base_path}/{version}/api/2.0/listener_connection_stats/?{query}",
      "requestSchema": "schema.json",
      "responseSchema": "schema.json",
      "timeout": 0,
      "sendEmpty": false,
      "sendGetBody": false,
      "requestDatatype": "JSON",
      "responseDatatype": "JSON",
      "headers": {},
      "responseObjects": [
        {
          "type": "default",
          "key": "",
          "mockFile": "mockdatafiles/getApi20ListenerConnectionStats-default.json"
        }
      ]
    },
    {
      "name": "getListenerConnectionStatsByID",
      "protocol": "REST",
      "method": "GET",
      "entitypath": "{base_path}/{version}/api/2.0/listener_connection_stats/{pathv1}?{query}",
      "requestSchema": "schema.json",
      "responseSchema": "schema.json",
      "timeout": 0,
      "sendEmpty": false,
      "sendGetBody": false,
      "requestDatatype": "JSON",
      "responseDatatype": "JSON",
      "headers": {},
      "responseObjects": [
        {
          "type": "default",
          "key": "",
          "mockFile": "mockdatafiles/getListenerConnectionStatsByID-default.json"
        }
      ]
    },
    {
      "name": "getScheduledTasks",
      "protocol": "REST",
      "method": "GET",
      "entitypath": "{base_path}/{version}/api/2.0/scheduled_tasks/?{query}",
      "requestSchema": "schema.json",
      "responseSchema": "schema.json",
      "timeout": 0,
      "sendEmpty": false,
      "sendGetBody": false,
      "requestDatatype": "JSON",
      "responseDatatype": "JSON",
      "headers": {},
      "responseObjects": [
        {
          "type": "default",
          "key": "",
          "mockFile": ""
        }
      ]
    },
    {
      "name": "postScheduledTasks",
      "protocol": "REST",
      "method": "POST",
      "entitypath": "{base_path}/{version}/api/2.0/scheduled_tasks/?{query}",
      "requestSchema": "schema.json",
      "responseSchema": "schema.json",
      "timeout": 0,
      "sendEmpty": false,
      "requestDatatype": "FORM",
      "responseDatatype": "JSON",
      "headers": {},
      "responseObjects": [
        {
          "type": "default",
          "key": "",
          "mockFile": ""
        }
      ]
    },
    {
      "name": "getScheduledTasksByID",
      "protocol": "REST",
      "method": "GET",
      "entitypath": "{base_path}/{version}/api/2.0/scheduled_tasks/{pathv1}?{query}",
      "requestSchema": "schema.json",
      "responseSchema": "schema.json",
      "timeout": 0,
      "sendEmpty": false,
      "sendGetBody": false,
      "requestDatatype": "JSON",
      "responseDatatype": "JSON",
      "headers": {},
      "responseObjects": [
        {
          "type": "default",
          "key": "",
          "mockFile": "mockdatafiles/getScheduledTasksByID-default.json"
        }
      ]
    },
    {
      "name": "deleteScheduledTasksByID",
      "protocol": "REST",
      "method": "DELETE",
      "entitypath": "{base_path}/{version}/api/2.0/scheduled_tasks/{pathv1}?{query}",
      "requestSchema": "schema.json",
      "responseSchema": "schema.json",
      "timeout": 0,
      "sendEmpty": false,
      "requestDatatype": "JSON",
      "responseDatatype": "JSON",
      "headers": {},
      "responseObjects": [
        {
          "type": "default",
          "key": "",
          "mockFile": ""
        }
      ]
    },
    {
      "name": "getServices2",
      "protocol": "REST",
      "method": "GET",
      "entitypath": "{base_path}/{version}/api/2.0/services/?{query}",
      "requestSchema": "schema.json",
      "responseSchema": "schema.json",
      "timeout": 0,
      "sendEmpty": false,
      "sendGetBody": false,
      "requestDatatype": "JSON",
      "responseDatatype": "JSON",
      "headers": {},
      "responseObjects": [
        {
          "type": "default",
          "key": "",
          "mockFile": ""
        }
      ]
    },
    {
      "name": "postServices2",
      "protocol": "REST",
      "method": "POST",
      "entitypath": "{base_path}/{version}/api/2.0/services/?{query}",
      "requestSchema": "schema.json",
      "responseSchema": "schema.json",
      "timeout": 0,
      "sendEmpty": false,
      "requestDatatype": "FORM",
      "responseDatatype": "JSON",
      "headers": {},
      "responseObjects": [
        {
          "type": "default",
          "key": "",
          "mockFile": ""
        }
      ]
    },
    {
      "name": "deleteServicesByID",
      "protocol": "REST",
      "method": "DELETE",
      "entitypath": "{base_path}/{version}/api/2.0/services/{pathv1}?{query}",
      "requestSchema": "schema.json",
      "responseSchema": "schema.json",
      "timeout": 0,
      "sendEmpty": false,
      "requestDatatype": "JSON",
      "responseDatatype": "JSON",
      "headers": {},
      "responseObjects": [
        {
          "type": "default",
          "key": "",
          "mockFile": ""
        }
      ]
    },
    {
      "name": "getServiceInstances",
      "protocol": "REST",
      "method": "GET",
      "entitypath": "{base_path}/{version}/api/2.0/service_instances/?{query}",
      "requestSchema": "schema.json",
      "responseSchema": "schema.json",
      "timeout": 0,
      "sendEmpty": false,
      "sendGetBody": false,
      "requestDatatype": "JSON",
      "responseDatatype": "JSON",
      "headers": {},
      "responseObjects": [
        {
          "type": "default",
          "key": "",
          "mockFile": ""
        }
      ]
    },
    {
      "name": "postServiceInstances",
      "protocol": "REST",
      "method": "POST",
      "entitypath": "{base_path}/{version}/api/2.0/service_instances/?{query}",
      "requestSchema": "schema.json",
      "responseSchema": "schema.json",
      "timeout": 0,
      "sendEmpty": false,
      "requestDatatype": "FORM",
      "responseDatatype": "JSON",
      "headers": {},
      "responseObjects": [
        {
          "type": "default",
          "key": "",
          "mockFile": ""
        }
      ]
    },
    {
      "name": "getServiceInstancesByID",
      "protocol": "REST",
      "method": "GET",
      "entitypath": "{base_path}/{version}/api/2.0/service_instances/{pathv1}?{query}",
      "requestSchema": "schema.json",
      "responseSchema": "schema.json",
      "timeout": 0,
      "sendEmpty": false,
      "sendGetBody": false,
      "requestDatatype": "JSON",
      "responseDatatype": "JSON",
      "headers": {},
      "responseObjects": [
        {
          "type": "default",
          "key": "",
          "mockFile": "mockdatafiles/getServiceInstancesByID-default.json"
        }
      ]
    },
    {
      "name": "deleteServiceInstancesByID",
      "protocol": "REST",
      "method": "DELETE",
      "entitypath": "{base_path}/{version}/api/2.0/service_instances/{pathv1}?{query}",
      "requestSchema": "schema.json",
      "responseSchema": "schema.json",
      "timeout": 0,
      "sendEmpty": false,
      "requestDatatype": "JSON",
      "responseDatatype": "JSON",
      "headers": {},
      "responseObjects": [
        {
          "type": "default",
          "key": "",
          "mockFile": ""
        }
      ]
    },
    {
      "name": "getServiceListenerPorts",
      "protocol": "REST",
      "method": "GET",
      "entitypath": "{base_path}/{version}/api/2.0/service_listener_ports/?{query}",
      "requestSchema": "schema.json",
      "responseSchema": "schema.json",
      "timeout": 0,
      "sendEmpty": false,
      "sendGetBody": false,
      "requestDatatype": "JSON",
      "responseDatatype": "JSON",
      "headers": {},
      "responseObjects": [
        {
          "type": "default",
          "key": "",
          "mockFile": "mockdatafiles/getServiceListenerPorts-default.json"
        }
      ]
    },
    {
      "name": "postServiceListenerPorts",
      "protocol": "REST",
      "method": "POST",
      "entitypath": "{base_path}/{version}/api/2.0/service_listener_ports/?{query}",
      "requestSchema": "schema.json",
      "responseSchema": "schema.json",
      "timeout": 0,
      "sendEmpty": false,
      "requestDatatype": "FORM",
      "responseDatatype": "JSON",
      "headers": {},
      "responseObjects": [
        {
          "type": "default",
          "key": "",
          "mockFile": ""
        }
      ]
    },
    {
      "name": "getServiceListenerPortsByID",
      "protocol": "REST",
      "method": "GET",
      "entitypath": "{base_path}/{version}/api/2.0/service_listener_ports/{pathv1}/?{query}",
      "requestSchema": "schema.json",
      "responseSchema": "schema.json",
      "timeout": 0,
      "sendEmpty": false,
      "sendGetBody": false,
      "requestDatatype": "JSON",
      "responseDatatype": "JSON",
      "headers": {},
      "responseObjects": [
        {
          "type": "default",
          "key": "",
          "mockFile": "mockdatafiles/getServiceListenerPortsByID-default.json"
        }
      ]
    },
    {
      "name": "putServiceListenerPorts",
      "protocol": "REST",
      "method": "PUT",
      "entitypath": "{base_path}/{version}/api/2.0/service_listener_ports/{pathv1}/?{query}",
      "requestSchema": "schema.json",
      "responseSchema": "schema.json",
      "timeout": 0,
      "sendEmpty": false,
      "requestDatatype": "FORM",
      "responseDatatype": "JSON",
      "headers": {},
      "responseObjects": [
        {
          "type": "default",
          "key": "",
          "mockFile": ""
        }
      ]
    },
    {
      "name": "getServiceClientConnections",
      "protocol": "REST",
      "method": "GET",
      "entitypath": "{base_path}/{version}/api/2.0/service_client_connections/{pathv1}?{query}",
      "requestSchema": "schema.json",
      "responseSchema": "schema.json",
      "timeout": 0,
      "sendEmpty": false,
      "sendGetBody": false,
      "requestDatatype": "JSON",
      "responseDatatype": "JSON",
      "headers": {},
      "responseObjects": [
        {
          "type": "default",
          "key": "",
          "mockFile": "mockdatafiles/getServiceClientConnections-default.json"
        }
      ]
    },
    {
      "name": "getIgnoredService",
      "protocol": "REST",
      "method": "GET",
      "entitypath": "{base_path}/{version}/api/2.0/ignored_service/?{query}",
      "requestSchema": "schema.json",
      "responseSchema": "schema.json",
      "timeout": 0,
      "sendEmpty": false,
      "sendGetBody": false,
      "requestDatatype": "JSON",
      "responseDatatype": "JSON",
      "headers": {},
      "responseObjects": [
        {
          "type": "default",
          "key": "",
          "mockFile": ""
        }
      ]
    },
    {
      "name": "postIgnoredService",
      "protocol": "REST",
      "method": "POST",
      "entitypath": "{base_path}/{version}/api/2.0/ignored_service/?{query}",
      "requestSchema": "schema.json",
      "responseSchema": "schema.json",
      "timeout": 0,
      "sendEmpty": false,
      "requestDatatype": "FORM",
      "responseDatatype": "JSON",
      "headers": {},
      "responseObjects": [
        {
          "type": "default",
          "key": "",
          "mockFile": ""
        }
      ]
    },
    {
      "name": "deleteIgnoredServiceByID",
      "protocol": "REST",
      "method": "DELETE",
      "entitypath": "{base_path}/{version}/api/2.0/ignored_service/{pathv1}/?{query}",
      "requestSchema": "schema.json",
      "responseSchema": "schema.json",
      "timeout": 0,
      "sendEmpty": false,
      "requestDatatype": "JSON",
      "responseDatatype": "JSON",
      "headers": {},
      "responseObjects": [
        {
          "type": "default",
          "key": "",
          "mockFile": ""
        }
      ]
    }
  ]
}