{
  "$id": "schema.json",
  "type": "object",
  "schema": "http://json-schema.org/draft-07/schema#",
  "translate": true,
  "dynamicfields": true,
  "properties": {
    "ph_request_type": {
      "type": "string",
      "description": "type of request (internal to adapter)",
      "default": "getSoftwareDetails",
      "enum": [
        "getSoftwareDetails",
        "postUpdateServicePorts",
        "deleteSoftwareDetail",
        "getSoftwareComponentDetails",
        "postUpdateSoftwareComponents",
        "deleteSoftwareComponent",
        "getSoftwareLicenseKeys",
        "postUpdateSoftwareLicenses",
        "deleteSoftwareLicenseKeys"
      ],
      "external_name": "ph_request_type"
    },
    "deviceId": {
      "type": "string",
      "description": "filter by id of device",
      "parse": false,
      "encode": false,
      "encrypt": {
        "type": "AES",
        "key": ""
      },
      "external_name": "device_id"
    },
    "softwareId": {
      "type": "string",
      "description": "filter by id of the software",
      "parse": false,
      "encode": false,
      "encrypt": {
        "type": "AES",
        "key": ""
      },
      "external_name": "software_id"
    },
    "softwareDetailId": {
      "type": "string",
      "description": "filter by id of the software",
      "parse": false,
      "encode": false,
      "encrypt": {
        "type": "AES",
        "key": ""
      },
      "external_name": "software_detail_id"
    },
    "softwareType": {
      "type": "string",
      "description": "Filter by software type (managed, unmanaged, prohibited or ignored)",
      "parse": false,
      "encode": false,
      "encrypt": {
        "type": "AES",
        "key": ""
      },
      "external_name": "software_type"
    },
    "tagsAnd": {
      "type": "string",
      "description": "filter by all the tags, separated by comma. (This is an AND filter and all tags have to match for filter, this was added in v6.3.1)",
      "parse": false,
      "encode": false,
      "encrypt": {
        "type": "AES",
        "key": ""
      },
      "external_name": "tags_and"
    },
    "softwareName": {
      "type": "string",
      "description": "filter by name of the software component",
      "parse": false,
      "encode": false,
      "encrypt": {
        "type": "AES",
        "key": ""
      },
      "external_name": "software_name"
    }
  },
  "definitions": {}
}