{
  "$id": "schema.json",
  "type": "object",
  "schema": "http://json-schema.org/draft-07/schema#",
  "translate": true,
  "dynamicfields": true,
  "properties": {
    "ph_request_type": {
      "type": "string",
      "description": "type of request (internal to adapter)",
      "default": "getAssets",
      "enum": [
        "getAssets",
        "postAssets",
        "putAssets",
        "getAssetsAssetId",
        "deleteAssets",
        "putCustomFieldsAsset"
      ],
      "external_name": "ph_request_type"
    },
    "assetNo": {
      "type": ["string", "number"],
      "description": "filter by asset # (Added in v6.0.0)",
      "parse": false,
      "encode": false,
      "encrypt": {
        "type": "AES",
        "key": ""
      },
      "external_name": "asset_no"
    },
    "serialNo": {
      "type": ["string", "object"],
      "description": "filter by serial # (Added in v6.0.0)",
      "parse": false,
      "encode": false,
      "encrypt": {
        "type": "AES",
        "key": ""
      },
      "external_name": "serial_no"
    },
    "lastUpdatedLt": {
      "type": ["string", "number"],
      "description": "last updated less than date YYYY-MM-DD format",
      "parse": false,
      "encode": false,
      "encrypt": {
        "type": "AES",
        "key": ""
      },
      "external_name": "last_updated_lt"
    },
    "lastUpdatedGt": {
      "type": ["string", "number"],
      "description": "last updated greater than date YYYY-MM-DD format",
      "parse": false,
      "encode": false,
      "encrypt": {
        "type": "AES",
        "key": ""
      },
      "external_name": "last_updated_gt"
    },
    "firstAddedLt": {
      "type": ["string", "number"],
      "description": "first added less than date YYYY-MM-DD format",
      "parse": false,
      "encode": false,
      "encrypt": {
        "type": "AES",
        "key": ""
      },
      "external_name": "first_added_lt"
    },
    "firstAddedGt": {
      "type": ["string", "number"],
      "description": "first added greater date YYYY-MM-DD format",
      "parse": false,
      "encode": false,
      "encrypt": {
        "type": "AES",
        "key": ""
      },
      "external_name": "first_added_gt"
    },
    "assetId": {
      "type": ["string", "number"],
      "description": "asset id",
      "parse": false,
      "encode": false,
      "encrypt": {
        "type": "AES",
        "key": ""
      },
      "external_name": "asset_id"
    },
    "serviceLevel": {
      "type": ["string", "object"],
      "description": "filter by service level name",
      "parse": false,
      "encode": false,
      "encrypt": {
        "type": "AES",
        "key": ""
      },
      "external_name": "service_level"
    },
    "tagsAnd": {
      "type": "string",
      "description": "filter by all the tags, separated by comma. (This is an AND filter and all tags have to match for filter, this was added in v6.3.1)",
      "parse": false,
      "encode": false,
      "encrypt": {
        "type": "AES",
        "key": ""
      },
      "external_name": "tags_and"
    },
    "assetNoContains": {
      "type": "string",
      "description": "search for any asset that contains matching asset # (Added in v9.2.0)",
      "parse": false,
      "encode": false,
      "encrypt": {
        "type": "AES",
        "key": ""
      },
      "external_name": "asset_no_contains"
    },
    "customFieldsAnd": {
      "type": "string",
      "description": "filter by custom fields, and filter, format of key1:value1,key2:value2",
      "parse": false,
      "encode": false,
      "encrypt": {
        "type": "AES",
        "key": ""
      },
      "external_name": "custom_fields_and"
    },
    "customFieldsOr": {
      "type": "string",
      "description": "filter by custom fields, or filter, format of key1:value1,key2:value2",
      "parse": false,
      "encode": false,
      "encrypt": {
        "type": "AES",
        "key": ""
      },
      "external_name": "custom_fields_or"
    },
    "relatedDeviceId": {
      "type": ["string", "number"],
      "description": "ID of the related device (added in v9.3.0)",
      "parse": false,
      "encode": false,
      "encrypt": {
        "type": "AES",
        "key": ""
      },
      "external_name": "related_device_id"
    },
    "includeCols": {
      "type": "string",
      "description": "do not return all columns just the ones specified. For example, ?include_cols=name, device_id, rack will only result in name, device_id, and rack included in the output. ...(description truncated)",
      "parse": false,
      "encode": false,
      "encrypt": {
        "type": "AES",
        "key": ""
      },
      "external_name": "include_cols"
    }
  },
  "definitions": {}
}