{
  "$id": "schema.json",
  "type": "object",
  "schema": "http://json-schema.org/draft-07/schema#",
  "translate": true,
  "dynamicfields": true,
  "properties": {
    "ph_request_type": {
      "type": "string",
      "description": "type of request (internal to adapter)",
      "default": "getAllPowerCircuits",
      "enum": [
        "getAllPowerCircuits",
        "postUpdatePowerCircuits",
        "deletePowerCircuit"
      ],
      "external_name": "ph_request_type"
    },
    "breakerpanelId": {
      "type": "string",
      "description": "Breaker panel ID",
      "parse": false,
      "encode": false,
      "encrypt": {
        "type": "AES",
        "key": ""
      },
      "external_name": "breakerpanel_id"
    },
    "bcpmId": {
      "type": "string",
      "description": "Branch Circuit Power Meter ID",
      "parse": false,
      "encode": false,
      "encrypt": {
        "type": "AES",
        "key": ""
      },
      "external_name": "bcpm_id"
    }
  },
  "definitions": {}
}