{
  "actions": [
    {
      "name": "applicationRequestServiceSearchRequestsByStatus",
      "protocol": "REST",
      "method": "GET",
      "entitypath": "{base_path}/{version}/v1/application-access-requests?{query}",
      "requestSchema": "schema.json",
      "responseSchema": "schema.json",
      "timeout": 0,
      "sendEmpty": false,
      "sendGetBody": false,
      "requestDatatype": "JSON",
      "responseDatatype": "JSON",
      "headers": {},
      "responseObjects": [
        {
          "type": "default",
          "key": "",
          "mockFile": ""
        }
      ]
    },
    {
      "name": "applicationRequestServiceGetRequestByDeviceId",
      "protocol": "REST",
      "method": "GET",
      "entitypath": "{base_path}/{version}/v1/application-access-request/{pathv1}?{query}",
      "requestSchema": "schema.json",
      "responseSchema": "schema.json",
      "timeout": 0,
      "sendEmpty": false,
      "sendGetBody": false,
      "requestDatatype": "JSON",
      "responseDatatype": "JSON",
      "headers": {},
      "responseObjects": [
        {
          "type": "default",
          "key": "",
          "mockFile": ""
        }
      ]
    },
    {
      "name": "applicationRequestServiceUpdateRequest",
      "protocol": "REST",
      "method": "PATCH",
      "entitypath": "{base_path}/{version}/v1/application-access-request/{pathv1}?{query}",
      "requestSchema": "schema.json",
      "responseSchema": "schema.json",
      "timeout": 0,
      "sendEmpty": false,
      "requestDatatype": "JSON",
      "responseDatatype": "JSON",
      "headers": {},
      "responseObjects": [
        {
          "type": "default",
          "key": "",
          "mockFile": ""
        }
      ]
    },
    {
      "name": "applicationRequestServiceGetAudits",
      "protocol": "REST",
      "method": "GET",
      "entitypath": "{base_path}/{version}/v1/application-access-request-audits?{query}",
      "requestSchema": "schema.json",
      "responseSchema": "schema.json",
      "timeout": 0,
      "sendEmpty": false,
      "sendGetBody": false,
      "requestDatatype": "JSON",
      "responseDatatype": "JSON",
      "headers": {},
      "responseObjects": [
        {
          "type": "default",
          "key": "",
          "mockFile": ""
        }
      ]
    }
  ]
}