{
  "$id": "schema.json",
  "type": "object",
  "schema": "http://json-schema.org/draft-07/schema#",
  "translate": true,
  "dynamicfields": true,
  "properties": {
    "ph_request_type": {
      "type": "string",
      "description": "type of request (internal to adapter)",
      "default": "ticketSystemsServiceGetTicketSystems",
      "enum": [
        "ticketSystemsServiceGetTicketSystems",
        "ticketSystemsServiceCreateTicketSystem",
        "ticketSystemsServiceGetTicketSystem",
        "ticketSystemsServiceUpdateTicketSystem",
        "ticketSystemsServiceGetTicketSystemsV2",
        "ticketSystemsServiceGetTicketSystemV2"
      ],
      "external_name": "ph_request_type"
    },
    "sortBy0Direction": {
      "type": "string",
      "description": "Sort direction",
      "parse": false,
      "encode": false,
      "encrypt": {
        "type": "AES",
        "key": ""
      },
      "external_name": "sortBy[0].direction"
    },
    "sortBy0Name": {
      "type": "string",
      "description": "Sort field name",
      "parse": false,
      "encode": false,
      "encrypt": {
        "type": "AES",
        "key": ""
      },
      "external_name": "sortBy[0].name"
    },
    "sortBy0Priority": {
      "type": "number",
      "description": "Priority index. Sorts with lower values are executed earlier",
      "parse": false,
      "encode": false,
      "encrypt": {
        "type": "AES",
        "key": ""
      },
      "external_name": "sortBy[0].priority"
    }
  },
  "definitions": {}
}