{
  "actions": [
    {
      "name": "secretSessionsServiceSearchSessions",
      "protocol": "REST",
      "method": "GET",
      "entitypath": "{base_path}/{version}/v1/recorded-sessions?{query}",
      "requestSchema": "schema.json",
      "responseSchema": "schema.json",
      "timeout": 0,
      "sendEmpty": false,
      "sendGetBody": false,
      "requestDatatype": "JSON",
      "responseDatatype": "JSON",
      "headers": {},
      "responseObjects": [
        {
          "type": "default",
          "key": "",
          "mockFile": ""
        }
      ]
    },
    {
      "name": "secretSessionsServiceGet",
      "protocol": "REST",
      "method": "GET",
      "entitypath": "{base_path}/{version}/v1/recorded-sessions/{pathv1}?{query}",
      "requestSchema": "schema.json",
      "responseSchema": "schema.json",
      "timeout": 0,
      "sendEmpty": false,
      "sendGetBody": false,
      "requestDatatype": "JSON",
      "responseDatatype": "JSON",
      "headers": {},
      "responseObjects": [
        {
          "type": "default",
          "key": "",
          "mockFile": ""
        }
      ]
    },
    {
      "name": "secretSessionsServiceGetSummary",
      "protocol": "REST",
      "method": "GET",
      "entitypath": "{base_path}/{version}/v1/recorded-sessions/{pathv1}/summary?{query}",
      "requestSchema": "schema.json",
      "responseSchema": "schema.json",
      "timeout": 0,
      "sendEmpty": false,
      "sendGetBody": false,
      "requestDatatype": "JSON",
      "responseDatatype": "JSON",
      "headers": {},
      "responseObjects": [
        {
          "type": "default",
          "key": "",
          "mockFile": ""
        }
      ]
    },
    {
      "name": "secretSessionsServiceSearchPointsOfInterest",
      "protocol": "REST",
      "method": "GET",
      "entitypath": "{base_path}/{version}/v1/recorded-sessions/{pathv1}/points-of-interest?{query}",
      "requestSchema": "schema.json",
      "responseSchema": "schema.json",
      "timeout": 0,
      "sendEmpty": false,
      "sendGetBody": false,
      "requestDatatype": "JSON",
      "responseDatatype": "JSON",
      "headers": {},
      "responseObjects": [
        {
          "type": "default",
          "key": "",
          "mockFile": ""
        }
      ]
    },
    {
      "name": "secretSessionsServiceSearchPointsOfInterestSummary",
      "protocol": "REST",
      "method": "GET",
      "entitypath": "{base_path}/{version}/v1/recorded-sessions/{pathv1}/points-of-interest-summary?{query}",
      "requestSchema": "schema.json",
      "responseSchema": "schema.json",
      "timeout": 0,
      "sendEmpty": false,
      "sendGetBody": false,
      "requestDatatype": "JSON",
      "responseDatatype": "JSON",
      "headers": {},
      "responseObjects": [
        {
          "type": "default",
          "key": "",
          "mockFile": ""
        }
      ]
    },
    {
      "name": "secretSessionsServiceGetSessionRecording",
      "protocol": "REST",
      "method": "GET",
      "entitypath": "{base_path}/{version}/v1/recorded-sessions/{pathv1}/session-recordings?{query}",
      "requestSchema": "schema.json",
      "responseSchema": "schema.json",
      "timeout": 0,
      "sendEmpty": false,
      "sendGetBody": false,
      "requestDatatype": "JSON",
      "responseDatatype": "JSON",
      "headers": {},
      "responseObjects": [
        {
          "type": "default",
          "key": "",
          "mockFile": ""
        }
      ]
    },
    {
      "name": "secretSessionsServiceProcessSession",
      "protocol": "REST",
      "method": "POST",
      "entitypath": "{base_path}/{version}/v1/recorded-sessions/{pathv1}/request-processing?{query}",
      "requestSchema": "schema.json",
      "responseSchema": "schema.json",
      "timeout": 0,
      "sendEmpty": false,
      "requestDatatype": "JSON",
      "responseDatatype": "JSON",
      "headers": {},
      "responseObjects": [
        {
          "type": "default",
          "key": "",
          "mockFile": ""
        }
      ]
    }
  ]
}