{
  "$id": "schema.json",
  "type": "object",
  "schema": "http://json-schema.org/draft-07/schema#",
  "translate": true,
  "dynamicfields": true,
  "properties": {
    "ph_request_type": {
      "type": "string",
      "description": "type of request (internal to adapter)",
      "default": "directoryServicesServiceUnlinkDomainGroup",
      "enum": [
        "directoryServicesServiceUnlinkDomainGroup",
        "directoryServicesServiceGetSynchronizationLog",
        "directoryServicesServiceGetSynchronizationStatus",
        "directoryServicesServiceSearchDomains",
        "directoryServicesServiceCreateDomain",
        "directoryServicesServiceGetDomain",
        "directoryServicesServiceGetLdapSyncSettings",
        "directoryServicesServiceGetDomainStub",
        "directoryServicesServiceSearchDirectoryForGroups",
        "directoryServicesServiceGetDirectoryGroupMembers",
        "directoryServicesServiceGetDirectoryServicesConfiguration",
        "directoryServicesServicePatchDirectoryServicesConfiguration",
        "directoryServicesServicePatchLdapSyncSettings",
        "directoryServicesServicePatchDomain",
        "directoryServicesServiceSynchronizeNow",
        "directoryServicesServiceLinkDomainGroup"
      ],
      "external_name": "ph_request_type"
    },
    "filterEndDate": {
      "type": "string",
      "description": "EndDate",
      "parse": false,
      "encode": false,
      "encrypt": {
        "type": "AES",
        "key": ""
      },
      "external_name": "filter.endDate"
    },
    "filterSearchText": {
      "type": "string",
      "description": "SearchText",
      "parse": false,
      "encode": false,
      "encrypt": {
        "type": "AES",
        "key": ""
      },
      "external_name": "filter.searchText"
    },
    "filterStartDate": {
      "type": "string",
      "description": "StartDate",
      "parse": false,
      "encode": false,
      "encrypt": {
        "type": "AES",
        "key": ""
      },
      "external_name": "filter.startDate"
    },
    "sortBy0Direction": {
      "type": "string",
      "description": "Sort direction",
      "parse": false,
      "encode": false,
      "encrypt": {
        "type": "AES",
        "key": ""
      },
      "external_name": "sortBy[0].direction"
    },
    "sortBy0Name": {
      "type": "string",
      "description": "Sort field name",
      "parse": false,
      "encode": false,
      "encrypt": {
        "type": "AES",
        "key": ""
      },
      "external_name": "sortBy[0].name"
    },
    "sortBy0Priority": {
      "type": "number",
      "description": "Priority index. Sorts with lower values are executed earlier",
      "parse": false,
      "encode": false,
      "encrypt": {
        "type": "AES",
        "key": ""
      },
      "external_name": "sortBy[0].priority"
    },
    "filterDomainName": {
      "type": "string",
      "description": "DomainName",
      "parse": false,
      "encode": false,
      "encrypt": {
        "type": "AES",
        "key": ""
      },
      "external_name": "filter.domainName"
    },
    "filterIncludeInactive": {
      "type": "boolean",
      "description": "IncludeInactive",
      "parse": false,
      "encode": false,
      "encrypt": {
        "type": "AES",
        "key": ""
      },
      "external_name": "filter.includeInactive"
    }
  },
  "definitions": {}
}