{
  "$id": "schema.json",
  "type": "object",
  "schema": "http://json-schema.org/draft-07/schema#",
  "translate": true,
  "dynamicfields": true,
  "properties": {
    "ph_request_type": {
      "type": "string",
      "description": "type of request (internal to adapter)",
      "default": "secretPermissionsServiceGet",
      "enum": [
        "secretPermissionsServiceGet",
        "secretPermissionsServiceUpdateSecretPermission",
        "secretPermissionsServiceDelete",
        "secretPermissionsServiceSearchSecretPermissions",
        "secretPermissionsServiceAddSecretPermission",
        "secretPermissionsServiceStub",
        "secretPermissionsServiceUpdateSecretShare"
      ],
      "external_name": "ph_request_type"
    },
    "filterDomainName": {
      "type": "string",
      "description": "DomainName",
      "parse": false,
      "encode": false,
      "encrypt": {
        "type": "AES",
        "key": ""
      },
      "external_name": "filter.domainName"
    },
    "filterGroupId": {
      "type": "number",
      "description": "Filter by group ID",
      "parse": false,
      "encode": false,
      "encrypt": {
        "type": "AES",
        "key": ""
      },
      "external_name": "filter.groupId"
    },
    "filterGroupName": {
      "type": "string",
      "description": "GroupName",
      "parse": false,
      "encode": false,
      "encrypt": {
        "type": "AES",
        "key": ""
      },
      "external_name": "filter.groupName"
    },
    "filterSecretId": {
      "type": "number",
      "description": "Filter by secret ID",
      "parse": false,
      "encode": false,
      "encrypt": {
        "type": "AES",
        "key": ""
      },
      "external_name": "filter.secretId"
    },
    "filterUserId": {
      "type": "number",
      "description": "Filter by user ID",
      "parse": false,
      "encode": false,
      "encrypt": {
        "type": "AES",
        "key": ""
      },
      "external_name": "filter.userId"
    },
    "filterUserName": {
      "type": "string",
      "description": "UserName",
      "parse": false,
      "encode": false,
      "encrypt": {
        "type": "AES",
        "key": ""
      },
      "external_name": "filter.userName"
    },
    "sortBy0Direction": {
      "type": "string",
      "description": "Sort direction",
      "parse": false,
      "encode": false,
      "encrypt": {
        "type": "AES",
        "key": ""
      },
      "external_name": "sortBy[0].direction"
    },
    "sortBy0Name": {
      "type": "string",
      "description": "Sort field name",
      "parse": false,
      "encode": false,
      "encrypt": {
        "type": "AES",
        "key": ""
      },
      "external_name": "sortBy[0].name"
    },
    "sortBy0Priority": {
      "type": "number",
      "description": "Priority index. Sorts with lower values are executed earlier",
      "parse": false,
      "encode": false,
      "encrypt": {
        "type": "AES",
        "key": ""
      },
      "external_name": "sortBy[0].priority"
    }
  },
  "definitions": {}
}