{
  "$id": "schema.json",
  "type": "object",
  "schema": "http://json-schema.org/draft-07/schema#",
  "translate": true,
  "dynamicfields": true,
  "properties": {
    "ph_request_type": {
      "type": "string",
      "description": "type of request (internal to adapter)",
      "default": "groupsServiceGet",
      "enum": [
        "groupsServiceGet",
        "groupsServiceUpdate",
        "groupsServiceDelete",
        "groupsServiceGetGroupUser",
        "groupsServiceRemoveUserFromGroup",
        "groupsServiceGetRoles",
        "groupsServiceUpdateUserRoles",
        "groupsServiceCreateUserRoles",
        "groupsServiceDeleteUserRoles",
        "groupsServiceSearch",
        "groupsServiceCreate",
        "groupsServiceLookup",
        "groupsServiceStub",
        "groupsServiceGetGroupMembership",
        "groupsServiceAddUserToGroup",
        "groupsServicePatchGroupMembership",
        "groupsServiceGetAuditGroupAssignments",
        "groupsServicePatchGroup",
        "groupsServiceUpdateGroupMembers"
      ],
      "external_name": "ph_request_type"
    },
    "sortBy0Direction": {
      "type": "string",
      "description": "Sort direction",
      "parse": false,
      "encode": false,
      "encrypt": {
        "type": "AES",
        "key": ""
      },
      "external_name": "sortBy[0].direction"
    },
    "sortBy0Name": {
      "type": "string",
      "description": "Sort field name",
      "parse": false,
      "encode": false,
      "encrypt": {
        "type": "AES",
        "key": ""
      },
      "external_name": "sortBy[0].name"
    },
    "sortBy0Priority": {
      "type": "number",
      "description": "Priority index. Sorts with lower values are executed earlier",
      "parse": false,
      "encode": false,
      "encrypt": {
        "type": "AES",
        "key": ""
      },
      "external_name": "sortBy[0].priority"
    },
    "filterDomainId": {
      "type": "number",
      "description": "Active Directory domain ID",
      "parse": false,
      "encode": false,
      "encrypt": {
        "type": "AES",
        "key": ""
      },
      "external_name": "filter.domainId"
    },
    "filterExcludeInboxRuleIdSubscribers": {
      "type": "number",
      "description": "Do not include any groups already subscribed this inbox notification rule",
      "parse": false,
      "encode": false,
      "encrypt": {
        "type": "AES",
        "key": ""
      },
      "external_name": "filter.excludeInboxRuleIdSubscribers"
    },
    "filterIncludeInactive": {
      "type": "boolean",
      "description": "Whether to include inactive groups in the results",
      "parse": false,
      "encode": false,
      "encrypt": {
        "type": "AES",
        "key": ""
      },
      "external_name": "filter.includeInactive"
    },
    "filterLimitToViewableGroups": {
      "type": "boolean",
      "description": "Limit groups to groups that current user can view details of",
      "parse": false,
      "encode": false,
      "encrypt": {
        "type": "AES",
        "key": ""
      },
      "external_name": "filter.limitToViewableGroups"
    },
    "filterSearchText": {
      "type": "string",
      "description": "Search text",
      "parse": false,
      "encode": false,
      "encrypt": {
        "type": "AES",
        "key": ""
      },
      "external_name": "filter.searchText"
    },
    "filterIncludeInactiveUsersForGroup": {
      "type": "boolean",
      "description": "Whether to include inactive users in the results",
      "parse": false,
      "encode": false,
      "encrypt": {
        "type": "AES",
        "key": ""
      },
      "external_name": "filter.includeInactiveUsersForGroup"
    },
    "filterUserDomainId": {
      "type": "number",
      "description": "Filter only users in a specific domain",
      "parse": false,
      "encode": false,
      "encrypt": {
        "type": "AES",
        "key": ""
      },
      "external_name": "filter.userDomainId"
    }
  },
  "definitions": {}
}