{
  "actions": [
    {
      "name": "teamsServiceSearch",
      "protocol": "REST",
      "method": "GET",
      "entitypath": "{base_path}/{version}/v1/teams?{query}",
      "requestSchema": "schema.json",
      "responseSchema": "schema.json",
      "timeout": 0,
      "sendEmpty": false,
      "sendGetBody": false,
      "requestDatatype": "JSON",
      "responseDatatype": "JSON",
      "headers": {},
      "responseObjects": [
        {
          "type": "default",
          "key": "",
          "mockFile": ""
        }
      ]
    },
    {
      "name": "teamsServiceCreateTeam",
      "protocol": "REST",
      "method": "POST",
      "entitypath": "{base_path}/{version}/v1/teams?{query}",
      "requestSchema": "schema.json",
      "responseSchema": "schema.json",
      "timeout": 0,
      "sendEmpty": false,
      "requestDatatype": "JSON",
      "responseDatatype": "JSON",
      "headers": {},
      "responseObjects": [
        {
          "type": "default",
          "key": "",
          "mockFile": ""
        }
      ]
    },
    {
      "name": "teamsServiceStub",
      "protocol": "REST",
      "method": "GET",
      "entitypath": "{base_path}/{version}/v1/teams/stub?{query}",
      "requestSchema": "schema.json",
      "responseSchema": "schema.json",
      "timeout": 0,
      "sendEmpty": false,
      "sendGetBody": false,
      "requestDatatype": "JSON",
      "responseDatatype": "JSON",
      "headers": {},
      "responseObjects": [
        {
          "type": "default",
          "key": "",
          "mockFile": ""
        }
      ]
    },
    {
      "name": "teamsServiceGet",
      "protocol": "REST",
      "method": "GET",
      "entitypath": "{base_path}/{version}/v1/teams/{pathv1}?{query}",
      "requestSchema": "schema.json",
      "responseSchema": "schema.json",
      "timeout": 0,
      "sendEmpty": false,
      "sendGetBody": false,
      "requestDatatype": "JSON",
      "responseDatatype": "JSON",
      "headers": {},
      "responseObjects": [
        {
          "type": "default",
          "key": "",
          "mockFile": ""
        }
      ]
    },
    {
      "name": "teamsServiceUpdateTeam",
      "protocol": "REST",
      "method": "PUT",
      "entitypath": "{base_path}/{version}/v1/teams/{pathv1}?{query}",
      "requestSchema": "schema.json",
      "responseSchema": "schema.json",
      "timeout": 0,
      "sendEmpty": false,
      "requestDatatype": "JSON",
      "responseDatatype": "JSON",
      "headers": {},
      "responseObjects": [
        {
          "type": "default",
          "key": "",
          "mockFile": ""
        }
      ]
    },
    {
      "name": "teamsServiceGetTeamAudits",
      "protocol": "REST",
      "method": "GET",
      "entitypath": "{base_path}/{version}/v1/teams/{pathv1}/audits?{query}",
      "requestSchema": "schema.json",
      "responseSchema": "schema.json",
      "timeout": 0,
      "sendEmpty": false,
      "sendGetBody": false,
      "requestDatatype": "JSON",
      "responseDatatype": "JSON",
      "headers": {},
      "responseObjects": [
        {
          "type": "default",
          "key": "",
          "mockFile": ""
        }
      ]
    },
    {
      "name": "teamsServiceGetTeamMembers",
      "protocol": "REST",
      "method": "GET",
      "entitypath": "{base_path}/{version}/v1/teams/{pathv1}/members?{query}",
      "requestSchema": "schema.json",
      "responseSchema": "schema.json",
      "timeout": 0,
      "sendEmpty": false,
      "sendGetBody": false,
      "requestDatatype": "JSON",
      "responseDatatype": "JSON",
      "headers": {},
      "responseObjects": [
        {
          "type": "default",
          "key": "",
          "mockFile": "mockdatafiles/teamsServiceGetTeamMembers-default.json"
        }
      ]
    },
    {
      "name": "teamsServiceAddTeamMember",
      "protocol": "REST",
      "method": "POST",
      "entitypath": "{base_path}/{version}/v1/teams/{pathv1}/members?{query}",
      "requestSchema": "schema.json",
      "responseSchema": "schema.json",
      "timeout": 0,
      "sendEmpty": false,
      "requestDatatype": "JSON",
      "responseDatatype": "JSON",
      "headers": {},
      "responseObjects": [
        {
          "type": "default",
          "key": "",
          "mockFile": "mockdatafiles/teamsServiceAddTeamMember-default.json"
        }
      ]
    },
    {
      "name": "teamsServiceGetTeamSites",
      "protocol": "REST",
      "method": "GET",
      "entitypath": "{base_path}/{version}/v1/teams/{pathv1}/sites?{query}",
      "requestSchema": "schema.json",
      "responseSchema": "schema.json",
      "timeout": 0,
      "sendEmpty": false,
      "sendGetBody": false,
      "requestDatatype": "JSON",
      "responseDatatype": "JSON",
      "headers": {},
      "responseObjects": [
        {
          "type": "default",
          "key": "",
          "mockFile": "mockdatafiles/teamsServiceGetTeamSites-default.json"
        }
      ]
    },
    {
      "name": "teamsServiceAddTeamSite",
      "protocol": "REST",
      "method": "POST",
      "entitypath": "{base_path}/{version}/v1/teams/{pathv1}/sites?{query}",
      "requestSchema": "schema.json",
      "responseSchema": "schema.json",
      "timeout": 0,
      "sendEmpty": false,
      "requestDatatype": "JSON",
      "responseDatatype": "JSON",
      "headers": {},
      "responseObjects": [
        {
          "type": "default",
          "key": "",
          "mockFile": "mockdatafiles/teamsServiceAddTeamSite-default.json"
        }
      ]
    },
    {
      "name": "teamsServiceGetTeamLists",
      "protocol": "REST",
      "method": "GET",
      "entitypath": "{base_path}/{version}/v1/teams/{pathv1}/lists?{query}",
      "requestSchema": "schema.json",
      "responseSchema": "schema.json",
      "timeout": 0,
      "sendEmpty": false,
      "sendGetBody": false,
      "requestDatatype": "JSON",
      "responseDatatype": "JSON",
      "headers": {},
      "responseObjects": [
        {
          "type": "default",
          "key": "",
          "mockFile": ""
        }
      ]
    },
    {
      "name": "teamsServiceAddListsToTeam",
      "protocol": "REST",
      "method": "POST",
      "entitypath": "{base_path}/{version}/v1/teams/{pathv1}/lists?{query}",
      "requestSchema": "schema.json",
      "responseSchema": "schema.json",
      "timeout": 0,
      "sendEmpty": false,
      "requestDatatype": "JSON",
      "responseDatatype": "JSON",
      "headers": {},
      "responseObjects": [
        {
          "type": "default",
          "key": "",
          "mockFile": ""
        }
      ]
    }
  ]
}