[
  {
    "childFolderCount": 7,
    "folderId": 2,
    "hasPipelinePolicy": false
  },
  {
    "childFolderCount": 9,
    "folderId": 3,
    "hasPipelinePolicy": false
  },
  {
    "childFolderCount": 10,
    "folderId": 3,
    "hasPipelinePolicy": true
  },
  {
    "childFolderCount": 5,
    "folderId": 3,
    "hasPipelinePolicy": false
  }
]