[
  {
    "hasOwnerOrEditAccess": true,
    "id": 3,
    "isButtonBound": true,
    "isFavoriteSecret": true,
    "isSystemFolder": false,
    "matchOrderType": null,
    "name": "string",
    "redirectUrl": "string",
    "requireComment": true,
    "resultPriority": 7,
    "secretTypeId": 2,
    "shouldRedirect": true
  }
]