{
  "actions": [
    {
      "name": "inboxRulesServiceSubscribeCurrentUserToRule",
      "protocol": "REST",
      "method": "POST",
      "entitypath": "{base_path}/{version}/v1/inbox-rules/{pathv1}/subscribe?{query}",
      "requestSchema": "schema.json",
      "responseSchema": "schema.json",
      "timeout": 0,
      "sendEmpty": false,
      "requestDatatype": "JSON",
      "responseDatatype": "JSON",
      "headers": {},
      "responseObjects": [
        {
          "type": "default",
          "key": "",
          "mockFile": ""
        }
      ]
    },
    {
      "name": "inboxRulesServiceUnsubscribeCurrentUserFromRule",
      "protocol": "REST",
      "method": "DELETE",
      "entitypath": "{base_path}/{version}/v1/inbox-rules/{pathv1}/subscribe?{query}",
      "requestSchema": "schema.json",
      "responseSchema": "schema.json",
      "timeout": 0,
      "sendEmpty": false,
      "requestDatatype": "JSON",
      "responseDatatype": "JSON",
      "headers": {},
      "responseObjects": [
        {
          "type": "default",
          "key": "",
          "mockFile": ""
        }
      ]
    },
    {
      "name": "inboxRulesServiceSearchInboxRules",
      "protocol": "REST",
      "method": "GET",
      "entitypath": "{base_path}/{version}/v1/inbox-rules?{query}",
      "requestSchema": "schema.json",
      "responseSchema": "schema.json",
      "timeout": 0,
      "sendEmpty": false,
      "sendGetBody": false,
      "requestDatatype": "JSON",
      "responseDatatype": "JSON",
      "headers": {},
      "responseObjects": [
        {
          "type": "default",
          "key": "",
          "mockFile": ""
        }
      ]
    },
    {
      "name": "inboxRulesServiceCreateInboxRule",
      "protocol": "REST",
      "method": "POST",
      "entitypath": "{base_path}/{version}/v1/inbox-rules?{query}",
      "requestSchema": "schema.json",
      "responseSchema": "schema.json",
      "timeout": 0,
      "sendEmpty": false,
      "requestDatatype": "JSON",
      "responseDatatype": "JSON",
      "headers": {},
      "responseObjects": [
        {
          "type": "default",
          "key": "",
          "mockFile": ""
        }
      ]
    },
    {
      "name": "inboxRulesServiceGetInboxRule",
      "protocol": "REST",
      "method": "GET",
      "entitypath": "{base_path}/{version}/v1/inbox-rules/{pathv1}?{query}",
      "requestSchema": "schema.json",
      "responseSchema": "schema.json",
      "timeout": 0,
      "sendEmpty": false,
      "sendGetBody": false,
      "requestDatatype": "JSON",
      "responseDatatype": "JSON",
      "headers": {},
      "responseObjects": [
        {
          "type": "default",
          "key": "",
          "mockFile": ""
        }
      ]
    },
    {
      "name": "inboxRulesServicePatchInboxRule",
      "protocol": "REST",
      "method": "PATCH",
      "entitypath": "{base_path}/{version}/v1/inbox-rules/{pathv1}?{query}",
      "requestSchema": "schema.json",
      "responseSchema": "schema.json",
      "timeout": 0,
      "sendEmpty": false,
      "requestDatatype": "JSON",
      "responseDatatype": "JSON",
      "headers": {},
      "responseObjects": [
        {
          "type": "default",
          "key": "",
          "mockFile": ""
        }
      ]
    },
    {
      "name": "inboxRulesServiceGetInboxRuleStub",
      "protocol": "REST",
      "method": "GET",
      "entitypath": "{base_path}/{version}/v1/inbox-rules/stub?{query}",
      "requestSchema": "schema.json",
      "responseSchema": "schema.json",
      "timeout": 0,
      "sendEmpty": false,
      "sendGetBody": false,
      "requestDatatype": "JSON",
      "responseDatatype": "JSON",
      "headers": {},
      "responseObjects": [
        {
          "type": "default",
          "key": "",
          "mockFile": ""
        }
      ]
    },
    {
      "name": "inboxRulesServiceGetInboxRuleCondition",
      "protocol": "REST",
      "method": "GET",
      "entitypath": "{base_path}/{version}/v1/inbox-rules/conditions/{pathv1}?{query}",
      "requestSchema": "schema.json",
      "responseSchema": "schema.json",
      "timeout": 0,
      "sendEmpty": false,
      "sendGetBody": false,
      "requestDatatype": "JSON",
      "responseDatatype": "JSON",
      "headers": {},
      "responseObjects": [
        {
          "type": "default",
          "key": "",
          "mockFile": ""
        }
      ]
    },
    {
      "name": "inboxRulesServiceSearchInboxRuleConditions",
      "protocol": "REST",
      "method": "GET",
      "entitypath": "{base_path}/{version}/v1/inbox-rules/{pathv1}/conditions?{query}",
      "requestSchema": "schema.json",
      "responseSchema": "schema.json",
      "timeout": 0,
      "sendEmpty": false,
      "sendGetBody": false,
      "requestDatatype": "JSON",
      "responseDatatype": "JSON",
      "headers": {},
      "responseObjects": [
        {
          "type": "default",
          "key": "",
          "mockFile": ""
        }
      ]
    },
    {
      "name": "inboxRulesServiceSearchSubscribers",
      "protocol": "REST",
      "method": "GET",
      "entitypath": "{base_path}/{version}/v1/inbox-rules/{pathv1}/subscribers?{query}",
      "requestSchema": "schema.json",
      "responseSchema": "schema.json",
      "timeout": 0,
      "sendEmpty": false,
      "sendGetBody": false,
      "requestDatatype": "JSON",
      "responseDatatype": "JSON",
      "headers": {},
      "responseObjects": [
        {
          "type": "default",
          "key": "",
          "mockFile": ""
        }
      ]
    },
    {
      "name": "inboxRulesServiceSearchLog",
      "protocol": "REST",
      "method": "GET",
      "entitypath": "{base_path}/{version}/v1/inbox-rules/{pathv1}/action-log?{query}",
      "requestSchema": "schema.json",
      "responseSchema": "schema.json",
      "timeout": 0,
      "sendEmpty": false,
      "sendGetBody": false,
      "requestDatatype": "JSON",
      "responseDatatype": "JSON",
      "headers": {},
      "responseObjects": [
        {
          "type": "default",
          "key": "",
          "mockFile": ""
        }
      ]
    },
    {
      "name": "inboxRulesServicePatchInboxRuleActions",
      "protocol": "REST",
      "method": "PATCH",
      "entitypath": "{base_path}/{version}/v1/inbox-rules/{pathv1}/actions?{query}",
      "requestSchema": "schema.json",
      "responseSchema": "schema.json",
      "timeout": 0,
      "sendEmpty": false,
      "requestDatatype": "JSON",
      "responseDatatype": "JSON",
      "headers": {},
      "responseObjects": [
        {
          "type": "default",
          "key": "",
          "mockFile": ""
        }
      ]
    },
    {
      "name": "inboxRulesServicePatchInboxRuleSubscribers",
      "protocol": "REST",
      "method": "PATCH",
      "entitypath": "{base_path}/{version}/v1/inbox-rules/{pathv1}/subscribers?{query}",
      "requestSchema": "schema.json",
      "responseSchema": "schema.json",
      "timeout": 0,
      "sendEmpty": false,
      "requestDatatype": "JSON",
      "responseDatatype": "JSON",
      "headers": {},
      "responseObjects": [
        {
          "type": "default",
          "key": "",
          "mockFile": ""
        }
      ]
    },
    {
      "name": "inboxRulesServiceCopyInboxRule",
      "protocol": "REST",
      "method": "POST",
      "entitypath": "{base_path}/{version}/v1/inbox-rules/copy?{query}",
      "requestSchema": "schema.json",
      "responseSchema": "schema.json",
      "timeout": 0,
      "sendEmpty": false,
      "requestDatatype": "JSON",
      "responseDatatype": "JSON",
      "headers": {},
      "responseObjects": [
        {
          "type": "default",
          "key": "",
          "mockFile": ""
        }
      ]
    },
    {
      "name": "inboxRulesServiceUpdateInboxRuleCondition",
      "protocol": "REST",
      "method": "PUT",
      "entitypath": "{base_path}/{version}/v1/inbox-rules/{pathv1}/conditions?{query}",
      "requestSchema": "schema.json",
      "responseSchema": "schema.json",
      "timeout": 0,
      "sendEmpty": false,
      "requestDatatype": "JSON",
      "responseDatatype": "JSON",
      "headers": {},
      "responseObjects": [
        {
          "type": "default",
          "key": "",
          "mockFile": ""
        }
      ]
    },
    {
      "name": "inboxRulesServiceCreateInboxRuleCondition",
      "protocol": "REST",
      "method": "POST",
      "entitypath": "{base_path}/{version}/v1/inbox-rules/{pathv1}/conditions?{query}",
      "requestSchema": "schema.json",
      "responseSchema": "schema.json",
      "timeout": 0,
      "sendEmpty": false,
      "requestDatatype": "JSON",
      "responseDatatype": "JSON",
      "headers": {},
      "responseObjects": [
        {
          "type": "default",
          "key": "",
          "mockFile": ""
        }
      ]
    }
  ]
}