{
  "$id": "schema.json",
  "type": "object",
  "schema": "http://json-schema.org/draft-07/schema#",
  "translate": true,
  "dynamicfields": true,
  "properties": {
    "ph_request_type": {
      "type": "string",
      "description": "type of request (internal to adapter)",
      "default": "sdkClientRulesServiceGet",
      "enum": [
        "sdkClientRulesServiceGet",
        "sdkClientRulesServiceUpdateClientRule",
        "sdkClientRulesServiceDelete",
        "sdkClientRulesServiceSearchClientRules",
        "sdkClientRulesServiceCreateClientRule",
        "sdkClientRulesServiceGetOnboardingKey",
        "sdkClientRulesServiceStub"
      ],
      "external_name": "ph_request_type"
    },
    "filterOperator": {
      "type": "string",
      "description": "Operator",
      "parse": false,
      "encode": false,
      "encrypt": {
        "type": "AES",
        "key": ""
      },
      "external_name": "filter.operator"
    },
    "filterSearchText": {
      "type": "string",
      "description": "SearchText",
      "parse": false,
      "encode": false,
      "encrypt": {
        "type": "AES",
        "key": ""
      },
      "external_name": "filter.searchText"
    },
    "filterUserId": {
      "type": "number",
      "description": "UserId",
      "parse": false,
      "encode": false,
      "encrypt": {
        "type": "AES",
        "key": ""
      },
      "external_name": "filter.userId"
    },
    "sortBy0Direction": {
      "type": "string",
      "description": "Sort direction",
      "parse": false,
      "encode": false,
      "encrypt": {
        "type": "AES",
        "key": ""
      },
      "external_name": "sortBy[0].direction"
    },
    "sortBy0Name": {
      "type": "string",
      "description": "Sort field name",
      "parse": false,
      "encode": false,
      "encrypt": {
        "type": "AES",
        "key": ""
      },
      "external_name": "sortBy[0].name"
    },
    "sortBy0Priority": {
      "type": "number",
      "description": "Priority index. Sorts with lower values are executed earlier",
      "parse": false,
      "encode": false,
      "encrypt": {
        "type": "AES",
        "key": ""
      },
      "external_name": "sortBy[0].priority"
    }
  },
  "definitions": {}
}