{
  "$id": "schema.json",
  "type": "object",
  "schema": "http://json-schema.org/draft-07/schema#",
  "translate": true,
  "dynamicfields": true,
  "properties": {
    "ph_request_type": {
      "type": "string",
      "description": "type of request (internal to adapter)",
      "default": "devOpsSecretsVaultTenantServiceGetList",
      "enum": [
        "devOpsSecretsVaultTenantServiceGetList",
        "devOpsSecretsVaultTenantServiceCreate",
        "devOpsSecretsVaultTenantServiceGetTenant",
        "devOpsSecretsVaultTenantServiceUpdate",
        "devOpsSecretsVaultTenantServiceGetTenantStub",
        "devOpsSecretsVaultTenantServiceGetTenantAudits"
      ],
      "external_name": "ph_request_type"
    },
    "filterIncludeInactive": {
      "type": "boolean",
      "description": "If inactive tenants should be returned. Defaulted to false.",
      "parse": false,
      "encode": false,
      "encrypt": {
        "type": "AES",
        "key": ""
      },
      "external_name": "filter.includeInactive"
    },
    "filterNameSearch": {
      "type": "string",
      "description": "Search by tenant names.",
      "parse": false,
      "encode": false,
      "encrypt": {
        "type": "AES",
        "key": ""
      },
      "external_name": "filter.nameSearch"
    },
    "sortBy0Direction": {
      "type": "string",
      "description": "Sort direction",
      "parse": false,
      "encode": false,
      "encrypt": {
        "type": "AES",
        "key": ""
      },
      "external_name": "sortBy[0].direction"
    },
    "sortBy0Name": {
      "type": "string",
      "description": "Sort field name",
      "parse": false,
      "encode": false,
      "encrypt": {
        "type": "AES",
        "key": ""
      },
      "external_name": "sortBy[0].name"
    },
    "sortBy0Priority": {
      "type": "number",
      "description": "Priority index. Sorts with lower values are executed earlier",
      "parse": false,
      "encode": false,
      "encrypt": {
        "type": "AES",
        "key": ""
      },
      "external_name": "sortBy[0].priority"
    },
    "filterSearchText": {
      "type": "string",
      "description": "Search for text in the audit log.",
      "parse": false,
      "encode": false,
      "encrypt": {
        "type": "AES",
        "key": ""
      },
      "external_name": "filter.searchText"
    },
    "filterTenantId": {
      "type": "number",
      "description": "Optional filter by tenant id.",
      "parse": false,
      "encode": false,
      "encrypt": {
        "type": "AES",
        "key": ""
      },
      "external_name": "filter.tenantId"
    }
  },
  "definitions": {}
}