{
  "actions": [
    {
      "name": "devOpsSecretsVaultTenantServiceGetList",
      "protocol": "REST",
      "method": "GET",
      "entitypath": "{base_path}/{version}/v1/devops-secrets-vault/tenant?{query}",
      "requestSchema": "schema.json",
      "responseSchema": "schema.json",
      "timeout": 0,
      "sendEmpty": false,
      "sendGetBody": false,
      "requestDatatype": "JSON",
      "responseDatatype": "JSON",
      "headers": {},
      "responseObjects": [
        {
          "type": "default",
          "key": "",
          "mockFile": ""
        }
      ]
    },
    {
      "name": "devOpsSecretsVaultTenantServiceCreate",
      "protocol": "REST",
      "method": "POST",
      "entitypath": "{base_path}/{version}/v1/devops-secrets-vault/tenant?{query}",
      "requestSchema": "schema.json",
      "responseSchema": "schema.json",
      "timeout": 0,
      "sendEmpty": false,
      "requestDatatype": "JSON",
      "responseDatatype": "JSON",
      "headers": {},
      "responseObjects": [
        {
          "type": "default",
          "key": "",
          "mockFile": ""
        }
      ]
    },
    {
      "name": "devOpsSecretsVaultTenantServiceGetTenant",
      "protocol": "REST",
      "method": "GET",
      "entitypath": "{base_path}/{version}/v1/devops-secrets-vault/tenant/{pathv1}?{query}",
      "requestSchema": "schema.json",
      "responseSchema": "schema.json",
      "timeout": 0,
      "sendEmpty": false,
      "sendGetBody": false,
      "requestDatatype": "JSON",
      "responseDatatype": "JSON",
      "headers": {},
      "responseObjects": [
        {
          "type": "default",
          "key": "",
          "mockFile": ""
        }
      ]
    },
    {
      "name": "devOpsSecretsVaultTenantServiceUpdate",
      "protocol": "REST",
      "method": "PUT",
      "entitypath": "{base_path}/{version}/v1/devops-secrets-vault/tenant/{pathv1}?{query}",
      "requestSchema": "schema.json",
      "responseSchema": "schema.json",
      "timeout": 0,
      "sendEmpty": false,
      "requestDatatype": "JSON",
      "responseDatatype": "JSON",
      "headers": {},
      "responseObjects": [
        {
          "type": "default",
          "key": "",
          "mockFile": ""
        }
      ]
    },
    {
      "name": "devOpsSecretsVaultTenantServiceGetTenantStub",
      "protocol": "REST",
      "method": "GET",
      "entitypath": "{base_path}/{version}/v1/devops-secrets-vault/tenant/stub?{query}",
      "requestSchema": "schema.json",
      "responseSchema": "schema.json",
      "timeout": 0,
      "sendEmpty": false,
      "sendGetBody": false,
      "requestDatatype": "JSON",
      "responseDatatype": "JSON",
      "headers": {},
      "responseObjects": [
        {
          "type": "default",
          "key": "",
          "mockFile": ""
        }
      ]
    },
    {
      "name": "devOpsSecretsVaultTenantServiceGetTenantAudits",
      "protocol": "REST",
      "method": "GET",
      "entitypath": "{base_path}/{version}/v1/devops-secrets-vault/tenant/audits?{query}",
      "requestSchema": "schema.json",
      "responseSchema": "schema.json",
      "timeout": 0,
      "sendEmpty": false,
      "sendGetBody": false,
      "requestDatatype": "JSON",
      "responseDatatype": "JSON",
      "headers": {},
      "responseObjects": [
        {
          "type": "default",
          "key": "",
          "mockFile": ""
        }
      ]
    }
  ]
}