{
  "actions": [
    {
      "name": "addRawDeploymentOption",
      "protocol": "REST",
      "method": "POST",
      "entitypath": "{base_path}/{version}/v1/addRawDeploymentOption?{query}",
      "requestSchema": "schema.json",
      "responseSchema": "schema.json",
      "timeout": 0,
      "sendEmpty": false,
      "requestDatatype": "JSON",
      "responseDatatype": "JSON",
      "headers": {},
      "responseObjects": [
        {
          "type": "default",
          "key": "",
          "mockFile": ""
        }
      ]
    },
    {
      "name": "getDeploymentOptions",
      "protocol": "REST",
      "method": "GET",
      "entitypath": "{base_path}/{version}/v1/getDeploymentOptions?{query}",
      "requestSchema": "schema.json",
      "responseSchema": "schema.json",
      "timeout": 0,
      "sendEmpty": false,
      "sendGetBody": false,
      "requestDatatype": "JSON",
      "responseDatatype": "JSON",
      "headers": {},
      "responseObjects": [
        {
          "type": "default",
          "key": "",
          "mockFile": "mockdatafiles/getDeploymentOptions-default.json"
        }
      ]
    },
    {
      "name": "updateRawDeploymentOption",
      "protocol": "REST",
      "method": "PUT",
      "entitypath": "{base_path}/{version}/v1/updateRawDeploymentOption?{query}",
      "requestSchema": "schema.json",
      "responseSchema": "schema.json",
      "timeout": 0,
      "sendEmpty": false,
      "requestDatatype": "JSON",
      "responseDatatype": "JSON",
      "headers": {},
      "responseObjects": [
        {
          "type": "default",
          "key": "",
          "mockFile": ""
        }
      ]
    }
  ]
}