[
  {
    "id": 12345,
    "name": "...",
    "type": "...",
    "properties": "..."
  },
  {
    "id": 12345,
    "name": "...",
    "type": "...",
    "properties": "..."
  },
  {
    "id": 12345,
    "name": "...",
    "type": "...",
    "properties": "..."
  }
]