{
  "errors": [],
  "statistics": [
    {
      "owner": "errorJson",
      "description": "New adapter errors available for use",
      "value": 0
    },
    {
      "owner": "errorJson",
      "description": "Adapter errors no longer available for use",
      "value": 0
    },
    {
      "owner": "errorJson",
      "description": "Adapter errors that have been updated (e.g. recommendation changes)",
      "value": 29
    },
    {
      "owner": "packageJson",
      "description": "Number of production dependencies",
      "value": 8
    },
    {
      "owner": "packageJson",
      "description": "Number of development dependencies",
      "value": 11
    },
    {
      "owner": "packageJson",
      "description": "Number of npm scripts",
      "value": 21
    },
    {
      "owner": "packageJson",
      "description": "Runtime Library dependency",
      "value": "^4.38.2"
    },
    {
      "owner": "propertiesSchemaJson",
      "description": "Adapter properties defined in the propertiesSchema file",
      "value": 60
    },
    {
      "owner": "readmeMd",
      "description": "Number of lines in the README.md",
      "value": 615
    },
    {
      "owner": "unitTestJS",
      "description": "Number of lines of code in unit tests",
      "value": 1437
    },
    {
      "owner": "unitTestJS",
      "description": "Number of unit tests",
      "value": 75
    },
    {
      "owner": "integrationTestJS",
      "description": "Number of lines of code in integration tests",
      "value": 900
    },
    {
      "owner": "integrationTestJS",
      "description": "Number of integration tests",
      "value": 24
    },
    {
      "owner": "staticFile",
      "description": "Number of lines of code in adapterBase.js",
      "value": 991
    },
    {
      "owner": "staticFile",
      "description": "Number of static files added",
      "value": 21
    },
    {
      "owner": "Overall",
      "description": "Total lines of Code",
      "value": 3328
    },
    {
      "owner": "Overall",
      "description": "Total Tests",
      "value": 99
    },
    {
      "owner": "Overall",
      "description": "Total Files",
      "value": 6
    }
  ]
}