{
  "actions": [
    {
      "name": "getToken",
      "protocol": "REST",
      "method": "POST",
      "entitypath": "{base_path}/{version}/login",
      "requestSchema": "schemaTokenReq.json",
      "responseSchema": "schemaTokenResp.json",
      "timeout": 0,
      "sendEmpty": false,
      "sendGetBody": false,
      "requestDatatype": "JSON",
      "responseDatatype": "JSON",
      "headers": {},
      "responseObjects": [
        {
          "type": "default",
          "key": "return",
          "mockFile": "mockdatafiles/gettoken.json"
        }
      ]
    },
    {
      "name": "healthcheck",
      "protocol": "REST",
      "method": "GET",
      "entitypath": "{base_path}/{version}/stats",
      "requestSchema": "schemaHealth.json",
      "responseSchema": "schemaHealth.json",
      "timeout": 0,
      "sendEmpty": false,
      "sendGetBody": false,
      "requestDatatype": "JSON",
      "responseDatatype": "JSON",
      "headers": {},
      "responseObjects": [
        {
          "type": "default",
          "key": "",
          "mockFile": "mockdatafiles/healthcheck.json"
        }
      ]
    }
  ]
}