{
  "clients": [
      "local",
      "local_async",
      "local_batch",
      "local_subset",
      "runner",
      "runner_async",
      "ssh",
      "wheel",
      "wheel_async"
  ],
  "return": "Welcome"
}