{
  "id": 4,
  "name:": "string",
  "group": {
    "id": 1,
    "name": "string",
    "web_url": "string"
  },
  "milestone": {
    "id": 8,
    "title": "string"
  },
  "lists": [
    null,
    null
  ]
}