{
  "conditions": "string",
  "content": "string",
  "description": "string",
  "html_url": "string",
  "key": "string",
  "limitations": "string",
  "name": "string",
  "nickname": "string",
  "permissions": "string",
  "popular": "string",
  "source_url": "string"
}