{
  "file_name": "string",
  "file_path": "string",
  "size": 2,
  "encoding": "string",
  "content": "string",
  "content_sha256": "string",
  "ref": "string",
  "blob_id": "string",
  "commit_id": "string",
  "last_commit_id": "string"
}