{
  "id": 10,
  "iid": 10,
  "project_id": 7,
  "title": "string",
  "description": "string",
  "state": "string",
  "merged_by": {
    "id": 4,
    "name": "string",
    "username": "string",
    "state": "string",
    "avatar_url": "string",
    "web_url": "string"
  },
  "merged_at": "string",
  "closed_by": {},
  "closed_at": {},
  "created_at": "string",
  "updated_at": "string",
  "target_branch": "string",
  "source_branch": "string",
  "upvotes": 6,
  "downvotes": 1,
  "author": {
    "id": 10,
    "name": "string",
    "username": "string",
    "state": "string",
    "avatar_url": {},
    "web_url": "string"
  },
  "assignee": {
    "id": 3,
    "name": "string",
    "username": "string",
    "state": "string",
    "avatar_url": {},
    "web_url": "string"
  },
  "assignees": [
    null,
    null
  ],
  "source_project_id": 1,
  "target_project_id": 3,
  "labels": [
    null,
    null,
    null,
    null,
    null,
    null,
    null
  ],
  "work_in_progress": true,
  "milestone": {
    "id": 9,
    "iid": 9,
    "project_id": 2,
    "title": "string",
    "description": "string",
    "state": "string",
    "created_at": "string",
    "updated_at": "string",
    "due_date": "string",
    "start_date": "string",
    "web_url": "string"
  },
  "merge_when_pipeline_succeeds": true,
  "merge_status": "string",
  "sha": "string",
  "merge_commit_sha": {},
  "user_notes_count": 4,
  "discussion_locked": {},
  "should_remove_source_branch": false,
  "force_remove_source_branch": false,
  "allow_collaboration": false,
  "allow_maintainer_to_push": true,
  "web_url": "string",
  "time_stats": {
    "time_estimate": 1,
    "total_time_spent": 8,
    "human_time_estimate": {},
    "human_total_time_spent": {}
  },
  "squash": false,
  "task_completion_status": {
    "count": 1,
    "completed_count": 5
  }
}