{
  "action_name": "string",
  "author": {
    "avatar_url": "string",
    "id": "string",
    "name": "string",
    "state": "string",
    "username": "string",
    "web_url": "string"
  },
  "author_id": "string",
  "author_username": "string",
  "created_at": "string",
  "data": "string",
  "note": {
    "attachment": "string",
    "author": {
      "avatar_url": "string",
      "id": "string",
      "name": "string",
      "state": "string",
      "username": "string",
      "web_url": "string"
    },
    "body": "string",
    "created_at": "string",
    "id": "string",
    "noteable_id": "string",
    "noteable_type": "string",
    "system": "string",
    "updated_at": "string"
  },
  "project_id": "string",
  "target_id": "string",
  "target_title": "string",
  "target_type": "string",
  "title": "string"
}