{
  "after_sign_out_path": "string",
  "after_sign_up_text": "string",
  "container_registry_token_expire_delay": "string",
  "created_at": "string",
  "default_branch_protection": "string",
  "default_group_visibility": "string",
  "default_project_visibility": "string",
  "default_projects_limit": "string",
  "default_snippet_visibility": "string",
  "domain_blacklist": "string",
  "domain_blacklist_enabled": "string",
  "domain_whitelist": "string",
  "gravatar_enabled": "string",
  "home_page_url": "string",
  "id": "string",
  "koding_enabled": "string",
  "koding_url": "string",
  "max_attachment_size": "string",
  "plantuml_enabled": "string",
  "plantuml_url": "string",
  "repository_storage": "string",
  "repository_storages": "string",
  "restricted_visibility_levels": "string",
  "session_expire_delay": "string",
  "sign_in_text": "string",
  "signin_enabled": "string",
  "signup_enabled": "string",
  "updated_at": "string",
  "user_oauth_applications": "string"
}
  