{
  "id": 6,
  "name": "string",
  "color": "string",
  "text_color": "string",
  "description": {},
  "open_issues_count": 5,
  "closed_issues_count": 10,
  "open_merge_requests_count": 1,
  "subscribed": true
}