[
  {
    "id": "6a9c1750b37d513a43987b574953fceb50b03ce7",
    "individual_note": false,
    "notes": []
  },
  {
    "id": "6a9c1750b37d513a43987b574953fceb50b03ce7",
    "individual_note": false,
    "notes": []
  },
  {
    "id": "6a9c1750b37d513a43987b574953fceb50b03ce7",
    "individual_note": false,
    "notes": []
  }
]