{
  "commit": {
    "author_email": "string",
    "author_name": "string",
    "committer_email": "string",
    "committer_name": "string",
    "created_at": "string",
    "id": "string",
    "message": "string",
    "short_id": "string",
    "title": "string"
  },
  "commits": {
    "author_email": "string",
    "author_name": "string",
    "committer_email": "string",
    "committer_name": "string",
    "created_at": "string",
    "id": "string",
    "message": "string",
    "short_id": "string",
    "title": "string"
  },
  "compare_same_ref": "string",
  "compare_timeout": "string",
  "diffs": {
    "a_mode": "string",
    "b_mode": "string",
    "deleted_file": "string",
    "diff": "string",
    "new_file": "string",
    "new_path": "string",
    "old_path": "string",
    "renamed_file": "string"
  }
}