{
  "id": 10,
  "name:": "string",
  "group": {
    "id": 2,
    "name": "string",
    "web_url": "string"
  },
  "milestone": {
    "id": 5,
    "title": "string"
  },
  "lists": [
    null,
    null
  ]
}