[
  {
    "id": 52,
    "title": "Snippet",
    "file_name": "snippet.rb",
    "author": {
      "id": 1,
      "username": "pipin",
      "email": "admin@example.com",
      "name": "Pip",
      "state": "active",
      "created_at": "2013-09-30T13:46:01Z"
    },
    "updated_at": "2013-10-02T07:34:20Z",
    "created_at": "2013-10-02T07:34:20Z"
  }
]