{
  "avatar_url": "string",
  "bio": "string",
  "can_create_group": "string",
  "can_create_project": "string",
  "color_scheme_id": "string",
  "confirmed_at": "string",
  "created_at": "string",
  "current_sign_in_at": "string",
  "email": "string",
  "external": "string",
  "id": "string",
  "identities": {
    "extern_uid": "string",
    "provider": "string"
  },
  "is_admin": "string",
  "last_sign_in_at": "string",
  "linkedin": "string",
  "location": "string",
  "name": "string",
  "organization": "string",
  "projects_limit": "string",
  "skype": "string",
  "state": "string",
  "theme_id": "string",
  "twitter": "string",
  "two_factor_enabled": "string",
  "username": "string",
  "web_url": "string",
  "website_url": "string"
}