{
  "avatar_url": "string",
  "description": "string",
  "id": "string",
  "lfs_enabled": "string",
  "name": "string",
  "path": "string",
  "request_access_enabled": "string",
  "statistics": "string",
  "visibility_level": "string",
  "web_url": "string"
}