{
  "author": {
    "avatar_url": "string",
    "id": "string",
    "name": "string",
    "state": "string",
    "username": "string",
    "web_url": "string"
  },
  "created_at": "string",
  "file_name": "string",
  "id": "string",
  "raw_url": "string",
  "title": "string",
  "updated_at": "string",
  "web_url": "string"
}