{
  "id": 5,
  "title": "string",
  "file_name": "string",
  "description": "string",
  "author": {
    "id": 6,
    "username": "string",
    "email": "string",
    "name": "string",
    "state": "string",
    "created_at": "string"
  },
  "updated_at": "string",
  "created_at": "string",
  "web_url": "string"
}