{
  "tag_name": "string",
  "description": "string",
  "name": "string",
  "description_html": "string",
  "created_at": "string",
  "author": {
    "id": 5,
    "name": "string",
    "username": "string",
    "state": "string",
    "avatar_url": "string",
    "web_url": "string"
  },
  "commit": {
    "id": "string",
    "short_id": "string",
    "title": "string",
    "created_at": "string",
    "parent_ids": [
      null,
      null,
      null
    ],
    "message": "string",
    "author_name": "string",
    "author_email": "string",
    "authored_date": "string",
    "committer_name": "string",
    "committer_email": "string",
    "committed_date": "string"
  },
  "assets": {
    "count": 4,
    "sources": [
      null,
      null
    ],
    "links": [
      null,
      null,
      null,
      null,
      null
    ]
  }
}