{
  "items": [
    {
      "assignee": "string",
      "body": "string",
      "closed_at": "string",
      "comments": 7,
      "comments_url": "string",
      "created_at": "string",
      "events_url": "string",
      "html_url": "string",
      "id": 10,
      "labels": [
        {
          "color": "string",
          "name": "string",
          "url": "string"
        },
        {
          "color": "string",
          "name": "string",
          "url": "string"
        },
        {
          "color": "string",
          "name": "string",
          "url": "string"
        },
        {
          "color": "string",
          "name": "string",
          "url": "string"
        },
        {
          "color": "string",
          "name": "string",
          "url": "string"
        }
      ],
      "labels_url": "string",
      "milestone": "string",
      "number": 4,
      "pull_request": {
        "diff_url": "string",
        "html_url": "string",
        "patch_url": "string"
      },
      "score": 9,
      "state": "string",
      "title": "string",
      "updated_at": "string",
      "url": "string",
      "user": {
        "avatar_url": "string",
        "bio": "string",
        "blog": "string",
        "collaborators": 1,
        "company": "string",
        "created_at": "string",
        "disk_usage": 4,
        "email": "string",
        "followers": 10,
        "followers_url": "string",
        "following": 10,
        "following_url": "string",
        "gists_url": "string",
        "gravatar_id": "string",
        "hireable": true,
        "html_url": "string",
        "id": 4,
        "location": "string",
        "login": "string",
        "name": "string",
        "organizations_url": "string",
        "owned_private_repos": 6,
        "plan": {
          "collaborators": 8,
          "name": "string",
          "private_repos": 6,
          "space": 4
        },
        "private_gists": 7,
        "public_gists": 1,
        "public_repos": 2,
        "starred_url": "string",
        "subscriptions_url": "string",
        "total_private_repos": 3,
        "type": "Organization",
        "updated_at": "string",
        "url": "string"
      }
    },
    {
      "assignee": "string",
      "body": "string",
      "closed_at": "string",
      "comments": 10,
      "comments_url": "string",
      "created_at": "string",
      "events_url": "string",
      "html_url": "string",
      "id": 3,
      "labels": [
        {
          "color": "string",
          "name": "string",
          "url": "string"
        },
        {
          "color": "string",
          "name": "string",
          "url": "string"
        },
        {
          "color": "string",
          "name": "string",
          "url": "string"
        },
        {
          "color": "string",
          "name": "string",
          "url": "string"
        }
      ],
      "labels_url": "string",
      "milestone": "string",
      "number": 2,
      "pull_request": {
        "diff_url": "string",
        "html_url": "string",
        "patch_url": "string"
      },
      "score": 7,
      "state": "string",
      "title": "string",
      "updated_at": "string",
      "url": "string",
      "user": {
        "avatar_url": "string",
        "bio": "string",
        "blog": "string",
        "collaborators": 7,
        "company": "string",
        "created_at": "string",
        "disk_usage": 5,
        "email": "string",
        "followers": 3,
        "followers_url": "string",
        "following": 9,
        "following_url": "string",
        "gists_url": "string",
        "gravatar_id": "string",
        "hireable": false,
        "html_url": "string",
        "id": 8,
        "location": "string",
        "login": "string",
        "name": "string",
        "organizations_url": "string",
        "owned_private_repos": 8,
        "plan": {
          "collaborators": 8,
          "name": "string",
          "private_repos": 1,
          "space": 10
        },
        "private_gists": 2,
        "public_gists": 5,
        "public_repos": 8,
        "starred_url": "string",
        "subscriptions_url": "string",
        "total_private_repos": 8,
        "type": "User",
        "updated_at": "string",
        "url": "string"
      }
    },
    {
      "assignee": "string",
      "body": "string",
      "closed_at": "string",
      "comments": 8,
      "comments_url": "string",
      "created_at": "string",
      "events_url": "string",
      "html_url": "string",
      "id": 10,
      "labels": [
        {
          "color": "string",
          "name": "string",
          "url": "string"
        },
        {
          "color": "string",
          "name": "string",
          "url": "string"
        },
        {
          "color": "string",
          "name": "string",
          "url": "string"
        },
        {
          "color": "string",
          "name": "string",
          "url": "string"
        },
        {
          "color": "string",
          "name": "string",
          "url": "string"
        },
        {
          "color": "string",
          "name": "string",
          "url": "string"
        },
        {
          "color": "string",
          "name": "string",
          "url": "string"
        },
        {
          "color": "string",
          "name": "string",
          "url": "string"
        }
      ],
      "labels_url": "string",
      "milestone": "string",
      "number": 8,
      "pull_request": {
        "diff_url": "string",
        "html_url": "string",
        "patch_url": "string"
      },
      "score": 2,
      "state": "string",
      "title": "string",
      "updated_at": "string",
      "url": "string",
      "user": {
        "avatar_url": "string",
        "bio": "string",
        "blog": "string",
        "collaborators": 1,
        "company": "string",
        "created_at": "string",
        "disk_usage": 6,
        "email": "string",
        "followers": 1,
        "followers_url": "string",
        "following": 3,
        "following_url": "string",
        "gists_url": "string",
        "gravatar_id": "string",
        "hireable": true,
        "html_url": "string",
        "id": 8,
        "location": "string",
        "login": "string",
        "name": "string",
        "organizations_url": "string",
        "owned_private_repos": 2,
        "plan": {
          "collaborators": 4,
          "name": "string",
          "private_repos": 4,
          "space": 2
        },
        "private_gists": 2,
        "public_gists": 4,
        "public_repos": 2,
        "starred_url": "string",
        "subscriptions_url": "string",
        "total_private_repos": 10,
        "type": "Organization",
        "updated_at": "string",
        "url": "string"
      }
    },
    {
      "assignee": "string",
      "body": "string",
      "closed_at": "string",
      "comments": 7,
      "comments_url": "string",
      "created_at": "string",
      "events_url": "string",
      "html_url": "string",
      "id": 10,
      "labels": [
        {
          "color": "string",
          "name": "string",
          "url": "string"
        },
        {
          "color": "string",
          "name": "string",
          "url": "string"
        }
      ],
      "labels_url": "string",
      "milestone": "string",
      "number": 10,
      "pull_request": {
        "diff_url": "string",
        "html_url": "string",
        "patch_url": "string"
      },
      "score": 6,
      "state": "string",
      "title": "string",
      "updated_at": "string",
      "url": "string",
      "user": {
        "avatar_url": "string",
        "bio": "string",
        "blog": "string",
        "collaborators": 4,
        "company": "string",
        "created_at": "string",
        "disk_usage": 6,
        "email": "string",
        "followers": 10,
        "followers_url": "string",
        "following": 8,
        "following_url": "string",
        "gists_url": "string",
        "gravatar_id": "string",
        "hireable": true,
        "html_url": "string",
        "id": 8,
        "location": "string",
        "login": "string",
        "name": "string",
        "organizations_url": "string",
        "owned_private_repos": 9,
        "plan": {
          "collaborators": 6,
          "name": "string",
          "private_repos": 3,
          "space": 9
        },
        "private_gists": 6,
        "public_gists": 3,
        "public_repos": 3,
        "starred_url": "string",
        "subscriptions_url": "string",
        "total_private_repos": 5,
        "type": "User",
        "updated_at": "string",
        "url": "string"
      }
    },
    {
      "assignee": "string",
      "body": "string",
      "closed_at": "string",
      "comments": 1,
      "comments_url": "string",
      "created_at": "string",
      "events_url": "string",
      "html_url": "string",
      "id": 3,
      "labels": [
        {
          "color": "string",
          "name": "string",
          "url": "string"
        },
        {
          "color": "string",
          "name": "string",
          "url": "string"
        },
        {
          "color": "string",
          "name": "string",
          "url": "string"
        }
      ],
      "labels_url": "string",
      "milestone": "string",
      "number": 1,
      "pull_request": {
        "diff_url": "string",
        "html_url": "string",
        "patch_url": "string"
      },
      "score": 7,
      "state": "string",
      "title": "string",
      "updated_at": "string",
      "url": "string",
      "user": {
        "avatar_url": "string",
        "bio": "string",
        "blog": "string",
        "collaborators": 9,
        "company": "string",
        "created_at": "string",
        "disk_usage": 10,
        "email": "string",
        "followers": 4,
        "followers_url": "string",
        "following": 10,
        "following_url": "string",
        "gists_url": "string",
        "gravatar_id": "string",
        "hireable": false,
        "html_url": "string",
        "id": 10,
        "location": "string",
        "login": "string",
        "name": "string",
        "organizations_url": "string",
        "owned_private_repos": 5,
        "plan": {
          "collaborators": 9,
          "name": "string",
          "private_repos": 10,
          "space": 8
        },
        "private_gists": 3,
        "public_gists": 9,
        "public_repos": 2,
        "starred_url": "string",
        "subscriptions_url": "string",
        "total_private_repos": 7,
        "type": "User",
        "updated_at": "string",
        "url": "string"
      }
    },
    {
      "assignee": "string",
      "body": "string",
      "closed_at": "string",
      "comments": 9,
      "comments_url": "string",
      "created_at": "string",
      "events_url": "string",
      "html_url": "string",
      "id": 5,
      "labels": [
        {
          "color": "string",
          "name": "string",
          "url": "string"
        },
        {
          "color": "string",
          "name": "string",
          "url": "string"
        }
      ],
      "labels_url": "string",
      "milestone": "string",
      "number": 8,
      "pull_request": {
        "diff_url": "string",
        "html_url": "string",
        "patch_url": "string"
      },
      "score": 7,
      "state": "string",
      "title": "string",
      "updated_at": "string",
      "url": "string",
      "user": {
        "avatar_url": "string",
        "bio": "string",
        "blog": "string",
        "collaborators": 7,
        "company": "string",
        "created_at": "string",
        "disk_usage": 9,
        "email": "string",
        "followers": 2,
        "followers_url": "string",
        "following": 8,
        "following_url": "string",
        "gists_url": "string",
        "gravatar_id": "string",
        "hireable": false,
        "html_url": "string",
        "id": 3,
        "location": "string",
        "login": "string",
        "name": "string",
        "organizations_url": "string",
        "owned_private_repos": 6,
        "plan": {
          "collaborators": 7,
          "name": "string",
          "private_repos": 8,
          "space": 6
        },
        "private_gists": 10,
        "public_gists": 7,
        "public_repos": 6,
        "starred_url": "string",
        "subscriptions_url": "string",
        "total_private_repos": 8,
        "type": "User",
        "updated_at": "string",
        "url": "string"
      }
    },
    {
      "assignee": "string",
      "body": "string",
      "closed_at": "string",
      "comments": 8,
      "comments_url": "string",
      "created_at": "string",
      "events_url": "string",
      "html_url": "string",
      "id": 10,
      "labels": [
        {
          "color": "string",
          "name": "string",
          "url": "string"
        },
        {
          "color": "string",
          "name": "string",
          "url": "string"
        },
        {
          "color": "string",
          "name": "string",
          "url": "string"
        }
      ],
      "labels_url": "string",
      "milestone": "string",
      "number": 3,
      "pull_request": {
        "diff_url": "string",
        "html_url": "string",
        "patch_url": "string"
      },
      "score": 4,
      "state": "string",
      "title": "string",
      "updated_at": "string",
      "url": "string",
      "user": {
        "avatar_url": "string",
        "bio": "string",
        "blog": "string",
        "collaborators": 10,
        "company": "string",
        "created_at": "string",
        "disk_usage": 9,
        "email": "string",
        "followers": 3,
        "followers_url": "string",
        "following": 3,
        "following_url": "string",
        "gists_url": "string",
        "gravatar_id": "string",
        "hireable": false,
        "html_url": "string",
        "id": 4,
        "location": "string",
        "login": "string",
        "name": "string",
        "organizations_url": "string",
        "owned_private_repos": 10,
        "plan": {
          "collaborators": 3,
          "name": "string",
          "private_repos": 2,
          "space": 1
        },
        "private_gists": 10,
        "public_gists": 5,
        "public_repos": 4,
        "starred_url": "string",
        "subscriptions_url": "string",
        "total_private_repos": 4,
        "type": "Organization",
        "updated_at": "string",
        "url": "string"
      }
    }
  ],
  "total_count": 8
}