{
  "$id": "schema.json",
  "type": "object",
  "schema": "http://json-schema.org/draft-07/schema#",
  "translate": true,
  "dynamicfields": true,
  "properties": {
    "ph_request_type": {
      "type": "string",
      "description": "type of request (internal to adapter)",
      "default": "getNotifications",
      "enum": [
        "getNotifications",
        "putNotifications",
        "getNotificationsThreadsId",
        "patchNotificationsThreadsId",
        "deleteNotificationsThreadsIdSubscription",
        "getNotificationsThreadsIdSubscription",
        "putNotificationsThreadsIdSubscription"
      ],
      "external_name": "ph_request_type"
    }
  },
  "definitions": {}
}