{
  "comments": 9,
  "comments_url": "string",
  "created_at": "string",
  "description": "string",
  "files": {
    "ring.erl": {
      "filename": "string",
      "raw_url": "string",
      "size": 3
    }
  },
  "forks": [
    {
      "created_at": "string",
      "url": "string",
      "user": {
        "avatar_url": "string",
        "bio": "string",
        "blog": "string",
        "collaborators": 2,
        "company": "string",
        "created_at": "string",
        "disk_usage": 2,
        "email": "string",
        "followers": 7,
        "followers_url": "string",
        "following": 2,
        "following_url": "string",
        "gists_url": "string",
        "gravatar_id": "string",
        "hireable": true,
        "html_url": "string",
        "id": 8,
        "location": "string",
        "login": "string",
        "name": "string",
        "organizations_url": "string",
        "owned_private_repos": 2,
        "plan": {
          "collaborators": 10,
          "name": "string",
          "private_repos": 3,
          "space": 3
        },
        "private_gists": 9,
        "public_gists": 7,
        "public_repos": 1,
        "starred_url": "string",
        "subscriptions_url": "string",
        "total_private_repos": 4,
        "type": "Organization",
        "updated_at": "string",
        "url": "string"
      }
    },
    {
      "created_at": "string",
      "url": "string",
      "user": {
        "avatar_url": "string",
        "bio": "string",
        "blog": "string",
        "collaborators": 7,
        "company": "string",
        "created_at": "string",
        "disk_usage": 1,
        "email": "string",
        "followers": 6,
        "followers_url": "string",
        "following": 1,
        "following_url": "string",
        "gists_url": "string",
        "gravatar_id": "string",
        "hireable": false,
        "html_url": "string",
        "id": 9,
        "location": "string",
        "login": "string",
        "name": "string",
        "organizations_url": "string",
        "owned_private_repos": 1,
        "plan": {
          "collaborators": 8,
          "name": "string",
          "private_repos": 2,
          "space": 9
        },
        "private_gists": 1,
        "public_gists": 5,
        "public_repos": 8,
        "starred_url": "string",
        "subscriptions_url": "string",
        "total_private_repos": 5,
        "type": "User",
        "updated_at": "string",
        "url": "string"
      }
    },
    {
      "created_at": "string",
      "url": "string",
      "user": {
        "avatar_url": "string",
        "bio": "string",
        "blog": "string",
        "collaborators": 10,
        "company": "string",
        "created_at": "string",
        "disk_usage": 4,
        "email": "string",
        "followers": 8,
        "followers_url": "string",
        "following": 8,
        "following_url": "string",
        "gists_url": "string",
        "gravatar_id": "string",
        "hireable": false,
        "html_url": "string",
        "id": 5,
        "location": "string",
        "login": "string",
        "name": "string",
        "organizations_url": "string",
        "owned_private_repos": 3,
        "plan": {
          "collaborators": 1,
          "name": "string",
          "private_repos": 8,
          "space": 6
        },
        "private_gists": 4,
        "public_gists": 3,
        "public_repos": 4,
        "starred_url": "string",
        "subscriptions_url": "string",
        "total_private_repos": 6,
        "type": "User",
        "updated_at": "string",
        "url": "string"
      }
    },
    {
      "created_at": "string",
      "url": "string",
      "user": {
        "avatar_url": "string",
        "bio": "string",
        "blog": "string",
        "collaborators": 8,
        "company": "string",
        "created_at": "string",
        "disk_usage": 6,
        "email": "string",
        "followers": 9,
        "followers_url": "string",
        "following": 4,
        "following_url": "string",
        "gists_url": "string",
        "gravatar_id": "string",
        "hireable": true,
        "html_url": "string",
        "id": 9,
        "location": "string",
        "login": "string",
        "name": "string",
        "organizations_url": "string",
        "owned_private_repos": 8,
        "plan": {
          "collaborators": 10,
          "name": "string",
          "private_repos": 3,
          "space": 9
        },
        "private_gists": 7,
        "public_gists": 9,
        "public_repos": 5,
        "starred_url": "string",
        "subscriptions_url": "string",
        "total_private_repos": 1,
        "type": "Organization",
        "updated_at": "string",
        "url": "string"
      }
    },
    {
      "created_at": "string",
      "url": "string",
      "user": {
        "avatar_url": "string",
        "bio": "string",
        "blog": "string",
        "collaborators": 5,
        "company": "string",
        "created_at": "string",
        "disk_usage": 6,
        "email": "string",
        "followers": 4,
        "followers_url": "string",
        "following": 2,
        "following_url": "string",
        "gists_url": "string",
        "gravatar_id": "string",
        "hireable": true,
        "html_url": "string",
        "id": 5,
        "location": "string",
        "login": "string",
        "name": "string",
        "organizations_url": "string",
        "owned_private_repos": 2,
        "plan": {
          "collaborators": 5,
          "name": "string",
          "private_repos": 6,
          "space": 5
        },
        "private_gists": 2,
        "public_gists": 10,
        "public_repos": 2,
        "starred_url": "string",
        "subscriptions_url": "string",
        "total_private_repos": 9,
        "type": "Organization",
        "updated_at": "string",
        "url": "string"
      }
    },
    {
      "created_at": "string",
      "url": "string",
      "user": {
        "avatar_url": "string",
        "bio": "string",
        "blog": "string",
        "collaborators": 6,
        "company": "string",
        "created_at": "string",
        "disk_usage": 2,
        "email": "string",
        "followers": 4,
        "followers_url": "string",
        "following": 10,
        "following_url": "string",
        "gists_url": "string",
        "gravatar_id": "string",
        "hireable": true,
        "html_url": "string",
        "id": 7,
        "location": "string",
        "login": "string",
        "name": "string",
        "organizations_url": "string",
        "owned_private_repos": 4,
        "plan": {
          "collaborators": 4,
          "name": "string",
          "private_repos": 3,
          "space": 4
        },
        "private_gists": 2,
        "public_gists": 4,
        "public_repos": 6,
        "starred_url": "string",
        "subscriptions_url": "string",
        "total_private_repos": 6,
        "type": "User",
        "updated_at": "string",
        "url": "string"
      }
    },
    {
      "created_at": "string",
      "url": "string",
      "user": {
        "avatar_url": "string",
        "bio": "string",
        "blog": "string",
        "collaborators": 7,
        "company": "string",
        "created_at": "string",
        "disk_usage": 3,
        "email": "string",
        "followers": 5,
        "followers_url": "string",
        "following": 1,
        "following_url": "string",
        "gists_url": "string",
        "gravatar_id": "string",
        "hireable": false,
        "html_url": "string",
        "id": 10,
        "location": "string",
        "login": "string",
        "name": "string",
        "organizations_url": "string",
        "owned_private_repos": 1,
        "plan": {
          "collaborators": 3,
          "name": "string",
          "private_repos": 4,
          "space": 1
        },
        "private_gists": 6,
        "public_gists": 7,
        "public_repos": 8,
        "starred_url": "string",
        "subscriptions_url": "string",
        "total_private_repos": 7,
        "type": "Organization",
        "updated_at": "string",
        "url": "string"
      }
    },
    {
      "created_at": "string",
      "url": "string",
      "user": {
        "avatar_url": "string",
        "bio": "string",
        "blog": "string",
        "collaborators": 1,
        "company": "string",
        "created_at": "string",
        "disk_usage": 3,
        "email": "string",
        "followers": 2,
        "followers_url": "string",
        "following": 10,
        "following_url": "string",
        "gists_url": "string",
        "gravatar_id": "string",
        "hireable": true,
        "html_url": "string",
        "id": 6,
        "location": "string",
        "login": "string",
        "name": "string",
        "organizations_url": "string",
        "owned_private_repos": 8,
        "plan": {
          "collaborators": 8,
          "name": "string",
          "private_repos": 10,
          "space": 8
        },
        "private_gists": 5,
        "public_gists": 4,
        "public_repos": 6,
        "starred_url": "string",
        "subscriptions_url": "string",
        "total_private_repos": 7,
        "type": "User",
        "updated_at": "string",
        "url": "string"
      }
    }
  ],
  "git_pull_url": "string",
  "git_push_url": "string",
  "history": [
    {
      "change_status": {
        "additions": 2,
        "deletions": 10,
        "total": 1
      },
      "committed_at": "string",
      "url": "string",
      "user": {
        "avatar_url": "string",
        "bio": "string",
        "blog": "string",
        "collaborators": 4,
        "company": "string",
        "created_at": "string",
        "disk_usage": 10,
        "email": "string",
        "followers": 4,
        "followers_url": "string",
        "following": 1,
        "following_url": "string",
        "gists_url": "string",
        "gravatar_id": "string",
        "hireable": true,
        "html_url": "string",
        "id": 10,
        "location": "string",
        "login": "string",
        "name": "string",
        "organizations_url": "string",
        "owned_private_repos": 1,
        "plan": {
          "collaborators": 1,
          "name": "string",
          "private_repos": 4,
          "space": 4
        },
        "private_gists": 1,
        "public_gists": 3,
        "public_repos": 4,
        "starred_url": "string",
        "subscriptions_url": "string",
        "total_private_repos": 5,
        "type": "Organization",
        "updated_at": "string",
        "url": "string"
      },
      "version": "string"
    },
    {
      "change_status": {
        "additions": 7,
        "deletions": 4,
        "total": 6
      },
      "committed_at": "string",
      "url": "string",
      "user": {
        "avatar_url": "string",
        "bio": "string",
        "blog": "string",
        "collaborators": 9,
        "company": "string",
        "created_at": "string",
        "disk_usage": 7,
        "email": "string",
        "followers": 3,
        "followers_url": "string",
        "following": 7,
        "following_url": "string",
        "gists_url": "string",
        "gravatar_id": "string",
        "hireable": false,
        "html_url": "string",
        "id": 9,
        "location": "string",
        "login": "string",
        "name": "string",
        "organizations_url": "string",
        "owned_private_repos": 8,
        "plan": {
          "collaborators": 5,
          "name": "string",
          "private_repos": 5,
          "space": 8
        },
        "private_gists": 6,
        "public_gists": 7,
        "public_repos": 6,
        "starred_url": "string",
        "subscriptions_url": "string",
        "total_private_repos": 8,
        "type": "Organization",
        "updated_at": "string",
        "url": "string"
      },
      "version": "string"
    },
    {
      "change_status": {
        "additions": 5,
        "deletions": 7,
        "total": 2
      },
      "committed_at": "string",
      "url": "string",
      "user": {
        "avatar_url": "string",
        "bio": "string",
        "blog": "string",
        "collaborators": 1,
        "company": "string",
        "created_at": "string",
        "disk_usage": 6,
        "email": "string",
        "followers": 4,
        "followers_url": "string",
        "following": 2,
        "following_url": "string",
        "gists_url": "string",
        "gravatar_id": "string",
        "hireable": false,
        "html_url": "string",
        "id": 4,
        "location": "string",
        "login": "string",
        "name": "string",
        "organizations_url": "string",
        "owned_private_repos": 9,
        "plan": {
          "collaborators": 9,
          "name": "string",
          "private_repos": 8,
          "space": 8
        },
        "private_gists": 2,
        "public_gists": 7,
        "public_repos": 2,
        "starred_url": "string",
        "subscriptions_url": "string",
        "total_private_repos": 7,
        "type": "User",
        "updated_at": "string",
        "url": "string"
      },
      "version": "string"
    },
    {
      "change_status": {
        "additions": 2,
        "deletions": 5,
        "total": 1
      },
      "committed_at": "string",
      "url": "string",
      "user": {
        "avatar_url": "string",
        "bio": "string",
        "blog": "string",
        "collaborators": 1,
        "company": "string",
        "created_at": "string",
        "disk_usage": 8,
        "email": "string",
        "followers": 3,
        "followers_url": "string",
        "following": 1,
        "following_url": "string",
        "gists_url": "string",
        "gravatar_id": "string",
        "hireable": true,
        "html_url": "string",
        "id": 4,
        "location": "string",
        "login": "string",
        "name": "string",
        "organizations_url": "string",
        "owned_private_repos": 4,
        "plan": {
          "collaborators": 5,
          "name": "string",
          "private_repos": 9,
          "space": 9
        },
        "private_gists": 2,
        "public_gists": 1,
        "public_repos": 4,
        "starred_url": "string",
        "subscriptions_url": "string",
        "total_private_repos": 7,
        "type": "User",
        "updated_at": "string",
        "url": "string"
      },
      "version": "string"
    },
    {
      "change_status": {
        "additions": 8,
        "deletions": 2,
        "total": 4
      },
      "committed_at": "string",
      "url": "string",
      "user": {
        "avatar_url": "string",
        "bio": "string",
        "blog": "string",
        "collaborators": 3,
        "company": "string",
        "created_at": "string",
        "disk_usage": 6,
        "email": "string",
        "followers": 2,
        "followers_url": "string",
        "following": 9,
        "following_url": "string",
        "gists_url": "string",
        "gravatar_id": "string",
        "hireable": true,
        "html_url": "string",
        "id": 8,
        "location": "string",
        "login": "string",
        "name": "string",
        "organizations_url": "string",
        "owned_private_repos": 9,
        "plan": {
          "collaborators": 1,
          "name": "string",
          "private_repos": 2,
          "space": 3
        },
        "private_gists": 8,
        "public_gists": 7,
        "public_repos": 10,
        "starred_url": "string",
        "subscriptions_url": "string",
        "total_private_repos": 5,
        "type": "User",
        "updated_at": "string",
        "url": "string"
      },
      "version": "string"
    },
    {
      "change_status": {
        "additions": 1,
        "deletions": 4,
        "total": 9
      },
      "committed_at": "string",
      "url": "string",
      "user": {
        "avatar_url": "string",
        "bio": "string",
        "blog": "string",
        "collaborators": 9,
        "company": "string",
        "created_at": "string",
        "disk_usage": 9,
        "email": "string",
        "followers": 3,
        "followers_url": "string",
        "following": 8,
        "following_url": "string",
        "gists_url": "string",
        "gravatar_id": "string",
        "hireable": false,
        "html_url": "string",
        "id": 4,
        "location": "string",
        "login": "string",
        "name": "string",
        "organizations_url": "string",
        "owned_private_repos": 6,
        "plan": {
          "collaborators": 10,
          "name": "string",
          "private_repos": 5,
          "space": 10
        },
        "private_gists": 6,
        "public_gists": 6,
        "public_repos": 3,
        "starred_url": "string",
        "subscriptions_url": "string",
        "total_private_repos": 4,
        "type": "Organization",
        "updated_at": "string",
        "url": "string"
      },
      "version": "string"
    },
    {
      "change_status": {
        "additions": 8,
        "deletions": 6,
        "total": 2
      },
      "committed_at": "string",
      "url": "string",
      "user": {
        "avatar_url": "string",
        "bio": "string",
        "blog": "string",
        "collaborators": 7,
        "company": "string",
        "created_at": "string",
        "disk_usage": 4,
        "email": "string",
        "followers": 10,
        "followers_url": "string",
        "following": 10,
        "following_url": "string",
        "gists_url": "string",
        "gravatar_id": "string",
        "hireable": false,
        "html_url": "string",
        "id": 8,
        "location": "string",
        "login": "string",
        "name": "string",
        "organizations_url": "string",
        "owned_private_repos": 6,
        "plan": {
          "collaborators": 8,
          "name": "string",
          "private_repos": 4,
          "space": 7
        },
        "private_gists": 2,
        "public_gists": 10,
        "public_repos": 6,
        "starred_url": "string",
        "subscriptions_url": "string",
        "total_private_repos": 5,
        "type": "User",
        "updated_at": "string",
        "url": "string"
      },
      "version": "string"
    },
    {
      "change_status": {
        "additions": 8,
        "deletions": 1,
        "total": 3
      },
      "committed_at": "string",
      "url": "string",
      "user": {
        "avatar_url": "string",
        "bio": "string",
        "blog": "string",
        "collaborators": 6,
        "company": "string",
        "created_at": "string",
        "disk_usage": 3,
        "email": "string",
        "followers": 1,
        "followers_url": "string",
        "following": 6,
        "following_url": "string",
        "gists_url": "string",
        "gravatar_id": "string",
        "hireable": true,
        "html_url": "string",
        "id": 1,
        "location": "string",
        "login": "string",
        "name": "string",
        "organizations_url": "string",
        "owned_private_repos": 4,
        "plan": {
          "collaborators": 1,
          "name": "string",
          "private_repos": 1,
          "space": 1
        },
        "private_gists": 6,
        "public_gists": 5,
        "public_repos": 10,
        "starred_url": "string",
        "subscriptions_url": "string",
        "total_private_repos": 9,
        "type": "Organization",
        "updated_at": "string",
        "url": "string"
      },
      "version": "string"
    },
    {
      "change_status": {
        "additions": 6,
        "deletions": 8,
        "total": 2
      },
      "committed_at": "string",
      "url": "string",
      "user": {
        "avatar_url": "string",
        "bio": "string",
        "blog": "string",
        "collaborators": 6,
        "company": "string",
        "created_at": "string",
        "disk_usage": 7,
        "email": "string",
        "followers": 6,
        "followers_url": "string",
        "following": 9,
        "following_url": "string",
        "gists_url": "string",
        "gravatar_id": "string",
        "hireable": true,
        "html_url": "string",
        "id": 7,
        "location": "string",
        "login": "string",
        "name": "string",
        "organizations_url": "string",
        "owned_private_repos": 9,
        "plan": {
          "collaborators": 3,
          "name": "string",
          "private_repos": 6,
          "space": 6
        },
        "private_gists": 10,
        "public_gists": 8,
        "public_repos": 5,
        "starred_url": "string",
        "subscriptions_url": "string",
        "total_private_repos": 6,
        "type": "Organization",
        "updated_at": "string",
        "url": "string"
      },
      "version": "string"
    },
    {
      "change_status": {
        "additions": 4,
        "deletions": 4,
        "total": 1
      },
      "committed_at": "string",
      "url": "string",
      "user": {
        "avatar_url": "string",
        "bio": "string",
        "blog": "string",
        "collaborators": 8,
        "company": "string",
        "created_at": "string",
        "disk_usage": 4,
        "email": "string",
        "followers": 9,
        "followers_url": "string",
        "following": 6,
        "following_url": "string",
        "gists_url": "string",
        "gravatar_id": "string",
        "hireable": true,
        "html_url": "string",
        "id": 6,
        "location": "string",
        "login": "string",
        "name": "string",
        "organizations_url": "string",
        "owned_private_repos": 8,
        "plan": {
          "collaborators": 7,
          "name": "string",
          "private_repos": 2,
          "space": 5
        },
        "private_gists": 1,
        "public_gists": 9,
        "public_repos": 2,
        "starred_url": "string",
        "subscriptions_url": "string",
        "total_private_repos": 4,
        "type": "Organization",
        "updated_at": "string",
        "url": "string"
      },
      "version": "string"
    }
  ],
  "html_url": "string",
  "id": "string",
  "public": false,
  "url": "string",
  "user": {
    "avatar_url": "string",
    "bio": "string",
    "blog": "string",
    "collaborators": 8,
    "company": "string",
    "created_at": "string",
    "disk_usage": 6,
    "email": "string",
    "followers": 1,
    "followers_url": "string",
    "following": 5,
    "following_url": "string",
    "gists_url": "string",
    "gravatar_id": "string",
    "hireable": true,
    "html_url": "string",
    "id": 5,
    "location": "string",
    "login": "string",
    "name": "string",
    "organizations_url": "string",
    "owned_private_repos": 5,
    "plan": {
      "collaborators": 6,
      "name": "string",
      "private_repos": 8,
      "space": 3
    },
    "private_gists": 5,
    "public_gists": 3,
    "public_repos": 10,
    "starred_url": "string",
    "subscriptions_url": "string",
    "total_private_repos": 7,
    "type": "User",
    "updated_at": "string",
    "url": "string"
  }
}