{
  "base_tree": "string",
  "sha": "string",
  "tree": [
    {
      "sha": "string",
      "tree": [
        {
          "mode": "100644",
          "path": "string",
          "sha": "string",
          "size": 7,
          "type": "blob",
          "url": "string"
        },
        {
          "mode": "100644",
          "path": "string",
          "sha": "string",
          "size": 7,
          "type": "tree",
          "url": "string"
        },
        {
          "mode": "120000",
          "path": "string",
          "sha": "string",
          "size": 8,
          "type": "blob",
          "url": "string"
        }
      ],
      "url": "string"
    },
    {
      "sha": "string",
      "tree": [
        {
          "mode": "100755",
          "path": "string",
          "sha": "string",
          "size": 7,
          "type": "commit",
          "url": "string"
        },
        {
          "mode": "040000",
          "path": "string",
          "sha": "string",
          "size": 10,
          "type": "blob",
          "url": "string"
        },
        {
          "mode": "100755",
          "path": "string",
          "sha": "string",
          "size": 9,
          "type": "blob",
          "url": "string"
        },
        {
          "mode": "100644",
          "path": "string",
          "sha": "string",
          "size": 4,
          "type": "blob",
          "url": "string"
        },
        {
          "mode": "100644",
          "path": "string",
          "sha": "string",
          "size": 9,
          "type": "blob",
          "url": "string"
        },
        {
          "mode": "100644",
          "path": "string",
          "sha": "string",
          "size": 7,
          "type": "blob",
          "url": "string"
        },
        {
          "mode": "100755",
          "path": "string",
          "sha": "string",
          "size": 9,
          "type": "commit",
          "url": "string"
        },
        {
          "mode": "040000",
          "path": "string",
          "sha": "string",
          "size": 5,
          "type": "tree",
          "url": "string"
        }
      ],
      "url": "string"
    },
    {
      "sha": "string",
      "tree": [
        {
          "mode": "100755",
          "path": "string",
          "sha": "string",
          "size": 4,
          "type": "blob",
          "url": "string"
        },
        {
          "mode": "160000",
          "path": "string",
          "sha": "string",
          "size": 10,
          "type": "tree",
          "url": "string"
        },
        {
          "mode": "100755",
          "path": "string",
          "sha": "string",
          "size": 5,
          "type": "blob",
          "url": "string"
        },
        {
          "mode": "120000",
          "path": "string",
          "sha": "string",
          "size": 10,
          "type": "tree",
          "url": "string"
        }
      ],
      "url": "string"
    },
    {
      "sha": "string",
      "tree": [
        {
          "mode": "120000",
          "path": "string",
          "sha": "string",
          "size": 2,
          "type": "tree",
          "url": "string"
        },
        {
          "mode": "040000",
          "path": "string",
          "sha": "string",
          "size": 9,
          "type": "commit",
          "url": "string"
        },
        {
          "mode": "120000",
          "path": "string",
          "sha": "string",
          "size": 2,
          "type": "blob",
          "url": "string"
        },
        {
          "mode": "120000",
          "path": "string",
          "sha": "string",
          "size": 6,
          "type": "tree",
          "url": "string"
        },
        {
          "mode": "100644",
          "path": "string",
          "sha": "string",
          "size": 4,
          "type": "commit",
          "url": "string"
        },
        {
          "mode": "120000",
          "path": "string",
          "sha": "string",
          "size": 2,
          "type": "tree",
          "url": "string"
        },
        {
          "mode": "100644",
          "path": "string",
          "sha": "string",
          "size": 1,
          "type": "tree",
          "url": "string"
        },
        {
          "mode": "040000",
          "path": "string",
          "sha": "string",
          "size": 3,
          "type": "blob",
          "url": "string"
        },
        {
          "mode": "120000",
          "path": "string",
          "sha": "string",
          "size": 3,
          "type": "blob",
          "url": "string"
        }
      ],
      "url": "string"
    },
    {
      "sha": "string",
      "tree": [
        {
          "mode": "160000",
          "path": "string",
          "sha": "string",
          "size": 7,
          "type": "tree",
          "url": "string"
        },
        {
          "mode": "100755",
          "path": "string",
          "sha": "string",
          "size": 2,
          "type": "commit",
          "url": "string"
        },
        {
          "mode": "040000",
          "path": "string",
          "sha": "string",
          "size": 10,
          "type": "commit",
          "url": "string"
        },
        {
          "mode": "160000",
          "path": "string",
          "sha": "string",
          "size": 9,
          "type": "blob",
          "url": "string"
        },
        {
          "mode": "120000",
          "path": "string",
          "sha": "string",
          "size": 4,
          "type": "blob",
          "url": "string"
        },
        {
          "mode": "040000",
          "path": "string",
          "sha": "string",
          "size": 4,
          "type": "tree",
          "url": "string"
        }
      ],
      "url": "string"
    },
    {
      "sha": "string",
      "tree": [
        {
          "mode": "160000",
          "path": "string",
          "sha": "string",
          "size": 8,
          "type": "blob",
          "url": "string"
        },
        {
          "mode": "160000",
          "path": "string",
          "sha": "string",
          "size": 6,
          "type": "tree",
          "url": "string"
        },
        {
          "mode": "100755",
          "path": "string",
          "sha": "string",
          "size": 4,
          "type": "tree",
          "url": "string"
        },
        {
          "mode": "100755",
          "path": "string",
          "sha": "string",
          "size": 3,
          "type": "tree",
          "url": "string"
        },
        {
          "mode": "040000",
          "path": "string",
          "sha": "string",
          "size": 2,
          "type": "commit",
          "url": "string"
        },
        {
          "mode": "120000",
          "path": "string",
          "sha": "string",
          "size": 6,
          "type": "commit",
          "url": "string"
        },
        {
          "mode": "120000",
          "path": "string",
          "sha": "string",
          "size": 9,
          "type": "blob",
          "url": "string"
        }
      ],
      "url": "string"
    },
    {
      "sha": "string",
      "tree": [
        {
          "mode": "120000",
          "path": "string",
          "sha": "string",
          "size": 1,
          "type": "tree",
          "url": "string"
        },
        {
          "mode": "100644",
          "path": "string",
          "sha": "string",
          "size": 8,
          "type": "commit",
          "url": "string"
        }
      ],
      "url": "string"
    }
  ],
  "url": "string"
}