{
  "author": {
    "date": "string",
    "email": "string",
    "name": "string"
  },
  "committer": {
    "date": "string",
    "email": "string",
    "name": "string"
  },
  "message": "string",
  "parents": [
    {
      "sha": "string",
      "url": "string"
    },
    {
      "sha": "string",
      "url": "string"
    },
    {
      "sha": "string",
      "url": "string"
    },
    {
      "sha": "string",
      "url": "string"
    }
  ],
  "sha": "string",
  "tree": {
    "sha": "string",
    "url": "string"
  },
  "url": "string"
}