{
  "_links": {
    "html": {
      "href": "string"
    },
    "pull_request": {
      "href": "string"
    },
    "self": {
      "href": "string"
    }
  },
  "body": "string",
  "commit_id": "string",
  "created_at": "string",
  "id": 3,
  "path": "string",
  "position": 7,
  "updated_at": "string",
  "url": "string",
  "user": {
    "avatar_url": "string",
    "gravatar_id": "string",
    "id": 1,
    "login": "string",
    "url": "string"
  }
}