[
  {
    "id": 1,
    "members_count": 8,
    "name": "string",
    "organization": {
      "avatar_url": "string",
      "id": 3,
      "login": "string",
      "url": "string"
    },
    "permission": "string",
    "repos_count": 7,
    "url": "string"
  },
  {
    "id": 8,
    "members_count": 8,
    "name": "string",
    "organization": {
      "avatar_url": "string",
      "id": 9,
      "login": "string",
      "url": "string"
    },
    "permission": "string",
    "repos_count": 5,
    "url": "string"
  },
  {
    "id": 4,
    "members_count": 9,
    "name": "string",
    "organization": {
      "avatar_url": "string",
      "id": 3,
      "login": "string",
      "url": "string"
    },
    "permission": "string",
    "repos_count": 1,
    "url": "string"
  }
]