{
  "$id": "schema.json",
  "type": "object",
  "schema": "http://json-schema.org/draft-07/schema#",
  "translate": true,
  "dynamicfields": true,
  "properties": {
    "ph_request_type": {
      "type": "string",
      "description": "type of request (internal to adapter)",
      "default": "packagesListDockerMigrationConflictingPackagesForOrganization",
      "enum": [
        "packagesListDockerMigrationConflictingPackagesForOrganization",
        "packagesListPackagesForOrganization",
        "packagesGetPackageForOrganization",
        "packagesDeletePackageForOrg",
        "packagesRestorePackageForOrg",
        "packagesGetAllPackageVersionsForPackageOwnedByOrg",
        "packagesGetPackageVersionForOrganization",
        "packagesDeletePackageVersionForOrg",
        "packagesRestorePackageVersionForOrg",
        "packagesListDockerMigrationConflictingPackagesForAuthenticatedUser",
        "packagesListPackagesForAuthenticatedUser",
        "packagesGetPackageForAuthenticatedUser",
        "packagesDeletePackageForAuthenticatedUser",
        "packagesRestorePackageForAuthenticatedUser",
        "packagesGetAllPackageVersionsForPackageOwnedByAuthenticatedUser",
        "packagesGetPackageVersionForAuthenticatedUser",
        "packagesDeletePackageVersionForAuthenticatedUser",
        "packagesRestorePackageVersionForAuthenticatedUser",
        "packagesListDockerMigrationConflictingPackagesForUser",
        "packagesListPackagesForUser",
        "packagesGetPackageForUser",
        "packagesDeletePackageForUser",
        "packagesRestorePackageForUser",
        "packagesGetAllPackageVersionsForPackageOwnedByUser",
        "packagesGetPackageVersionForUser",
        "packagesDeletePackageVersionForUser",
        "packagesRestorePackageVersionForUser"
      ],
      "external_name": "ph_request_type"
    },
    "packageType": {
      "type": "string",
      "description": "The type of supported package. Packages in GitHub's Gradle registry have the type `maven`. Docker images pushed to GitHub's Container registry (`ghcr.io`) have the type `...(description truncated)",
      "parse": false,
      "encode": false,
      "encrypt": {
        "type": "AES",
        "key": ""
      },
      "external_name": "package_type"
    },
    "perPage": {
      "type": "number",
      "description": "The number of results per page (max 100). For more information, see \"[Using pagination in the REST API](https://docs.github.com/rest/using-the-rest-api/using-pagination-i...(description truncated)",
      "parse": false,
      "encode": false,
      "encrypt": {
        "type": "AES",
        "key": ""
      },
      "external_name": "per_page"
    },
    "packageName": {
      "type": "string",
      "description": "The name of the package.",
      "parse": false,
      "encode": false,
      "encrypt": {
        "type": "AES",
        "key": ""
      },
      "external_name": "package_name"
    },
    "packageVersionId": {
      "type": "number",
      "description": "Unique identifier of the package version.",
      "parse": false,
      "encode": false,
      "encrypt": {
        "type": "AES",
        "key": ""
      },
      "external_name": "package_version_id"
    }
  },
  "definitions": {}
}