{
  "body": "string",
  "created_at": "string",
  "html_url": "string",
  "id": 2,
  "updated_at": "string",
  "url": "string",
  "user": {
    "avatar_url": "string",
    "bio": "string",
    "blog": "string",
    "collaborators": 3,
    "company": "string",
    "created_at": "string",
    "disk_usage": 3,
    "email": "string",
    "followers": 1,
    "followers_url": "string",
    "following": 7,
    "following_url": "string",
    "gists_url": "string",
    "gravatar_id": "string",
    "hireable": false,
    "html_url": "string",
    "id": 4,
    "location": "string",
    "login": "string",
    "name": "string",
    "organizations_url": "string",
    "owned_private_repos": 8,
    "plan": {
      "collaborators": 6,
      "name": "string",
      "private_repos": 4,
      "space": 1
    },
    "private_gists": 3,
    "public_gists": 8,
    "public_repos": 7,
    "starred_url": "string",
    "subscriptions_url": "string",
    "total_private_repos": 6,
    "type": "User",
    "updated_at": "string",
    "url": "string"
  }
}