{
  "message": "string",
  "object": {
    "sha": "string",
    "type": "tree",
    "url": "string"
  },
  "sha": "string",
  "tag": "string",
  "tagger": {
    "date": "string",
    "email": "string",
    "name": "string"
  },
  "url": "string"
}