{
  "actions": [
    {
      "name": "reactionsListForTeamDiscussionCommentInOrg",
      "protocol": "REST",
      "method": "GET",
      "entitypath": "{base_path}/{version}/orgs/{pathv1}/teams/{pathv2}/discussions/{pathv3}/comments/{pathv4}/reactions?{query}",
      "requestSchema": "schema.json",
      "responseSchema": "schema.json",
      "timeout": 0,
      "sendEmpty": false,
      "sendGetBody": false,
      "requestDatatype": "JSON",
      "responseDatatype": "JSON",
      "headers": {},
      "responseObjects": [
        {
          "type": "default",
          "key": "",
          "mockFile": ""
        }
      ]
    },
    {
      "name": "reactionsCreateForTeamDiscussionCommentInOrg",
      "protocol": "REST",
      "method": "POST",
      "entitypath": "{base_path}/{version}/orgs/{pathv1}/teams/{pathv2}/discussions/{pathv3}/comments/{pathv4}/reactions?{query}",
      "requestSchema": "schema.json",
      "responseSchema": "schema.json",
      "timeout": 0,
      "sendEmpty": false,
      "requestDatatype": "JSON",
      "responseDatatype": "JSON",
      "headers": {},
      "responseObjects": [
        {
          "type": "default",
          "key": "",
          "mockFile": ""
        }
      ]
    },
    {
      "name": "reactionsDeleteForTeamDiscussionComment",
      "protocol": "REST",
      "method": "DELETE",
      "entitypath": "{base_path}/{version}/orgs/{pathv1}/teams/{pathv2}/discussions/{pathv3}/comments/{pathv4}/reactions/{pathv5}?{query}",
      "requestSchema": "schema.json",
      "responseSchema": "schema.json",
      "timeout": 0,
      "sendEmpty": false,
      "requestDatatype": "JSON",
      "responseDatatype": "JSON",
      "headers": {},
      "responseObjects": [
        {
          "type": "default",
          "key": "",
          "mockFile": ""
        }
      ]
    },
    {
      "name": "reactionsListForTeamDiscussionInOrg",
      "protocol": "REST",
      "method": "GET",
      "entitypath": "{base_path}/{version}/orgs/{pathv1}/teams/{pathv2}/discussions/{pathv3}/reactions?{query}",
      "requestSchema": "schema.json",
      "responseSchema": "schema.json",
      "timeout": 0,
      "sendEmpty": false,
      "sendGetBody": false,
      "requestDatatype": "JSON",
      "responseDatatype": "JSON",
      "headers": {},
      "responseObjects": [
        {
          "type": "default",
          "key": "",
          "mockFile": ""
        }
      ]
    },
    {
      "name": "reactionsCreateForTeamDiscussionInOrg",
      "protocol": "REST",
      "method": "POST",
      "entitypath": "{base_path}/{version}/orgs/{pathv1}/teams/{pathv2}/discussions/{pathv3}/reactions?{query}",
      "requestSchema": "schema.json",
      "responseSchema": "schema.json",
      "timeout": 0,
      "sendEmpty": false,
      "requestDatatype": "JSON",
      "responseDatatype": "JSON",
      "headers": {},
      "responseObjects": [
        {
          "type": "default",
          "key": "",
          "mockFile": ""
        }
      ]
    },
    {
      "name": "reactionsDeleteForTeamDiscussion",
      "protocol": "REST",
      "method": "DELETE",
      "entitypath": "{base_path}/{version}/orgs/{pathv1}/teams/{pathv2}/discussions/{pathv3}/reactions/{pathv4}?{query}",
      "requestSchema": "schema.json",
      "responseSchema": "schema.json",
      "timeout": 0,
      "sendEmpty": false,
      "requestDatatype": "JSON",
      "responseDatatype": "JSON",
      "headers": {},
      "responseObjects": [
        {
          "type": "default",
          "key": "",
          "mockFile": ""
        }
      ]
    },
    {
      "name": "reactionsListForCommitComment",
      "protocol": "REST",
      "method": "GET",
      "entitypath": "{base_path}/{version}/repos/{pathv1}/{pathv2}/comments/{pathv3}/reactions?{query}",
      "requestSchema": "schema.json",
      "responseSchema": "schema.json",
      "timeout": 0,
      "sendEmpty": false,
      "sendGetBody": false,
      "requestDatatype": "JSON",
      "responseDatatype": "JSON",
      "headers": {},
      "responseObjects": [
        {
          "type": "default",
          "key": "",
          "mockFile": ""
        }
      ]
    },
    {
      "name": "reactionsCreateForCommitComment",
      "protocol": "REST",
      "method": "POST",
      "entitypath": "{base_path}/{version}/repos/{pathv1}/{pathv2}/comments/{pathv3}/reactions?{query}",
      "requestSchema": "schema.json",
      "responseSchema": "schema.json",
      "timeout": 0,
      "sendEmpty": false,
      "requestDatatype": "JSON",
      "responseDatatype": "JSON",
      "headers": {},
      "responseObjects": [
        {
          "type": "default",
          "key": "",
          "mockFile": ""
        }
      ]
    },
    {
      "name": "reactionsDeleteForCommitComment",
      "protocol": "REST",
      "method": "DELETE",
      "entitypath": "{base_path}/{version}/repos/{pathv1}/{pathv2}/comments/{pathv3}/reactions/{pathv4}?{query}",
      "requestSchema": "schema.json",
      "responseSchema": "schema.json",
      "timeout": 0,
      "sendEmpty": false,
      "requestDatatype": "JSON",
      "responseDatatype": "JSON",
      "headers": {},
      "responseObjects": [
        {
          "type": "default",
          "key": "",
          "mockFile": ""
        }
      ]
    },
    {
      "name": "reactionsListForIssueComment",
      "protocol": "REST",
      "method": "GET",
      "entitypath": "{base_path}/{version}/repos/{pathv1}/{pathv2}/issues/comments/{pathv3}/reactions?{query}",
      "requestSchema": "schema.json",
      "responseSchema": "schema.json",
      "timeout": 0,
      "sendEmpty": false,
      "sendGetBody": false,
      "requestDatatype": "JSON",
      "responseDatatype": "JSON",
      "headers": {},
      "responseObjects": [
        {
          "type": "default",
          "key": "",
          "mockFile": ""
        }
      ]
    },
    {
      "name": "reactionsCreateForIssueComment",
      "protocol": "REST",
      "method": "POST",
      "entitypath": "{base_path}/{version}/repos/{pathv1}/{pathv2}/issues/comments/{pathv3}/reactions?{query}",
      "requestSchema": "schema.json",
      "responseSchema": "schema.json",
      "timeout": 0,
      "sendEmpty": false,
      "requestDatatype": "JSON",
      "responseDatatype": "JSON",
      "headers": {},
      "responseObjects": [
        {
          "type": "default",
          "key": "",
          "mockFile": ""
        }
      ]
    },
    {
      "name": "reactionsDeleteForIssueComment",
      "protocol": "REST",
      "method": "DELETE",
      "entitypath": "{base_path}/{version}/repos/{pathv1}/{pathv2}/issues/comments/{pathv3}/reactions/{pathv4}?{query}",
      "requestSchema": "schema.json",
      "responseSchema": "schema.json",
      "timeout": 0,
      "sendEmpty": false,
      "requestDatatype": "JSON",
      "responseDatatype": "JSON",
      "headers": {},
      "responseObjects": [
        {
          "type": "default",
          "key": "",
          "mockFile": ""
        }
      ]
    },
    {
      "name": "reactionsListForIssue",
      "protocol": "REST",
      "method": "GET",
      "entitypath": "{base_path}/{version}/repos/{pathv1}/{pathv2}/issues/{pathv3}/reactions?{query}",
      "requestSchema": "schema.json",
      "responseSchema": "schema.json",
      "timeout": 0,
      "sendEmpty": false,
      "sendGetBody": false,
      "requestDatatype": "JSON",
      "responseDatatype": "JSON",
      "headers": {},
      "responseObjects": [
        {
          "type": "default",
          "key": "",
          "mockFile": ""
        }
      ]
    },
    {
      "name": "reactionsCreateForIssue",
      "protocol": "REST",
      "method": "POST",
      "entitypath": "{base_path}/{version}/repos/{pathv1}/{pathv2}/issues/{pathv3}/reactions?{query}",
      "requestSchema": "schema.json",
      "responseSchema": "schema.json",
      "timeout": 0,
      "sendEmpty": false,
      "requestDatatype": "JSON",
      "responseDatatype": "JSON",
      "headers": {},
      "responseObjects": [
        {
          "type": "default",
          "key": "",
          "mockFile": ""
        }
      ]
    },
    {
      "name": "reactionsDeleteForIssue",
      "protocol": "REST",
      "method": "DELETE",
      "entitypath": "{base_path}/{version}/repos/{pathv1}/{pathv2}/issues/{pathv3}/reactions/{pathv4}?{query}",
      "requestSchema": "schema.json",
      "responseSchema": "schema.json",
      "timeout": 0,
      "sendEmpty": false,
      "requestDatatype": "JSON",
      "responseDatatype": "JSON",
      "headers": {},
      "responseObjects": [
        {
          "type": "default",
          "key": "",
          "mockFile": ""
        }
      ]
    },
    {
      "name": "reactionsListForPullRequestReviewComment",
      "protocol": "REST",
      "method": "GET",
      "entitypath": "{base_path}/{version}/repos/{pathv1}/{pathv2}/pulls/comments/{pathv3}/reactions?{query}",
      "requestSchema": "schema.json",
      "responseSchema": "schema.json",
      "timeout": 0,
      "sendEmpty": false,
      "sendGetBody": false,
      "requestDatatype": "JSON",
      "responseDatatype": "JSON",
      "headers": {},
      "responseObjects": [
        {
          "type": "default",
          "key": "",
          "mockFile": ""
        }
      ]
    },
    {
      "name": "reactionsCreateForPullRequestReviewComment",
      "protocol": "REST",
      "method": "POST",
      "entitypath": "{base_path}/{version}/repos/{pathv1}/{pathv2}/pulls/comments/{pathv3}/reactions?{query}",
      "requestSchema": "schema.json",
      "responseSchema": "schema.json",
      "timeout": 0,
      "sendEmpty": false,
      "requestDatatype": "JSON",
      "responseDatatype": "JSON",
      "headers": {},
      "responseObjects": [
        {
          "type": "default",
          "key": "",
          "mockFile": ""
        }
      ]
    },
    {
      "name": "reactionsDeleteForPullRequestComment",
      "protocol": "REST",
      "method": "DELETE",
      "entitypath": "{base_path}/{version}/repos/{pathv1}/{pathv2}/pulls/comments/{pathv3}/reactions/{pathv4}?{query}",
      "requestSchema": "schema.json",
      "responseSchema": "schema.json",
      "timeout": 0,
      "sendEmpty": false,
      "requestDatatype": "JSON",
      "responseDatatype": "JSON",
      "headers": {},
      "responseObjects": [
        {
          "type": "default",
          "key": "",
          "mockFile": ""
        }
      ]
    },
    {
      "name": "reactionsListForRelease",
      "protocol": "REST",
      "method": "GET",
      "entitypath": "{base_path}/{version}/repos/{pathv1}/{pathv2}/releases/{pathv3}/reactions?{query}",
      "requestSchema": "schema.json",
      "responseSchema": "schema.json",
      "timeout": 0,
      "sendEmpty": false,
      "sendGetBody": false,
      "requestDatatype": "JSON",
      "responseDatatype": "JSON",
      "headers": {},
      "responseObjects": [
        {
          "type": "default",
          "key": "",
          "mockFile": ""
        }
      ]
    },
    {
      "name": "reactionsCreateForRelease",
      "protocol": "REST",
      "method": "POST",
      "entitypath": "{base_path}/{version}/repos/{pathv1}/{pathv2}/releases/{pathv3}/reactions?{query}",
      "requestSchema": "schema.json",
      "responseSchema": "schema.json",
      "timeout": 0,
      "sendEmpty": false,
      "requestDatatype": "JSON",
      "responseDatatype": "JSON",
      "headers": {},
      "responseObjects": [
        {
          "type": "default",
          "key": "",
          "mockFile": ""
        }
      ]
    },
    {
      "name": "reactionsDeleteForRelease",
      "protocol": "REST",
      "method": "DELETE",
      "entitypath": "{base_path}/{version}/repos/{pathv1}/{pathv2}/releases/{pathv3}/reactions/{pathv4}?{query}",
      "requestSchema": "schema.json",
      "responseSchema": "schema.json",
      "timeout": 0,
      "sendEmpty": false,
      "requestDatatype": "JSON",
      "responseDatatype": "JSON",
      "headers": {},
      "responseObjects": [
        {
          "type": "default",
          "key": "",
          "mockFile": ""
        }
      ]
    },
    {
      "name": "reactionsListForTeamDiscussionCommentLegacy",
      "protocol": "REST",
      "method": "GET",
      "entitypath": "{base_path}/{version}/teams/{pathv1}/discussions/{pathv2}/comments/{pathv3}/reactions?{query}",
      "requestSchema": "schema.json",
      "responseSchema": "schema.json",
      "timeout": 0,
      "sendEmpty": false,
      "sendGetBody": false,
      "requestDatatype": "JSON",
      "responseDatatype": "JSON",
      "headers": {},
      "responseObjects": [
        {
          "type": "default",
          "key": "",
          "mockFile": ""
        }
      ]
    },
    {
      "name": "reactionsCreateForTeamDiscussionCommentLegacy",
      "protocol": "REST",
      "method": "POST",
      "entitypath": "{base_path}/{version}/teams/{pathv1}/discussions/{pathv2}/comments/{pathv3}/reactions?{query}",
      "requestSchema": "schema.json",
      "responseSchema": "schema.json",
      "timeout": 0,
      "sendEmpty": false,
      "requestDatatype": "JSON",
      "responseDatatype": "JSON",
      "headers": {},
      "responseObjects": [
        {
          "type": "default",
          "key": "",
          "mockFile": ""
        }
      ]
    },
    {
      "name": "reactionsListForTeamDiscussionLegacy",
      "protocol": "REST",
      "method": "GET",
      "entitypath": "{base_path}/{version}/teams/{pathv1}/discussions/{pathv2}/reactions?{query}",
      "requestSchema": "schema.json",
      "responseSchema": "schema.json",
      "timeout": 0,
      "sendEmpty": false,
      "sendGetBody": false,
      "requestDatatype": "JSON",
      "responseDatatype": "JSON",
      "headers": {},
      "responseObjects": [
        {
          "type": "default",
          "key": "",
          "mockFile": ""
        }
      ]
    },
    {
      "name": "reactionsCreateForTeamDiscussionLegacy",
      "protocol": "REST",
      "method": "POST",
      "entitypath": "{base_path}/{version}/teams/{pathv1}/discussions/{pathv2}/reactions?{query}",
      "requestSchema": "schema.json",
      "responseSchema": "schema.json",
      "timeout": 0,
      "sendEmpty": false,
      "requestDatatype": "JSON",
      "responseDatatype": "JSON",
      "headers": {},
      "responseObjects": [
        {
          "type": "default",
          "key": "",
          "mockFile": ""
        }
      ]
    }
  ]
}