{
  "body": "string",
  "commit_id": "string",
  "created_at": "string",
  "html_url": "string",
  "id": 8,
  "line": 1,
  "path": "string",
  "position": 7,
  "updated_at": "string",
  "url": "string",
  "user": {
    "avatar_url": "string",
    "bio": "string",
    "blog": "string",
    "collaborators": 3,
    "company": "string",
    "created_at": "string",
    "disk_usage": 7,
    "email": "string",
    "followers": 7,
    "followers_url": "string",
    "following": 4,
    "following_url": "string",
    "gists_url": "string",
    "gravatar_id": "string",
    "hireable": true,
    "html_url": "string",
    "id": 7,
    "location": "string",
    "login": "string",
    "name": "string",
    "organizations_url": "string",
    "owned_private_repos": 3,
    "plan": {
      "collaborators": 5,
      "name": "string",
      "private_repos": 8,
      "space": 3
    },
    "private_gists": 9,
    "public_gists": 4,
    "public_repos": 10,
    "starred_url": "string",
    "subscriptions_url": "string",
    "total_private_repos": 3,
    "type": "Organization",
    "updated_at": "string",
    "url": "string"
  }
}