{
  "actions": [
    {
      "name": "getTeamsOwnerProjects",
      "protocol": "REST",
      "method": "GET",
      "entitypath": "{base_path}/{version}/teams/{pathv1}/projects/?{query}",
      "requestSchema": "schema.json",
      "responseSchema": "schema.json",
      "timeout": 0,
      "sendEmpty": false,
      "sendGetBody": false,
      "requestDatatype": "JSON",
      "responseDatatype": "JSON",
      "headers": {},
      "responseObjects": [
        {
          "type": "default",
          "key": "",
          "mockFile": "mockdatafiles/getTeamsOwnerProjects-default.json"
        }
      ]
    },
    {
      "name": "postTeamsOwnerProjects",
      "protocol": "REST",
      "method": "POST",
      "entitypath": "{base_path}/{version}/teams/{pathv1}/projects/?{query}",
      "requestSchema": "schema.json",
      "responseSchema": "schema.json",
      "timeout": 0,
      "sendEmpty": false,
      "sendGetBody": false,
      "requestDatatype": "JSON",
      "responseDatatype": "JSON",
      "headers": {},
      "responseObjects": [
        {
          "type": "default",
          "key": "",
          "mockFile": "mockdatafiles/postTeamsOwnerProjects-default.json"
        }
      ]
    },
    {
      "name": "deleteTeamsOwnerProjectsProjectKey",
      "protocol": "REST",
      "method": "DELETE",
      "entitypath": "{base_path}/{version}/teams/{pathv1}/projects/{pathv2}?{query}",
      "requestSchema": "schema.json",
      "responseSchema": "schema.json",
      "timeout": 0,
      "sendEmpty": false,
      "sendGetBody": false,
      "requestDatatype": "JSON",
      "responseDatatype": "JSON",
      "headers": {},
      "responseObjects": [
        {
          "type": "default",
          "key": "",
          "mockFile": ""
        }
      ]
    },
    {
      "name": "getTeamsOwnerProjectsProjectKey",
      "protocol": "REST",
      "method": "GET",
      "entitypath": "{base_path}/{version}/teams/{pathv1}/projects/{pathv2}?{query}",
      "requestSchema": "schema.json",
      "responseSchema": "schema.json",
      "timeout": 0,
      "sendEmpty": false,
      "sendGetBody": false,
      "requestDatatype": "JSON",
      "responseDatatype": "JSON",
      "headers": {},
      "responseObjects": [
        {
          "type": "default",
          "key": "",
          "mockFile": "mockdatafiles/getTeamsOwnerProjectsProjectKey-default.json"
        }
      ]
    },
    {
      "name": "putTeamsOwnerProjectsProjectKey",
      "protocol": "REST",
      "method": "PUT",
      "entitypath": "{base_path}/{version}/teams/{pathv1}/projects/{pathv2}?{query}",
      "requestSchema": "schema.json",
      "responseSchema": "schema.json",
      "timeout": 0,
      "sendEmpty": false,
      "sendGetBody": false,
      "requestDatatype": "JSON",
      "responseDatatype": "JSON",
      "headers": {},
      "responseObjects": [
        {
          "type": "default",
          "key": "",
          "mockFile": "mockdatafiles/putTeamsOwnerProjectsProjectKey-default.json"
        }
      ]
    }
  ]
}