{
  "errors": [
    {
      "mockdata": "function getRepositories of entity Repositories has no response, skipping..."
    },
    {
      "mockdata": "function getRepositoriesUsername of entity Repositories has no response, skipping..."
    },
    {
      "mockdata": "function getRepositoriesUsernameRepoSlug of entity Repositories has no response, skipping..."
    },
    {
      "mockdata": "function postRepositoriesUsernameRepoSlug of entity Repositories has no response, skipping..."
    },
    {
      "mockdata": "function putRepositoriesUsernameRepoSlug of entity Repositories has no response, skipping..."
    },
    {
      "mockdata": "function getRepositoriesUsernameRepoSlugForks of entity Repositories has no response, skipping..."
    },
    {
      "mockdata": "function getRepositoriesUsernameRepoSlugCommitRevision of entity Commits has no response, skipping..."
    },
    {
      "mockdata": "function getRepositoriesUsernameRepoSlugIssues of entity IssueTracker has no response, skipping..."
    },
    {
      "mockdata": "function postRepositoriesUsernameRepoSlugIssues of entity IssueTracker has no response, skipping..."
    },
    {
      "mockdata": "function deleteRepositoriesUsernameRepoSlugIssuesIssueId of entity IssueTracker has no response, skipping..."
    },
    {
      "mockdata": "function getRepositoriesUsernameRepoSlugIssuesIssueId of entity IssueTracker has no response, skipping..."
    },
    {
      "mockdata": "function getRepositoriesUsernameRepoSlugPullrequests of entity Pullrequests has no response, skipping..."
    },
    {
      "mockdata": "function postRepositoriesUsernameRepoSlugPullrequests of entity Pullrequests has no response, skipping..."
    },
    {
      "mockdata": "function getRepositoriesUsernameRepoSlugPullrequestsPullRequestId of entity Pullrequests has no response, skipping..."
    },
    {
      "mockdata": "function putRepositoriesUsernameRepoSlugPullrequestsPullRequestId of entity Pullrequests has no response, skipping..."
    },
    {
      "mockdata": "function postRepositoriesUsernameRepoSlugPullrequestsPullRequestIdDecline of entity Pullrequests has no response, skipping..."
    },
    {
      "mockdata": "function postRepositoriesUsernameRepoSlugPullrequestsPullRequestIdMerge of entity Pullrequests has no response, skipping..."
    },
    {
      "mockdata": "function getPipelinesForRepository of entity Pipelines has no response, skipping..."
    },
    {
      "mockdata": "function createPipelineForRepository of entity Pipelines has no response, skipping..."
    },
    {
      "mockdata": "function getPipelineForRepository of entity Pipelines has no response, skipping..."
    },
    {
      "mockdata": "function getRepositoryPipelineConfig of entity Pipelines has no response, skipping..."
    },
    {
      "mockdata": "function updateRepositoryPipelineConfig of entity Pipelines has no response, skipping..."
    },
    {
      "mockdata": "function postRepositoriesUsernameRepoSlugRefsTags of entity Refs has no response, skipping..."
    },
    {
      "mockdata": "function getSnippetsUsernameEncodedIdCommits of entity Snippets has no response, skipping..."
    },
    {
      "mockdata": "function getSnippetsUsernameEncodedIdCommitsRevision of entity Snippets has no response, skipping..."
    }
  ],
  "statistics": [
    {
      "owner": "errorJson",
      "description": "Standard adapter errors available for use",
      "value": 29
    },
    {
      "owner": "packageJson",
      "description": "Number of production dependencies",
      "value": 6
    },
    {
      "owner": "packageJson",
      "description": "Number of development dependencies",
      "value": 9
    },
    {
      "owner": "packageJson",
      "description": "Number of npm scripts",
      "value": 9
    },
    {
      "owner": "packageJson",
      "description": "Runtime Library dependency",
      "value": "^4.9.4"
    },
    {
      "owner": "propertiesSchemaJson",
      "description": "Adapter properties defined in the propertiesSchema file",
      "value": 47
    },
    {
      "owner": "adapterJS",
      "description": "Lines of code generated in adapter.js",
      "value": 14777
    },
    {
      "owner": "adapterJS",
      "description": "Number of Functions added to adapter.js",
      "value": 182
    },
    {
      "owner": "pronghornJson",
      "description": "Number of Methods added to pronghorn.json",
      "value": 182
    },
    {
      "owner": "readmeMd",
      "description": "Number of lines in the README.md",
      "value": 450
    },
    {
      "owner": "unitTestJS",
      "description": "Number of lines of code in unit tests",
      "value": 9993
    },
    {
      "owner": "unitTestJS",
      "description": "Number of unit tests",
      "value": 628
    },
    {
      "owner": "integrationTestJS",
      "description": "Number of lines of code in integration tests",
      "value": 6001
    },
    {
      "owner": "integrationTestJS",
      "description": "Number of integration tests",
      "value": 187
    },
    {
      "owner": "actionJson",
      "description": "Number of actions for Addon entity",
      "value": 10
    },
    {
      "owner": "actionJson",
      "description": "Number of actions for Webhooks entity",
      "value": 2
    },
    {
      "owner": "actionJson",
      "description": "Number of actions for Repositories entity",
      "value": 18
    },
    {
      "owner": "actionJson",
      "description": "Number of actions for Teams entity",
      "value": 10
    },
    {
      "owner": "actionJson",
      "description": "Number of actions for Users entity",
      "value": 13
    },
    {
      "owner": "actionJson",
      "description": "Number of actions for Source entity",
      "value": 1
    },
    {
      "owner": "actionJson",
      "description": "Number of actions for Branchrestrictions entity",
      "value": 5
    },
    {
      "owner": "actionJson",
      "description": "Number of actions for Commits entity",
      "value": 11
    },
    {
      "owner": "actionJson",
      "description": "Number of actions for IssueTracker entity",
      "value": 22
    },
    {
      "owner": "actionJson",
      "description": "Number of actions for Pullrequests entity",
      "value": 19
    },
    {
      "owner": "actionJson",
      "description": "Number of actions for Downloads entity",
      "value": 4
    },
    {
      "owner": "actionJson",
      "description": "Number of actions for Pipelines entity",
      "value": 32
    },
    {
      "owner": "actionJson",
      "description": "Number of actions for Refs entity",
      "value": 6
    },
    {
      "owner": "actionJson",
      "description": "Number of actions for Snippets entity",
      "value": 24
    },
    {
      "owner": "actionJson",
      "description": "Number of actions for Projects entity",
      "value": 5
    },
    {
      "owner": "actionJson",
      "description": "Total number of actions",
      "value": 182
    },
    {
      "owner": "actionJson",
      "description": "Total number of entities",
      "value": 15
    },
    {
      "owner": "schemaJson",
      "description": "Number of schemas for Addon entity",
      "value": 1
    },
    {
      "owner": "schemaJson",
      "description": "Number of schemas for Webhooks entity",
      "value": 1
    },
    {
      "owner": "schemaJson",
      "description": "Number of schemas for Repositories entity",
      "value": 1
    },
    {
      "owner": "schemaJson",
      "description": "Number of schemas for Teams entity",
      "value": 1
    },
    {
      "owner": "schemaJson",
      "description": "Number of schemas for Users entity",
      "value": 1
    },
    {
      "owner": "schemaJson",
      "description": "Number of schemas for Source entity",
      "value": 1
    },
    {
      "owner": "schemaJson",
      "description": "Number of schemas for Branchrestrictions entity",
      "value": 1
    },
    {
      "owner": "schemaJson",
      "description": "Number of schemas for Commits entity",
      "value": 1
    },
    {
      "owner": "schemaJson",
      "description": "Number of schemas for IssueTracker entity",
      "value": 1
    },
    {
      "owner": "schemaJson",
      "description": "Number of schemas for Pullrequests entity",
      "value": 1
    },
    {
      "owner": "schemaJson",
      "description": "Number of schemas for Downloads entity",
      "value": 1
    },
    {
      "owner": "schemaJson",
      "description": "Number of schemas for Pipelines entity",
      "value": 1
    },
    {
      "owner": "schemaJson",
      "description": "Number of schemas for Refs entity",
      "value": 1
    },
    {
      "owner": "schemaJson",
      "description": "Number of schemas for Snippets entity",
      "value": 1
    },
    {
      "owner": "schemaJson",
      "description": "Number of schemas for Projects entity",
      "value": 1
    },
    {
      "owner": "schemaJson",
      "description": "Total number of schemas",
      "value": 15
    },
    {
      "owner": "mockdata",
      "description": "Number of mock data files for Addon entity",
      "value": 0
    },
    {
      "owner": "mockdata",
      "description": "Number of mock data files for Webhooks entity",
      "value": 2
    },
    {
      "owner": "mockdata",
      "description": "Number of mock data files for Repositories entity",
      "value": 9
    },
    {
      "owner": "mockdata",
      "description": "Number of mock data files for Teams entity",
      "value": 9
    },
    {
      "owner": "mockdata",
      "description": "Number of mock data files for Users entity",
      "value": 8
    },
    {
      "owner": "mockdata",
      "description": "Number of mock data files for Source entity",
      "value": 0
    },
    {
      "owner": "mockdata",
      "description": "Number of mock data files for Branchrestrictions entity",
      "value": 4
    },
    {
      "owner": "mockdata",
      "description": "Number of mock data files for Commits entity",
      "value": 1
    },
    {
      "owner": "mockdata",
      "description": "Number of mock data files for IssueTracker entity",
      "value": 12
    },
    {
      "owner": "mockdata",
      "description": "Number of mock data files for Pullrequests entity",
      "value": 0
    },
    {
      "owner": "mockdata",
      "description": "Number of mock data files for Downloads entity",
      "value": 0
    },
    {
      "owner": "mockdata",
      "description": "Number of mock data files for Pipelines entity",
      "value": 20
    },
    {
      "owner": "mockdata",
      "description": "Number of mock data files for Refs entity",
      "value": 0
    },
    {
      "owner": "mockdata",
      "description": "Number of mock data files for Snippets entity",
      "value": 15
    },
    {
      "owner": "mockdata",
      "description": "Number of mock data files for Projects entity",
      "value": 4
    },
    {
      "owner": "mockdata",
      "description": "Total number of mock data files",
      "value": 84
    },
    {
      "owner": "actionJson",
      "description": "Number of actions for .system entity",
      "value": 2
    },
    {
      "owner": "schemaJson",
      "description": "Number of schemas for .system entity",
      "value": 1
    },
    {
      "owner": "mockdata",
      "description": "Number of mock data files for .system entity",
      "value": 1
    },
    {
      "owner": "System",
      "description": "System entity files",
      "value": 3
    },
    {
      "owner": "workflows",
      "description": "Number of workflows",
      "value": 0
    },
    {
      "owner": "staticFile",
      "description": "Number of lines of code in adapterBase.js",
      "value": 484
    },
    {
      "owner": "staticFile",
      "description": "Number of static files added",
      "value": 19
    },
    {
      "owner": "Overall",
      "description": "Total lines of Code",
      "value": 31255
    },
    {
      "owner": "Overall",
      "description": "Total Tests",
      "value": 815
    },
    {
      "owner": "Overall",
      "description": "Total Files",
      "value": 144
    }
  ],
  "apiParsingReport": {
    "no_mockdata": [
      {
        "fnName": "deleteAddon",
        "method": "delete",
        "path": "/addon"
      },
      {
        "fnName": "putAddon",
        "method": "put",
        "path": "/addon"
      },
      {
        "fnName": "getAddonLinkers",
        "method": "get",
        "path": "/addon/linkers"
      },
      {
        "fnName": "getAddonLinkersLinker_key",
        "method": "get",
        "path": "/addon/linkers/{linker_key}"
      },
      {
        "fnName": "deleteAddonLinkersLinker_keyValues",
        "method": "delete",
        "path": "/addon/linkers/{linker_key}/values"
      },
      {
        "fnName": "getAddonLinkersLinker_keyValues",
        "method": "get",
        "path": "/addon/linkers/{linker_key}/values"
      },
      {
        "fnName": "postAddonLinkersLinker_keyValues",
        "method": "post",
        "path": "/addon/linkers/{linker_key}/values"
      },
      {
        "fnName": "putAddonLinkersLinker_keyValues",
        "method": "put",
        "path": "/addon/linkers/{linker_key}/values"
      },
      {
        "fnName": "deleteAddonLinkersLinker_keyValues2",
        "method": "delete",
        "path": "/addon/linkers/{linker_key}/values/"
      },
      {
        "fnName": "getAddonLinkersLinker_keyValues2",
        "method": "get",
        "path": "/addon/linkers/{linker_key}/values/"
      },
      {
        "fnName": "deleteRepositoriesUsernameRepo_slugHooksUid",
        "method": "delete",
        "path": "/repositories/{username}/{repo_slug}/hooks/{uid}"
      },
      {
        "fnName": "deleteTeamsUsernameHooksUid",
        "method": "delete",
        "path": "/teams/{username}/hooks/{uid}"
      },
      {
        "fnName": "deleteUsersUsernameHooksUid",
        "method": "delete",
        "path": "/users/{username}/hooks/{uid}"
      },
      {
        "fnName": "getRepositories",
        "method": "get",
        "path": "/repositories"
      },
      {
        "fnName": "getRepositoriesUsername",
        "method": "get",
        "path": "/repositories/{username}"
      },
      {
        "fnName": "deleteRepositoriesUsernameRepo_slug",
        "method": "delete",
        "path": "/repositories/{username}/{repo_slug}"
      },
      {
        "fnName": "getRepositoriesUsernameRepo_slug",
        "method": "get",
        "path": "/repositories/{username}/{repo_slug}"
      },
      {
        "fnName": "postRepositoriesUsernameRepo_slug",
        "method": "post",
        "path": "/repositories/{username}/{repo_slug}"
      },
      {
        "fnName": "putRepositoriesUsernameRepo_slug",
        "method": "put",
        "path": "/repositories/{username}/{repo_slug}"
      },
      {
        "fnName": "getRepositoriesUsernameRepo_slugForks",
        "method": "get",
        "path": "/repositories/{username}/{repo_slug}/forks"
      },
      {
        "fnName": "getRepositoriesUsernameRepo_slugSrcNodePath",
        "method": "get",
        "path": "/repositories/{username}/{repo_slug}/src/{node}/{path}"
      },
      {
        "fnName": "getRepositoriesUsernameRepo_slugWatchers",
        "method": "get",
        "path": "/repositories/{username}/{repo_slug}/watchers"
      },
      {
        "fnName": "deleteRepositoriesUsernameRepo_slugBranchRestrictionsId",
        "method": "delete",
        "path": "/repositories/{username}/{repo_slug}/branch-restrictions/{id}"
      },
      {
        "fnName": "deleteRepositoriesUsernameRepo_slugCommitNodeApprove",
        "method": "delete",
        "path": "/repositories/{username}/{repo_slug}/commit/{node}/approve"
      },
      {
        "fnName": "getRepositoriesUsernameRepo_slugCommitRevision",
        "method": "get",
        "path": "/repositories/{username}/{repo_slug}/commit/{revision}"
      },
      {
        "fnName": "getRepositoriesUsernameRepo_slugCommitShaComments",
        "method": "get",
        "path": "/repositories/{username}/{repo_slug}/commit/{sha}/comments"
      },
      {
        "fnName": "getRepositoriesUsernameRepo_slugCommitShaCommentsComment_id",
        "method": "get",
        "path": "/repositories/{username}/{repo_slug}/commit/{sha}/comments/{comment_id}"
      },
      {
        "fnName": "getRepositoriesUsernameRepo_slugCommits",
        "method": "get",
        "path": "/repositories/{username}/{repo_slug}/commits"
      },
      {
        "fnName": "postRepositoriesUsernameRepo_slugCommits",
        "method": "post",
        "path": "/repositories/{username}/{repo_slug}/commits"
      },
      {
        "fnName": "getRepositoriesUsernameRepo_slugCommitsRevision",
        "method": "get",
        "path": "/repositories/{username}/{repo_slug}/commits/{revision}"
      },
      {
        "fnName": "postRepositoriesUsernameRepo_slugCommitsRevision",
        "method": "post",
        "path": "/repositories/{username}/{repo_slug}/commits/{revision}"
      },
      {
        "fnName": "getRepositoriesUsernameRepo_slugDiffSpec",
        "method": "get",
        "path": "/repositories/{username}/{repo_slug}/diff/{spec}"
      },
      {
        "fnName": "getRepositoriesUsernameRepo_slugPatchSpec",
        "method": "get",
        "path": "/repositories/{username}/{repo_slug}/patch/{spec}"
      },
      {
        "fnName": "getRepositoriesUsernameRepo_slugIssues",
        "method": "get",
        "path": "/repositories/{username}/{repo_slug}/issues"
      },
      {
        "fnName": "postRepositoriesUsernameRepo_slugIssues",
        "method": "post",
        "path": "/repositories/{username}/{repo_slug}/issues"
      },
      {
        "fnName": "deleteRepositoriesUsernameRepo_slugIssuesIssue_id",
        "method": "delete",
        "path": "/repositories/{username}/{repo_slug}/issues/{issue_id}"
      },
      {
        "fnName": "getRepositoriesUsernameRepo_slugIssuesIssue_id",
        "method": "get",
        "path": "/repositories/{username}/{repo_slug}/issues/{issue_id}"
      },
      {
        "fnName": "postRepositoriesUsernameRepo_slugIssuesIssue_idAttachments",
        "method": "post",
        "path": "/repositories/{username}/{repo_slug}/issues/{issue_id}/attachments"
      },
      {
        "fnName": "deleteRepositoriesUsernameRepo_slugIssuesIssue_idAttachmentsPath",
        "method": "delete",
        "path": "/repositories/{username}/{repo_slug}/issues/{issue_id}/attachments/{path}"
      },
      {
        "fnName": "getRepositoriesUsernameRepo_slugIssuesIssue_idAttachmentsPath",
        "method": "get",
        "path": "/repositories/{username}/{repo_slug}/issues/{issue_id}/attachments/{path}"
      },
      {
        "fnName": "getRepositoriesUsernameRepo_slugIssuesIssue_idComments",
        "method": "get",
        "path": "/repositories/{username}/{repo_slug}/issues/{issue_id}/comments"
      },
      {
        "fnName": "getRepositoriesUsernameRepo_slugIssuesIssue_idCommentsComment_id",
        "method": "get",
        "path": "/repositories/{username}/{repo_slug}/issues/{issue_id}/comments/{comment_id}"
      },
      {
        "fnName": "deleteRepositoriesUsernameRepo_slugIssuesIssue_idVote",
        "method": "delete",
        "path": "/repositories/{username}/{repo_slug}/issues/{issue_id}/vote"
      },
      {
        "fnName": "getRepositoriesUsernameRepo_slugDefaultReviewers",
        "method": "get",
        "path": "/repositories/{username}/{repo_slug}/default-reviewers"
      },
      {
        "fnName": "deleteRepositoriesUsernameRepo_slugDefaultReviewersTarget_username",
        "method": "delete",
        "path": "/repositories/{username}/{repo_slug}/default-reviewers/{target_username}"
      },
      {
        "fnName": "getRepositoriesUsernameRepo_slugDefaultReviewersTarget_username",
        "method": "get",
        "path": "/repositories/{username}/{repo_slug}/default-reviewers/{target_username}"
      },
      {
        "fnName": "putRepositoriesUsernameRepo_slugDefaultReviewersTarget_username",
        "method": "put",
        "path": "/repositories/{username}/{repo_slug}/default-reviewers/{target_username}"
      },
      {
        "fnName": "getRepositoriesUsernameRepo_slugPullrequests",
        "method": "get",
        "path": "/repositories/{username}/{repo_slug}/pullrequests"
      },
      {
        "fnName": "postRepositoriesUsernameRepo_slugPullrequests",
        "method": "post",
        "path": "/repositories/{username}/{repo_slug}/pullrequests"
      },
      {
        "fnName": "getRepositoriesUsernameRepo_slugPullrequestsActivity",
        "method": "get",
        "path": "/repositories/{username}/{repo_slug}/pullrequests/activity"
      },
      {
        "fnName": "getRepositoriesUsernameRepo_slugPullrequestsPull_request_id",
        "method": "get",
        "path": "/repositories/{username}/{repo_slug}/pullrequests/{pull_request_id}"
      },
      {
        "fnName": "putRepositoriesUsernameRepo_slugPullrequestsPull_request_id",
        "method": "put",
        "path": "/repositories/{username}/{repo_slug}/pullrequests/{pull_request_id}"
      },
      {
        "fnName": "getRepositoriesUsernameRepo_slugPullrequestsPull_request_idActivity",
        "method": "get",
        "path": "/repositories/{username}/{repo_slug}/pullrequests/{pull_request_id}/activity"
      },
      {
        "fnName": "deleteRepositoriesUsernameRepo_slugPullrequestsPull_request_idApprove",
        "method": "delete",
        "path": "/repositories/{username}/{repo_slug}/pullrequests/{pull_request_id}/approve"
      },
      {
        "fnName": "postRepositoriesUsernameRepo_slugPullrequestsPull_request_idApprove",
        "method": "post",
        "path": "/repositories/{username}/{repo_slug}/pullrequests/{pull_request_id}/approve"
      },
      {
        "fnName": "getRepositoriesUsernameRepo_slugPullrequestsPull_request_idComments",
        "method": "get",
        "path": "/repositories/{username}/{repo_slug}/pullrequests/{pull_request_id}/comments"
      },
      {
        "fnName": "getRepositoriesUsernameRepo_slugPullrequestsPull_request_idCommentsComment_id",
        "method": "get",
        "path": "/repositories/{username}/{repo_slug}/pullrequests/{pull_request_id}/comments/{comment_id}"
      },
      {
        "fnName": "getRepositoriesUsernameRepo_slugPullrequestsPull_request_idCommits",
        "method": "get",
        "path": "/repositories/{username}/{repo_slug}/pullrequests/{pull_request_id}/commits"
      },
      {
        "fnName": "postRepositoriesUsernameRepo_slugPullrequestsPull_request_idDecline",
        "method": "post",
        "path": "/repositories/{username}/{repo_slug}/pullrequests/{pull_request_id}/decline"
      },
      {
        "fnName": "getRepositoriesUsernameRepo_slugPullrequestsPull_request_idDiff",
        "method": "get",
        "path": "/repositories/{username}/{repo_slug}/pullrequests/{pull_request_id}/diff"
      },
      {
        "fnName": "postRepositoriesUsernameRepo_slugPullrequestsPull_request_idMerge",
        "method": "post",
        "path": "/repositories/{username}/{repo_slug}/pullrequests/{pull_request_id}/merge"
      },
      {
        "fnName": "getRepositoriesUsernameRepo_slugPullrequestsPull_request_idPatch",
        "method": "get",
        "path": "/repositories/{username}/{repo_slug}/pullrequests/{pull_request_id}/patch"
      },
      {
        "fnName": "getRepositoriesUsernameRepo_slugDownloads",
        "method": "get",
        "path": "/repositories/{username}/{repo_slug}/downloads"
      },
      {
        "fnName": "postRepositoriesUsernameRepo_slugDownloads",
        "method": "post",
        "path": "/repositories/{username}/{repo_slug}/downloads"
      },
      {
        "fnName": "deleteRepositoriesUsernameRepo_slugDownloadsFilename",
        "method": "delete",
        "path": "/repositories/{username}/{repo_slug}/downloads/{filename}"
      },
      {
        "fnName": "getRepositoriesUsernameRepo_slugDownloadsFilename",
        "method": "get",
        "path": "/repositories/{username}/{repo_slug}/downloads/{filename}"
      },
      {
        "fnName": "getPipelinesForRepository",
        "method": "get",
        "path": "/repositories/{username}/{repo_slug}/pipelines/"
      },
      {
        "fnName": "createPipelineForRepository",
        "method": "post",
        "path": "/repositories/{username}/{repo_slug}/pipelines/"
      },
      {
        "fnName": "getPipelineForRepository",
        "method": "get",
        "path": "/repositories/{username}/{repo_slug}/pipelines/{pipeline_uuid}"
      },
      {
        "fnName": "getPipelineStepLogForRepository",
        "method": "get",
        "path": "/repositories/{username}/{repo_slug}/pipelines/{pipeline_uuid}/steps/{step_uuid}/log"
      },
      {
        "fnName": "stopPipeline",
        "method": "post",
        "path": "/repositories/{username}/{repo_slug}/pipelines/{pipeline_uuid}/stopPipeline"
      },
      {
        "fnName": "getRepositoryPipelineConfig",
        "method": "get",
        "path": "/repositories/{username}/{repo_slug}/pipelines_config"
      },
      {
        "fnName": "updateRepositoryPipelineConfig",
        "method": "put",
        "path": "/repositories/{username}/{repo_slug}/pipelines_config"
      },
      {
        "fnName": "deleteRepositoryPipelineKeyPair",
        "method": "delete",
        "path": "/repositories/{username}/{repo_slug}/pipelines_config/ssh/key_pair"
      },
      {
        "fnName": "deleteRepositoryPipelineKnownHost",
        "method": "delete",
        "path": "/repositories/{username}/{repo_slug}/pipelines_config/ssh/known_hosts/{known_host_uuid}"
      },
      {
        "fnName": "deleteRepositoryPipelineVariable",
        "method": "delete",
        "path": "/repositories/{username}/{repo_slug}/pipelines_config/variables/{variable_uuid}"
      },
      {
        "fnName": "deletePipelineVariableForTeam",
        "method": "delete",
        "path": "/teams/{username}/pipelines_config/variables/{variable_uuid}"
      },
      {
        "fnName": "deletePipelineVariableForUser",
        "method": "delete",
        "path": "/users/{username}/pipelines_config/variables/{variable_uuid}"
      },
      {
        "fnName": "getRepositoriesUsernameRepo_slugRefs",
        "method": "get",
        "path": "/repositories/{username}/{repo_slug}/refs"
      },
      {
        "fnName": "getRepositoriesUsernameRepo_slugRefsBranches",
        "method": "get",
        "path": "/repositories/{username}/{repo_slug}/refs/branches"
      },
      {
        "fnName": "getRepositoriesUsernameRepo_slugRefsBranchesName",
        "method": "get",
        "path": "/repositories/{username}/{repo_slug}/refs/branches/{name}"
      },
      {
        "fnName": "getRepositoriesUsernameRepo_slugRefsTags",
        "method": "get",
        "path": "/repositories/{username}/{repo_slug}/refs/tags"
      },
      {
        "fnName": "postRepositoriesUsernameRepo_slugRefsTags",
        "method": "post",
        "path": "/repositories/{username}/{repo_slug}/refs/tags"
      },
      {
        "fnName": "getRepositoriesUsernameRepo_slugRefsTagsName",
        "method": "get",
        "path": "/repositories/{username}/{repo_slug}/refs/tags/{name}"
      },
      {
        "fnName": "deleteSnippetsUsernameEncoded_id",
        "method": "delete",
        "path": "/snippets/{username}/{encoded_id}"
      },
      {
        "fnName": "deleteSnippetsUsernameEncoded_idCommentsComment_id",
        "method": "delete",
        "path": "/snippets/{username}/{encoded_id}/comments/{comment_id}"
      },
      {
        "fnName": "putSnippetsUsernameEncoded_idCommentsComment_id",
        "method": "put",
        "path": "/snippets/{username}/{encoded_id}/comments/{comment_id}"
      },
      {
        "fnName": "getSnippetsUsernameEncoded_idCommits",
        "method": "get",
        "path": "/snippets/{username}/{encoded_id}/commits"
      },
      {
        "fnName": "getSnippetsUsernameEncoded_idCommitsRevision",
        "method": "get",
        "path": "/snippets/{username}/{encoded_id}/commits/{revision}"
      },
      {
        "fnName": "deleteSnippetsUsernameEncoded_idNode_id",
        "method": "delete",
        "path": "/snippets/{username}/{encoded_id}/{node_id}"
      },
      {
        "fnName": "getSnippetsUsernameEncoded_idNode_idFilesPath",
        "method": "get",
        "path": "/snippets/{username}/{encoded_id}/{node_id}/files/{path}"
      },
      {
        "fnName": "getSnippetsUsernameEncoded_idRevisionDiff",
        "method": "get",
        "path": "/snippets/{username}/{encoded_id}/{revision}/diff"
      },
      {
        "fnName": "getSnippetsUsernameEncoded_idRevisionPatch",
        "method": "get",
        "path": "/snippets/{username}/{encoded_id}/{revision}/patch"
      },
      {
        "fnName": "getTeamsUsernameRepositories",
        "method": "get",
        "path": "/teams/{username}/repositories"
      },
      {
        "fnName": "getUsersUsernameRepositories",
        "method": "get",
        "path": "/users/{username}/repositories"
      },
      {
        "fnName": "deleteTeamsOwnerProjectsProject_key",
        "method": "delete",
        "path": "/teams/{owner}/projects/{project_key}"
      },
      {
        "fnName": "getUserEmails",
        "method": "get",
        "path": "/user/emails"
      },
      {
        "fnName": "getUserEmailsEmail",
        "method": "get",
        "path": "/user/emails/{email}"
      }
    ],
    "errors": [
      "Parsing mockdata of method get in path /repositories encountered error: RangeError: Maximum call stack size exceeded",
      "Parsing mockdata of method get in path /repositories/{username} encountered error: RangeError: Maximum call stack size exceeded",
      "Parsing mockdata of method get in path /repositories/{username}/{repo_slug} encountered error: RangeError: Maximum call stack size exceeded",
      "Parsing mockRequest data of method post in path /repositories/{username}/{repo_slug} encountered error: RangeError: Maximum call stack size exceeded",
      "Parsing mockdata of method post in path /repositories/{username}/{repo_slug} encountered error: RangeError: Maximum call stack size exceeded",
      "Parsing mockRequest data of method put in path /repositories/{username}/{repo_slug} encountered error: RangeError: Maximum call stack size exceeded",
      "Parsing mockdata of method put in path /repositories/{username}/{repo_slug} encountered error: RangeError: Maximum call stack size exceeded",
      "Parsing mockdata of method get in path /repositories/{username}/{repo_slug}/forks encountered error: RangeError: Maximum call stack size exceeded",
      "Parsing mockdata of method get in path /repositories/{username}/{repo_slug}/commit/{revision} encountered error: RangeError: Maximum call stack size exceeded",
      "Parsing mockdata of method get in path /repositories/{username}/{repo_slug}/issues encountered error: RangeError: Maximum call stack size exceeded",
      "Parsing mockRequest data of method post in path /repositories/{username}/{repo_slug}/issues encountered error: RangeError: Maximum call stack size exceeded",
      "Parsing mockdata of method post in path /repositories/{username}/{repo_slug}/issues encountered error: RangeError: Maximum call stack size exceeded",
      "Parsing mockdata of method delete in path /repositories/{username}/{repo_slug}/issues/{issue_id} encountered error: RangeError: Maximum call stack size exceeded",
      "Parsing mockdata of method get in path /repositories/{username}/{repo_slug}/issues/{issue_id} encountered error: RangeError: Maximum call stack size exceeded",
      "Parsing mockdata of method get in path /repositories/{username}/{repo_slug}/pullrequests encountered error: RangeError: Maximum call stack size exceeded",
      "Parsing mockRequest data of method post in path /repositories/{username}/{repo_slug}/pullrequests encountered error: RangeError: Maximum call stack size exceeded",
      "Parsing mockdata of method post in path /repositories/{username}/{repo_slug}/pullrequests encountered error: RangeError: Maximum call stack size exceeded",
      "Parsing mockdata of method get in path /repositories/{username}/{repo_slug}/pullrequests/{pull_request_id} encountered error: RangeError: Maximum call stack size exceeded",
      "Parsing mockRequest data of method put in path /repositories/{username}/{repo_slug}/pullrequests/{pull_request_id} encountered error: RangeError: Maximum call stack size exceeded",
      "Parsing mockdata of method put in path /repositories/{username}/{repo_slug}/pullrequests/{pull_request_id} encountered error: RangeError: Maximum call stack size exceeded",
      "Parsing mockdata of method post in path /repositories/{username}/{repo_slug}/pullrequests/{pull_request_id}/decline encountered error: RangeError: Maximum call stack size exceeded",
      "Parsing mockdata of method post in path /repositories/{username}/{repo_slug}/pullrequests/{pull_request_id}/merge encountered error: RangeError: Maximum call stack size exceeded",
      "Parsing mockdata of method get in path /repositories/{username}/{repo_slug}/pipelines/ encountered error: RangeError: Maximum call stack size exceeded",
      "Parsing mockRequest data of method post in path /repositories/{username}/{repo_slug}/pipelines/ encountered error: RangeError: Maximum call stack size exceeded",
      "Parsing mockdata of method post in path /repositories/{username}/{repo_slug}/pipelines/ encountered error: RangeError: Maximum call stack size exceeded",
      "Parsing mockdata of method get in path /repositories/{username}/{repo_slug}/pipelines/{pipeline_uuid} encountered error: RangeError: Maximum call stack size exceeded",
      "Parsing mockdata of method get in path /repositories/{username}/{repo_slug}/pipelines_config encountered error: RangeError: Maximum call stack size exceeded",
      "Parsing mockRequest data of method put in path /repositories/{username}/{repo_slug}/pipelines_config encountered error: RangeError: Maximum call stack size exceeded",
      "Parsing mockdata of method put in path /repositories/{username}/{repo_slug}/pipelines_config encountered error: RangeError: Maximum call stack size exceeded",
      "Parsing mockdata of method post in path /repositories/{username}/{repo_slug}/refs/tags encountered error: RangeError: Maximum call stack size exceeded",
      "Parsing mockdata of method get in path /snippets/{username}/{encoded_id}/commits encountered error: RangeError: Maximum call stack size exceeded",
      "Parsing mockdata of method get in path /snippets/{username}/{encoded_id}/commits/{revision} encountered error: RangeError: Maximum call stack size exceeded"
    ],
    "warnings": [
      "Method get in path /repositories/{username}/{repo_slug}/diff/{spec} has parameter with the name of an adapter keyword. Parameter name changed from path to pathParam to avoid errors.",
      "Method delete in path /repositories/{username}/{repo_slug}/issues/{issue_id}/attachments/{path} has parameter with the name of an adapter keyword. Parameter name changed from path to pathParam to avoid errors.",
      "Method get in path /repositories/{username}/{repo_slug}/issues/{issue_id}/attachments/{path} has parameter with the name of an adapter keyword. Parameter name changed from path to pathParam to avoid errors.",
      "Method get in path /repositories/{username}/{repo_slug}/src/{node}/{path} has parameter with the name of an adapter keyword. Parameter name changed from path to pathParam to avoid errors.",
      "Method get in path /snippets/{username}/{encoded_id}/{node_id}/files/{path} has parameter with the name of an adapter keyword. Parameter name changed from path to pathParam to avoid errors.",
      "Method get in path /snippets/{username}/{encoded_id}/{revision}/diff has parameter with the name of an adapter keyword. Parameter name changed from path to pathParam to avoid errors."
    ],
    "callsTotal": 182,
    "callsConverted": 182,
    "no_mockdata_num": 98
  }
}