{
  "next": "string",
  "page": 1,
  "pagelen": 9,
  "previous": "string",
  "size": 9,
  "values": [
    {
      "type": "string",
      "created_on": "string",
      "creator": {
        "type": "string",
        "created_on": "string",
        "display_name": "string",
        "links": {
          "avatar": {
            "href": "string"
          },
          "followers": {
            "href": "string"
          },
          "following": {
            "href": "string"
          },
          "html": {
            "href": "string"
          },
          "repositories": {
            "href": "string"
          },
          "self": {
            "href": "string"
          }
        },
        "username": "string",
        "uuid": "string",
        "website": "string"
      },
      "id": 6,
      "is_private": true,
      "owner": {
        "type": "string",
        "created_on": "string",
        "display_name": "string",
        "links": {
          "avatar": {
            "href": "string"
          },
          "followers": {
            "href": "string"
          },
          "following": {
            "href": "string"
          },
          "html": {
            "href": "string"
          },
          "repositories": {
            "href": "string"
          },
          "self": {
            "href": "string"
          }
        },
        "username": "string",
        "uuid": "string",
        "website": "string"
      },
      "scm": "hg",
      "title": "string",
      "updated_on": "string"
    },
    {
      "type": "string",
      "created_on": "string",
      "creator": {
        "type": "string",
        "created_on": "string",
        "display_name": "string",
        "links": {
          "avatar": {
            "href": "string"
          },
          "followers": {
            "href": "string"
          },
          "following": {
            "href": "string"
          },
          "html": {
            "href": "string"
          },
          "repositories": {
            "href": "string"
          },
          "self": {
            "href": "string"
          }
        },
        "username": "string",
        "uuid": "string",
        "website": "string"
      },
      "id": 3,
      "is_private": true,
      "owner": {
        "type": "string",
        "created_on": "string",
        "display_name": "string",
        "links": {
          "avatar": {
            "href": "string"
          },
          "followers": {
            "href": "string"
          },
          "following": {
            "href": "string"
          },
          "html": {
            "href": "string"
          },
          "repositories": {
            "href": "string"
          },
          "self": {
            "href": "string"
          }
        },
        "username": "string",
        "uuid": "string",
        "website": "string"
      },
      "scm": "hg",
      "title": "string",
      "updated_on": "string"
    },
    {
      "type": "string",
      "created_on": "string",
      "creator": {
        "type": "string",
        "created_on": "string",
        "display_name": "string",
        "links": {
          "avatar": {
            "href": "string"
          },
          "followers": {
            "href": "string"
          },
          "following": {
            "href": "string"
          },
          "html": {
            "href": "string"
          },
          "repositories": {
            "href": "string"
          },
          "self": {
            "href": "string"
          }
        },
        "username": "string",
        "uuid": "string",
        "website": "string"
      },
      "id": 7,
      "is_private": true,
      "owner": {
        "type": "string",
        "created_on": "string",
        "display_name": "string",
        "links": {
          "avatar": {
            "href": "string"
          },
          "followers": {
            "href": "string"
          },
          "following": {
            "href": "string"
          },
          "html": {
            "href": "string"
          },
          "repositories": {
            "href": "string"
          },
          "self": {
            "href": "string"
          }
        },
        "username": "string",
        "uuid": "string",
        "website": "string"
      },
      "scm": "hg",
      "title": "string",
      "updated_on": "string"
    }
  ]
}