{
  "type": "string",
  "active": false,
  "created_at": "string",
  "description": "string",
  "events": [
    "repo:imported"
  ],
  "subject": {
    "type": "string"
  },
  "subject_type": "repository",
  "url": "string",
  "uuid": "string"
}