{
  "next": "string",
  "page": 5,
  "pagelen": 7,
  "previous": "string",
  "size": 9,
  "values": [
    {
      "type": "string",
      "groups": [
        {
          "type": "string",
          "full_slug": "string",
          "links": {
            "html": {
              "href": "string"
            },
            "self": {
              "href": "string"
            }
          },
          "members": 8,
          "name": "string",
          "owner": {
            "type": "string",
            "created_on": "string",
            "display_name": "string",
            "links": {
              "avatar": {
                "href": "string"
              },
              "followers": {
                "href": "string"
              },
              "following": {
                "href": "string"
              },
              "html": {
                "href": "string"
              },
              "repositories": {
                "href": "string"
              },
              "self": {
                "href": "string"
              }
            },
            "username": "string",
            "uuid": "string",
            "website": "string"
          },
          "slug": "string"
        },
        {
          "type": "string",
          "full_slug": "string",
          "links": {
            "html": {
              "href": "string"
            },
            "self": {
              "href": "string"
            }
          },
          "members": 10,
          "name": "string",
          "owner": {
            "type": "string",
            "created_on": "string",
            "display_name": "string",
            "links": {
              "avatar": {
                "href": "string"
              },
              "followers": {
                "href": "string"
              },
              "following": {
                "href": "string"
              },
              "html": {
                "href": "string"
              },
              "repositories": {
                "href": "string"
              },
              "self": {
                "href": "string"
              }
            },
            "username": "string",
            "uuid": "string",
            "website": "string"
          },
          "slug": "string"
        },
        {
          "type": "string",
          "full_slug": "string",
          "links": {
            "html": {
              "href": "string"
            },
            "self": {
              "href": "string"
            }
          },
          "members": 1,
          "name": "string",
          "owner": {
            "type": "string",
            "created_on": "string",
            "display_name": "string",
            "links": {
              "avatar": {
                "href": "string"
              },
              "followers": {
                "href": "string"
              },
              "following": {
                "href": "string"
              },
              "html": {
                "href": "string"
              },
              "repositories": {
                "href": "string"
              },
              "self": {
                "href": "string"
              }
            },
            "username": "string",
            "uuid": "string",
            "website": "string"
          },
          "slug": "string"
        },
        {
          "type": "string",
          "full_slug": "string",
          "links": {
            "html": {
              "href": "string"
            },
            "self": {
              "href": "string"
            }
          },
          "members": 6,
          "name": "string",
          "owner": {
            "type": "string",
            "created_on": "string",
            "display_name": "string",
            "links": {
              "avatar": {
                "href": "string"
              },
              "followers": {
                "href": "string"
              },
              "following": {
                "href": "string"
              },
              "html": {
                "href": "string"
              },
              "repositories": {
                "href": "string"
              },
              "self": {
                "href": "string"
              }
            },
            "username": "string",
            "uuid": "string",
            "website": "string"
          },
          "slug": "string"
        },
        {
          "type": "string",
          "full_slug": "string",
          "links": {
            "html": {
              "href": "string"
            },
            "self": {
              "href": "string"
            }
          },
          "members": 5,
          "name": "string",
          "owner": {
            "type": "string",
            "created_on": "string",
            "display_name": "string",
            "links": {
              "avatar": {
                "href": "string"
              },
              "followers": {
                "href": "string"
              },
              "following": {
                "href": "string"
              },
              "html": {
                "href": "string"
              },
              "repositories": {
                "href": "string"
              },
              "self": {
                "href": "string"
              }
            },
            "username": "string",
            "uuid": "string",
            "website": "string"
          },
          "slug": "string"
        },
        {
          "type": "string",
          "full_slug": "string",
          "links": {
            "html": {
              "href": "string"
            },
            "self": {
              "href": "string"
            }
          },
          "members": 3,
          "name": "string",
          "owner": {
            "type": "string",
            "created_on": "string",
            "display_name": "string",
            "links": {
              "avatar": {
                "href": "string"
              },
              "followers": {
                "href": "string"
              },
              "following": {
                "href": "string"
              },
              "html": {
                "href": "string"
              },
              "repositories": {
                "href": "string"
              },
              "self": {
                "href": "string"
              }
            },
            "username": "string",
            "uuid": "string",
            "website": "string"
          },
          "slug": "string"
        },
        {
          "type": "string",
          "full_slug": "string",
          "links": {
            "html": {
              "href": "string"
            },
            "self": {
              "href": "string"
            }
          },
          "members": 6,
          "name": "string",
          "owner": {
            "type": "string",
            "created_on": "string",
            "display_name": "string",
            "links": {
              "avatar": {
                "href": "string"
              },
              "followers": {
                "href": "string"
              },
              "following": {
                "href": "string"
              },
              "html": {
                "href": "string"
              },
              "repositories": {
                "href": "string"
              },
              "self": {
                "href": "string"
              }
            },
            "username": "string",
            "uuid": "string",
            "website": "string"
          },
          "slug": "string"
        }
      ],
      "id": 1,
      "kind": "force",
      "links": {
        "self": {
          "href": "string"
        }
      },
      "users": [
        {
          "type": "string",
          "created_on": "string",
          "display_name": "string",
          "links": {
            "avatar": {
              "href": "string"
            },
            "followers": {
              "href": "string"
            },
            "following": {
              "href": "string"
            },
            "html": {
              "href": "string"
            },
            "repositories": {
              "href": "string"
            },
            "self": {
              "href": "string"
            }
          },
          "username": "string",
          "uuid": "string",
          "website": "string"
        },
        {
          "type": "string",
          "created_on": "string",
          "display_name": "string",
          "links": {
            "avatar": {
              "href": "string"
            },
            "followers": {
              "href": "string"
            },
            "following": {
              "href": "string"
            },
            "html": {
              "href": "string"
            },
            "repositories": {
              "href": "string"
            },
            "self": {
              "href": "string"
            }
          },
          "username": "string",
          "uuid": "string",
          "website": "string"
        },
        {
          "type": "string",
          "created_on": "string",
          "display_name": "string",
          "links": {
            "avatar": {
              "href": "string"
            },
            "followers": {
              "href": "string"
            },
            "following": {
              "href": "string"
            },
            "html": {
              "href": "string"
            },
            "repositories": {
              "href": "string"
            },
            "self": {
              "href": "string"
            }
          },
          "username": "string",
          "uuid": "string",
          "website": "string"
        },
        {
          "type": "string",
          "created_on": "string",
          "display_name": "string",
          "links": {
            "avatar": {
              "href": "string"
            },
            "followers": {
              "href": "string"
            },
            "following": {
              "href": "string"
            },
            "html": {
              "href": "string"
            },
            "repositories": {
              "href": "string"
            },
            "self": {
              "href": "string"
            }
          },
          "username": "string",
          "uuid": "string",
          "website": "string"
        },
        {
          "type": "string",
          "created_on": "string",
          "display_name": "string",
          "links": {
            "avatar": {
              "href": "string"
            },
            "followers": {
              "href": "string"
            },
            "following": {
              "href": "string"
            },
            "html": {
              "href": "string"
            },
            "repositories": {
              "href": "string"
            },
            "self": {
              "href": "string"
            }
          },
          "username": "string",
          "uuid": "string",
          "website": "string"
        },
        {
          "type": "string",
          "created_on": "string",
          "display_name": "string",
          "links": {
            "avatar": {
              "href": "string"
            },
            "followers": {
              "href": "string"
            },
            "following": {
              "href": "string"
            },
            "html": {
              "href": "string"
            },
            "repositories": {
              "href": "string"
            },
            "self": {
              "href": "string"
            }
          },
          "username": "string",
          "uuid": "string",
          "website": "string"
        }
      ],
      "value": 7
    },
    {
      "type": "string",
      "groups": [
        {
          "type": "string",
          "full_slug": "string",
          "links": {
            "html": {
              "href": "string"
            },
            "self": {
              "href": "string"
            }
          },
          "members": 10,
          "name": "string",
          "owner": {
            "type": "string",
            "created_on": "string",
            "display_name": "string",
            "links": {
              "avatar": {
                "href": "string"
              },
              "followers": {
                "href": "string"
              },
              "following": {
                "href": "string"
              },
              "html": {
                "href": "string"
              },
              "repositories": {
                "href": "string"
              },
              "self": {
                "href": "string"
              }
            },
            "username": "string",
            "uuid": "string",
            "website": "string"
          },
          "slug": "string"
        },
        {
          "type": "string",
          "full_slug": "string",
          "links": {
            "html": {
              "href": "string"
            },
            "self": {
              "href": "string"
            }
          },
          "members": 4,
          "name": "string",
          "owner": {
            "type": "string",
            "created_on": "string",
            "display_name": "string",
            "links": {
              "avatar": {
                "href": "string"
              },
              "followers": {
                "href": "string"
              },
              "following": {
                "href": "string"
              },
              "html": {
                "href": "string"
              },
              "repositories": {
                "href": "string"
              },
              "self": {
                "href": "string"
              }
            },
            "username": "string",
            "uuid": "string",
            "website": "string"
          },
          "slug": "string"
        },
        {
          "type": "string",
          "full_slug": "string",
          "links": {
            "html": {
              "href": "string"
            },
            "self": {
              "href": "string"
            }
          },
          "members": 10,
          "name": "string",
          "owner": {
            "type": "string",
            "created_on": "string",
            "display_name": "string",
            "links": {
              "avatar": {
                "href": "string"
              },
              "followers": {
                "href": "string"
              },
              "following": {
                "href": "string"
              },
              "html": {
                "href": "string"
              },
              "repositories": {
                "href": "string"
              },
              "self": {
                "href": "string"
              }
            },
            "username": "string",
            "uuid": "string",
            "website": "string"
          },
          "slug": "string"
        },
        {
          "type": "string",
          "full_slug": "string",
          "links": {
            "html": {
              "href": "string"
            },
            "self": {
              "href": "string"
            }
          },
          "members": 4,
          "name": "string",
          "owner": {
            "type": "string",
            "created_on": "string",
            "display_name": "string",
            "links": {
              "avatar": {
                "href": "string"
              },
              "followers": {
                "href": "string"
              },
              "following": {
                "href": "string"
              },
              "html": {
                "href": "string"
              },
              "repositories": {
                "href": "string"
              },
              "self": {
                "href": "string"
              }
            },
            "username": "string",
            "uuid": "string",
            "website": "string"
          },
          "slug": "string"
        }
      ],
      "id": 9,
      "kind": "enforce_merge_checks",
      "links": {
        "self": {
          "href": "string"
        }
      },
      "users": [
        {
          "type": "string",
          "created_on": "string",
          "display_name": "string",
          "links": {
            "avatar": {
              "href": "string"
            },
            "followers": {
              "href": "string"
            },
            "following": {
              "href": "string"
            },
            "html": {
              "href": "string"
            },
            "repositories": {
              "href": "string"
            },
            "self": {
              "href": "string"
            }
          },
          "username": "string",
          "uuid": "string",
          "website": "string"
        },
        {
          "type": "string",
          "created_on": "string",
          "display_name": "string",
          "links": {
            "avatar": {
              "href": "string"
            },
            "followers": {
              "href": "string"
            },
            "following": {
              "href": "string"
            },
            "html": {
              "href": "string"
            },
            "repositories": {
              "href": "string"
            },
            "self": {
              "href": "string"
            }
          },
          "username": "string",
          "uuid": "string",
          "website": "string"
        },
        {
          "type": "string",
          "created_on": "string",
          "display_name": "string",
          "links": {
            "avatar": {
              "href": "string"
            },
            "followers": {
              "href": "string"
            },
            "following": {
              "href": "string"
            },
            "html": {
              "href": "string"
            },
            "repositories": {
              "href": "string"
            },
            "self": {
              "href": "string"
            }
          },
          "username": "string",
          "uuid": "string",
          "website": "string"
        }
      ],
      "value": 1
    },
    {
      "type": "string",
      "groups": [
        {
          "type": "string",
          "full_slug": "string",
          "links": {
            "html": {
              "href": "string"
            },
            "self": {
              "href": "string"
            }
          },
          "members": 7,
          "name": "string",
          "owner": {
            "type": "string",
            "created_on": "string",
            "display_name": "string",
            "links": {
              "avatar": {
                "href": "string"
              },
              "followers": {
                "href": "string"
              },
              "following": {
                "href": "string"
              },
              "html": {
                "href": "string"
              },
              "repositories": {
                "href": "string"
              },
              "self": {
                "href": "string"
              }
            },
            "username": "string",
            "uuid": "string",
            "website": "string"
          },
          "slug": "string"
        },
        {
          "type": "string",
          "full_slug": "string",
          "links": {
            "html": {
              "href": "string"
            },
            "self": {
              "href": "string"
            }
          },
          "members": 6,
          "name": "string",
          "owner": {
            "type": "string",
            "created_on": "string",
            "display_name": "string",
            "links": {
              "avatar": {
                "href": "string"
              },
              "followers": {
                "href": "string"
              },
              "following": {
                "href": "string"
              },
              "html": {
                "href": "string"
              },
              "repositories": {
                "href": "string"
              },
              "self": {
                "href": "string"
              }
            },
            "username": "string",
            "uuid": "string",
            "website": "string"
          },
          "slug": "string"
        }
      ],
      "id": 8,
      "kind": "delete",
      "links": {
        "self": {
          "href": "string"
        }
      },
      "users": [
        {
          "type": "string",
          "created_on": "string",
          "display_name": "string",
          "links": {
            "avatar": {
              "href": "string"
            },
            "followers": {
              "href": "string"
            },
            "following": {
              "href": "string"
            },
            "html": {
              "href": "string"
            },
            "repositories": {
              "href": "string"
            },
            "self": {
              "href": "string"
            }
          },
          "username": "string",
          "uuid": "string",
          "website": "string"
        }
      ],
      "value": 6
    },
    {
      "type": "string",
      "groups": [
        {
          "type": "string",
          "full_slug": "string",
          "links": {
            "html": {
              "href": "string"
            },
            "self": {
              "href": "string"
            }
          },
          "members": 4,
          "name": "string",
          "owner": {
            "type": "string",
            "created_on": "string",
            "display_name": "string",
            "links": {
              "avatar": {
                "href": "string"
              },
              "followers": {
                "href": "string"
              },
              "following": {
                "href": "string"
              },
              "html": {
                "href": "string"
              },
              "repositories": {
                "href": "string"
              },
              "self": {
                "href": "string"
              }
            },
            "username": "string",
            "uuid": "string",
            "website": "string"
          },
          "slug": "string"
        },
        {
          "type": "string",
          "full_slug": "string",
          "links": {
            "html": {
              "href": "string"
            },
            "self": {
              "href": "string"
            }
          },
          "members": 4,
          "name": "string",
          "owner": {
            "type": "string",
            "created_on": "string",
            "display_name": "string",
            "links": {
              "avatar": {
                "href": "string"
              },
              "followers": {
                "href": "string"
              },
              "following": {
                "href": "string"
              },
              "html": {
                "href": "string"
              },
              "repositories": {
                "href": "string"
              },
              "self": {
                "href": "string"
              }
            },
            "username": "string",
            "uuid": "string",
            "website": "string"
          },
          "slug": "string"
        },
        {
          "type": "string",
          "full_slug": "string",
          "links": {
            "html": {
              "href": "string"
            },
            "self": {
              "href": "string"
            }
          },
          "members": 5,
          "name": "string",
          "owner": {
            "type": "string",
            "created_on": "string",
            "display_name": "string",
            "links": {
              "avatar": {
                "href": "string"
              },
              "followers": {
                "href": "string"
              },
              "following": {
                "href": "string"
              },
              "html": {
                "href": "string"
              },
              "repositories": {
                "href": "string"
              },
              "self": {
                "href": "string"
              }
            },
            "username": "string",
            "uuid": "string",
            "website": "string"
          },
          "slug": "string"
        },
        {
          "type": "string",
          "full_slug": "string",
          "links": {
            "html": {
              "href": "string"
            },
            "self": {
              "href": "string"
            }
          },
          "members": 1,
          "name": "string",
          "owner": {
            "type": "string",
            "created_on": "string",
            "display_name": "string",
            "links": {
              "avatar": {
                "href": "string"
              },
              "followers": {
                "href": "string"
              },
              "following": {
                "href": "string"
              },
              "html": {
                "href": "string"
              },
              "repositories": {
                "href": "string"
              },
              "self": {
                "href": "string"
              }
            },
            "username": "string",
            "uuid": "string",
            "website": "string"
          },
          "slug": "string"
        },
        {
          "type": "string",
          "full_slug": "string",
          "links": {
            "html": {
              "href": "string"
            },
            "self": {
              "href": "string"
            }
          },
          "members": 9,
          "name": "string",
          "owner": {
            "type": "string",
            "created_on": "string",
            "display_name": "string",
            "links": {
              "avatar": {
                "href": "string"
              },
              "followers": {
                "href": "string"
              },
              "following": {
                "href": "string"
              },
              "html": {
                "href": "string"
              },
              "repositories": {
                "href": "string"
              },
              "self": {
                "href": "string"
              }
            },
            "username": "string",
            "uuid": "string",
            "website": "string"
          },
          "slug": "string"
        }
      ],
      "id": 6,
      "kind": "force",
      "links": {
        "self": {
          "href": "string"
        }
      },
      "users": [
        {
          "type": "string",
          "created_on": "string",
          "display_name": "string",
          "links": {
            "avatar": {
              "href": "string"
            },
            "followers": {
              "href": "string"
            },
            "following": {
              "href": "string"
            },
            "html": {
              "href": "string"
            },
            "repositories": {
              "href": "string"
            },
            "self": {
              "href": "string"
            }
          },
          "username": "string",
          "uuid": "string",
          "website": "string"
        },
        {
          "type": "string",
          "created_on": "string",
          "display_name": "string",
          "links": {
            "avatar": {
              "href": "string"
            },
            "followers": {
              "href": "string"
            },
            "following": {
              "href": "string"
            },
            "html": {
              "href": "string"
            },
            "repositories": {
              "href": "string"
            },
            "self": {
              "href": "string"
            }
          },
          "username": "string",
          "uuid": "string",
          "website": "string"
        },
        {
          "type": "string",
          "created_on": "string",
          "display_name": "string",
          "links": {
            "avatar": {
              "href": "string"
            },
            "followers": {
              "href": "string"
            },
            "following": {
              "href": "string"
            },
            "html": {
              "href": "string"
            },
            "repositories": {
              "href": "string"
            },
            "self": {
              "href": "string"
            }
          },
          "username": "string",
          "uuid": "string",
          "website": "string"
        },
        {
          "type": "string",
          "created_on": "string",
          "display_name": "string",
          "links": {
            "avatar": {
              "href": "string"
            },
            "followers": {
              "href": "string"
            },
            "following": {
              "href": "string"
            },
            "html": {
              "href": "string"
            },
            "repositories": {
              "href": "string"
            },
            "self": {
              "href": "string"
            }
          },
          "username": "string",
          "uuid": "string",
          "website": "string"
        },
        {
          "type": "string",
          "created_on": "string",
          "display_name": "string",
          "links": {
            "avatar": {
              "href": "string"
            },
            "followers": {
              "href": "string"
            },
            "following": {
              "href": "string"
            },
            "html": {
              "href": "string"
            },
            "repositories": {
              "href": "string"
            },
            "self": {
              "href": "string"
            }
          },
          "username": "string",
          "uuid": "string",
          "website": "string"
        },
        {
          "type": "string",
          "created_on": "string",
          "display_name": "string",
          "links": {
            "avatar": {
              "href": "string"
            },
            "followers": {
              "href": "string"
            },
            "following": {
              "href": "string"
            },
            "html": {
              "href": "string"
            },
            "repositories": {
              "href": "string"
            },
            "self": {
              "href": "string"
            }
          },
          "username": "string",
          "uuid": "string",
          "website": "string"
        },
        {
          "type": "string",
          "created_on": "string",
          "display_name": "string",
          "links": {
            "avatar": {
              "href": "string"
            },
            "followers": {
              "href": "string"
            },
            "following": {
              "href": "string"
            },
            "html": {
              "href": "string"
            },
            "repositories": {
              "href": "string"
            },
            "self": {
              "href": "string"
            }
          },
          "username": "string",
          "uuid": "string",
          "website": "string"
        },
        {
          "type": "string",
          "created_on": "string",
          "display_name": "string",
          "links": {
            "avatar": {
              "href": "string"
            },
            "followers": {
              "href": "string"
            },
            "following": {
              "href": "string"
            },
            "html": {
              "href": "string"
            },
            "repositories": {
              "href": "string"
            },
            "self": {
              "href": "string"
            }
          },
          "username": "string",
          "uuid": "string",
          "website": "string"
        }
      ],
      "value": 5
    },
    {
      "type": "string",
      "groups": [
        {
          "type": "string",
          "full_slug": "string",
          "links": {
            "html": {
              "href": "string"
            },
            "self": {
              "href": "string"
            }
          },
          "members": 6,
          "name": "string",
          "owner": {
            "type": "string",
            "created_on": "string",
            "display_name": "string",
            "links": {
              "avatar": {
                "href": "string"
              },
              "followers": {
                "href": "string"
              },
              "following": {
                "href": "string"
              },
              "html": {
                "href": "string"
              },
              "repositories": {
                "href": "string"
              },
              "self": {
                "href": "string"
              }
            },
            "username": "string",
            "uuid": "string",
            "website": "string"
          },
          "slug": "string"
        },
        {
          "type": "string",
          "full_slug": "string",
          "links": {
            "html": {
              "href": "string"
            },
            "self": {
              "href": "string"
            }
          },
          "members": 7,
          "name": "string",
          "owner": {
            "type": "string",
            "created_on": "string",
            "display_name": "string",
            "links": {
              "avatar": {
                "href": "string"
              },
              "followers": {
                "href": "string"
              },
              "following": {
                "href": "string"
              },
              "html": {
                "href": "string"
              },
              "repositories": {
                "href": "string"
              },
              "self": {
                "href": "string"
              }
            },
            "username": "string",
            "uuid": "string",
            "website": "string"
          },
          "slug": "string"
        },
        {
          "type": "string",
          "full_slug": "string",
          "links": {
            "html": {
              "href": "string"
            },
            "self": {
              "href": "string"
            }
          },
          "members": 5,
          "name": "string",
          "owner": {
            "type": "string",
            "created_on": "string",
            "display_name": "string",
            "links": {
              "avatar": {
                "href": "string"
              },
              "followers": {
                "href": "string"
              },
              "following": {
                "href": "string"
              },
              "html": {
                "href": "string"
              },
              "repositories": {
                "href": "string"
              },
              "self": {
                "href": "string"
              }
            },
            "username": "string",
            "uuid": "string",
            "website": "string"
          },
          "slug": "string"
        },
        {
          "type": "string",
          "full_slug": "string",
          "links": {
            "html": {
              "href": "string"
            },
            "self": {
              "href": "string"
            }
          },
          "members": 1,
          "name": "string",
          "owner": {
            "type": "string",
            "created_on": "string",
            "display_name": "string",
            "links": {
              "avatar": {
                "href": "string"
              },
              "followers": {
                "href": "string"
              },
              "following": {
                "href": "string"
              },
              "html": {
                "href": "string"
              },
              "repositories": {
                "href": "string"
              },
              "self": {
                "href": "string"
              }
            },
            "username": "string",
            "uuid": "string",
            "website": "string"
          },
          "slug": "string"
        },
        {
          "type": "string",
          "full_slug": "string",
          "links": {
            "html": {
              "href": "string"
            },
            "self": {
              "href": "string"
            }
          },
          "members": 1,
          "name": "string",
          "owner": {
            "type": "string",
            "created_on": "string",
            "display_name": "string",
            "links": {
              "avatar": {
                "href": "string"
              },
              "followers": {
                "href": "string"
              },
              "following": {
                "href": "string"
              },
              "html": {
                "href": "string"
              },
              "repositories": {
                "href": "string"
              },
              "self": {
                "href": "string"
              }
            },
            "username": "string",
            "uuid": "string",
            "website": "string"
          },
          "slug": "string"
        },
        {
          "type": "string",
          "full_slug": "string",
          "links": {
            "html": {
              "href": "string"
            },
            "self": {
              "href": "string"
            }
          },
          "members": 7,
          "name": "string",
          "owner": {
            "type": "string",
            "created_on": "string",
            "display_name": "string",
            "links": {
              "avatar": {
                "href": "string"
              },
              "followers": {
                "href": "string"
              },
              "following": {
                "href": "string"
              },
              "html": {
                "href": "string"
              },
              "repositories": {
                "href": "string"
              },
              "self": {
                "href": "string"
              }
            },
            "username": "string",
            "uuid": "string",
            "website": "string"
          },
          "slug": "string"
        }
      ],
      "id": 5,
      "kind": "reset_pullrequest_approvals_on_change",
      "links": {
        "self": {
          "href": "string"
        }
      },
      "users": [
        {
          "type": "string",
          "created_on": "string",
          "display_name": "string",
          "links": {
            "avatar": {
              "href": "string"
            },
            "followers": {
              "href": "string"
            },
            "following": {
              "href": "string"
            },
            "html": {
              "href": "string"
            },
            "repositories": {
              "href": "string"
            },
            "self": {
              "href": "string"
            }
          },
          "username": "string",
          "uuid": "string",
          "website": "string"
        }
      ],
      "value": 5
    },
    {
      "type": "string",
      "groups": [
        {
          "type": "string",
          "full_slug": "string",
          "links": {
            "html": {
              "href": "string"
            },
            "self": {
              "href": "string"
            }
          },
          "members": 6,
          "name": "string",
          "owner": {
            "type": "string",
            "created_on": "string",
            "display_name": "string",
            "links": {
              "avatar": {
                "href": "string"
              },
              "followers": {
                "href": "string"
              },
              "following": {
                "href": "string"
              },
              "html": {
                "href": "string"
              },
              "repositories": {
                "href": "string"
              },
              "self": {
                "href": "string"
              }
            },
            "username": "string",
            "uuid": "string",
            "website": "string"
          },
          "slug": "string"
        },
        {
          "type": "string",
          "full_slug": "string",
          "links": {
            "html": {
              "href": "string"
            },
            "self": {
              "href": "string"
            }
          },
          "members": 9,
          "name": "string",
          "owner": {
            "type": "string",
            "created_on": "string",
            "display_name": "string",
            "links": {
              "avatar": {
                "href": "string"
              },
              "followers": {
                "href": "string"
              },
              "following": {
                "href": "string"
              },
              "html": {
                "href": "string"
              },
              "repositories": {
                "href": "string"
              },
              "self": {
                "href": "string"
              }
            },
            "username": "string",
            "uuid": "string",
            "website": "string"
          },
          "slug": "string"
        },
        {
          "type": "string",
          "full_slug": "string",
          "links": {
            "html": {
              "href": "string"
            },
            "self": {
              "href": "string"
            }
          },
          "members": 8,
          "name": "string",
          "owner": {
            "type": "string",
            "created_on": "string",
            "display_name": "string",
            "links": {
              "avatar": {
                "href": "string"
              },
              "followers": {
                "href": "string"
              },
              "following": {
                "href": "string"
              },
              "html": {
                "href": "string"
              },
              "repositories": {
                "href": "string"
              },
              "self": {
                "href": "string"
              }
            },
            "username": "string",
            "uuid": "string",
            "website": "string"
          },
          "slug": "string"
        },
        {
          "type": "string",
          "full_slug": "string",
          "links": {
            "html": {
              "href": "string"
            },
            "self": {
              "href": "string"
            }
          },
          "members": 3,
          "name": "string",
          "owner": {
            "type": "string",
            "created_on": "string",
            "display_name": "string",
            "links": {
              "avatar": {
                "href": "string"
              },
              "followers": {
                "href": "string"
              },
              "following": {
                "href": "string"
              },
              "html": {
                "href": "string"
              },
              "repositories": {
                "href": "string"
              },
              "self": {
                "href": "string"
              }
            },
            "username": "string",
            "uuid": "string",
            "website": "string"
          },
          "slug": "string"
        }
      ],
      "id": 2,
      "kind": "enforce_merge_checks",
      "links": {
        "self": {
          "href": "string"
        }
      },
      "users": [
        {
          "type": "string",
          "created_on": "string",
          "display_name": "string",
          "links": {
            "avatar": {
              "href": "string"
            },
            "followers": {
              "href": "string"
            },
            "following": {
              "href": "string"
            },
            "html": {
              "href": "string"
            },
            "repositories": {
              "href": "string"
            },
            "self": {
              "href": "string"
            }
          },
          "username": "string",
          "uuid": "string",
          "website": "string"
        },
        {
          "type": "string",
          "created_on": "string",
          "display_name": "string",
          "links": {
            "avatar": {
              "href": "string"
            },
            "followers": {
              "href": "string"
            },
            "following": {
              "href": "string"
            },
            "html": {
              "href": "string"
            },
            "repositories": {
              "href": "string"
            },
            "self": {
              "href": "string"
            }
          },
          "username": "string",
          "uuid": "string",
          "website": "string"
        },
        {
          "type": "string",
          "created_on": "string",
          "display_name": "string",
          "links": {
            "avatar": {
              "href": "string"
            },
            "followers": {
              "href": "string"
            },
            "following": {
              "href": "string"
            },
            "html": {
              "href": "string"
            },
            "repositories": {
              "href": "string"
            },
            "self": {
              "href": "string"
            }
          },
          "username": "string",
          "uuid": "string",
          "website": "string"
        },
        {
          "type": "string",
          "created_on": "string",
          "display_name": "string",
          "links": {
            "avatar": {
              "href": "string"
            },
            "followers": {
              "href": "string"
            },
            "following": {
              "href": "string"
            },
            "html": {
              "href": "string"
            },
            "repositories": {
              "href": "string"
            },
            "self": {
              "href": "string"
            }
          },
          "username": "string",
          "uuid": "string",
          "website": "string"
        },
        {
          "type": "string",
          "created_on": "string",
          "display_name": "string",
          "links": {
            "avatar": {
              "href": "string"
            },
            "followers": {
              "href": "string"
            },
            "following": {
              "href": "string"
            },
            "html": {
              "href": "string"
            },
            "repositories": {
              "href": "string"
            },
            "self": {
              "href": "string"
            }
          },
          "username": "string",
          "uuid": "string",
          "website": "string"
        }
      ],
      "value": 5
    },
    {
      "type": "string",
      "groups": [
        {
          "type": "string",
          "full_slug": "string",
          "links": {
            "html": {
              "href": "string"
            },
            "self": {
              "href": "string"
            }
          },
          "members": 5,
          "name": "string",
          "owner": {
            "type": "string",
            "created_on": "string",
            "display_name": "string",
            "links": {
              "avatar": {
                "href": "string"
              },
              "followers": {
                "href": "string"
              },
              "following": {
                "href": "string"
              },
              "html": {
                "href": "string"
              },
              "repositories": {
                "href": "string"
              },
              "self": {
                "href": "string"
              }
            },
            "username": "string",
            "uuid": "string",
            "website": "string"
          },
          "slug": "string"
        },
        {
          "type": "string",
          "full_slug": "string",
          "links": {
            "html": {
              "href": "string"
            },
            "self": {
              "href": "string"
            }
          },
          "members": 2,
          "name": "string",
          "owner": {
            "type": "string",
            "created_on": "string",
            "display_name": "string",
            "links": {
              "avatar": {
                "href": "string"
              },
              "followers": {
                "href": "string"
              },
              "following": {
                "href": "string"
              },
              "html": {
                "href": "string"
              },
              "repositories": {
                "href": "string"
              },
              "self": {
                "href": "string"
              }
            },
            "username": "string",
            "uuid": "string",
            "website": "string"
          },
          "slug": "string"
        },
        {
          "type": "string",
          "full_slug": "string",
          "links": {
            "html": {
              "href": "string"
            },
            "self": {
              "href": "string"
            }
          },
          "members": 1,
          "name": "string",
          "owner": {
            "type": "string",
            "created_on": "string",
            "display_name": "string",
            "links": {
              "avatar": {
                "href": "string"
              },
              "followers": {
                "href": "string"
              },
              "following": {
                "href": "string"
              },
              "html": {
                "href": "string"
              },
              "repositories": {
                "href": "string"
              },
              "self": {
                "href": "string"
              }
            },
            "username": "string",
            "uuid": "string",
            "website": "string"
          },
          "slug": "string"
        },
        {
          "type": "string",
          "full_slug": "string",
          "links": {
            "html": {
              "href": "string"
            },
            "self": {
              "href": "string"
            }
          },
          "members": 1,
          "name": "string",
          "owner": {
            "type": "string",
            "created_on": "string",
            "display_name": "string",
            "links": {
              "avatar": {
                "href": "string"
              },
              "followers": {
                "href": "string"
              },
              "following": {
                "href": "string"
              },
              "html": {
                "href": "string"
              },
              "repositories": {
                "href": "string"
              },
              "self": {
                "href": "string"
              }
            },
            "username": "string",
            "uuid": "string",
            "website": "string"
          },
          "slug": "string"
        },
        {
          "type": "string",
          "full_slug": "string",
          "links": {
            "html": {
              "href": "string"
            },
            "self": {
              "href": "string"
            }
          },
          "members": 2,
          "name": "string",
          "owner": {
            "type": "string",
            "created_on": "string",
            "display_name": "string",
            "links": {
              "avatar": {
                "href": "string"
              },
              "followers": {
                "href": "string"
              },
              "following": {
                "href": "string"
              },
              "html": {
                "href": "string"
              },
              "repositories": {
                "href": "string"
              },
              "self": {
                "href": "string"
              }
            },
            "username": "string",
            "uuid": "string",
            "website": "string"
          },
          "slug": "string"
        },
        {
          "type": "string",
          "full_slug": "string",
          "links": {
            "html": {
              "href": "string"
            },
            "self": {
              "href": "string"
            }
          },
          "members": 6,
          "name": "string",
          "owner": {
            "type": "string",
            "created_on": "string",
            "display_name": "string",
            "links": {
              "avatar": {
                "href": "string"
              },
              "followers": {
                "href": "string"
              },
              "following": {
                "href": "string"
              },
              "html": {
                "href": "string"
              },
              "repositories": {
                "href": "string"
              },
              "self": {
                "href": "string"
              }
            },
            "username": "string",
            "uuid": "string",
            "website": "string"
          },
          "slug": "string"
        },
        {
          "type": "string",
          "full_slug": "string",
          "links": {
            "html": {
              "href": "string"
            },
            "self": {
              "href": "string"
            }
          },
          "members": 1,
          "name": "string",
          "owner": {
            "type": "string",
            "created_on": "string",
            "display_name": "string",
            "links": {
              "avatar": {
                "href": "string"
              },
              "followers": {
                "href": "string"
              },
              "following": {
                "href": "string"
              },
              "html": {
                "href": "string"
              },
              "repositories": {
                "href": "string"
              },
              "self": {
                "href": "string"
              }
            },
            "username": "string",
            "uuid": "string",
            "website": "string"
          },
          "slug": "string"
        }
      ],
      "id": 8,
      "kind": "require_passing_builds_to_merge",
      "links": {
        "self": {
          "href": "string"
        }
      },
      "users": [
        {
          "type": "string",
          "created_on": "string",
          "display_name": "string",
          "links": {
            "avatar": {
              "href": "string"
            },
            "followers": {
              "href": "string"
            },
            "following": {
              "href": "string"
            },
            "html": {
              "href": "string"
            },
            "repositories": {
              "href": "string"
            },
            "self": {
              "href": "string"
            }
          },
          "username": "string",
          "uuid": "string",
          "website": "string"
        },
        {
          "type": "string",
          "created_on": "string",
          "display_name": "string",
          "links": {
            "avatar": {
              "href": "string"
            },
            "followers": {
              "href": "string"
            },
            "following": {
              "href": "string"
            },
            "html": {
              "href": "string"
            },
            "repositories": {
              "href": "string"
            },
            "self": {
              "href": "string"
            }
          },
          "username": "string",
          "uuid": "string",
          "website": "string"
        },
        {
          "type": "string",
          "created_on": "string",
          "display_name": "string",
          "links": {
            "avatar": {
              "href": "string"
            },
            "followers": {
              "href": "string"
            },
            "following": {
              "href": "string"
            },
            "html": {
              "href": "string"
            },
            "repositories": {
              "href": "string"
            },
            "self": {
              "href": "string"
            }
          },
          "username": "string",
          "uuid": "string",
          "website": "string"
        },
        {
          "type": "string",
          "created_on": "string",
          "display_name": "string",
          "links": {
            "avatar": {
              "href": "string"
            },
            "followers": {
              "href": "string"
            },
            "following": {
              "href": "string"
            },
            "html": {
              "href": "string"
            },
            "repositories": {
              "href": "string"
            },
            "self": {
              "href": "string"
            }
          },
          "username": "string",
          "uuid": "string",
          "website": "string"
        },
        {
          "type": "string",
          "created_on": "string",
          "display_name": "string",
          "links": {
            "avatar": {
              "href": "string"
            },
            "followers": {
              "href": "string"
            },
            "following": {
              "href": "string"
            },
            "html": {
              "href": "string"
            },
            "repositories": {
              "href": "string"
            },
            "self": {
              "href": "string"
            }
          },
          "username": "string",
          "uuid": "string",
          "website": "string"
        },
        {
          "type": "string",
          "created_on": "string",
          "display_name": "string",
          "links": {
            "avatar": {
              "href": "string"
            },
            "followers": {
              "href": "string"
            },
            "following": {
              "href": "string"
            },
            "html": {
              "href": "string"
            },
            "repositories": {
              "href": "string"
            },
            "self": {
              "href": "string"
            }
          },
          "username": "string",
          "uuid": "string",
          "website": "string"
        },
        {
          "type": "string",
          "created_on": "string",
          "display_name": "string",
          "links": {
            "avatar": {
              "href": "string"
            },
            "followers": {
              "href": "string"
            },
            "following": {
              "href": "string"
            },
            "html": {
              "href": "string"
            },
            "repositories": {
              "href": "string"
            },
            "self": {
              "href": "string"
            }
          },
          "username": "string",
          "uuid": "string",
          "website": "string"
        },
        {
          "type": "string",
          "created_on": "string",
          "display_name": "string",
          "links": {
            "avatar": {
              "href": "string"
            },
            "followers": {
              "href": "string"
            },
            "following": {
              "href": "string"
            },
            "html": {
              "href": "string"
            },
            "repositories": {
              "href": "string"
            },
            "self": {
              "href": "string"
            }
          },
          "username": "string",
          "uuid": "string",
          "website": "string"
        }
      ],
      "value": 2
    },
    {
      "type": "string",
      "groups": [
        {
          "type": "string",
          "full_slug": "string",
          "links": {
            "html": {
              "href": "string"
            },
            "self": {
              "href": "string"
            }
          },
          "members": 9,
          "name": "string",
          "owner": {
            "type": "string",
            "created_on": "string",
            "display_name": "string",
            "links": {
              "avatar": {
                "href": "string"
              },
              "followers": {
                "href": "string"
              },
              "following": {
                "href": "string"
              },
              "html": {
                "href": "string"
              },
              "repositories": {
                "href": "string"
              },
              "self": {
                "href": "string"
              }
            },
            "username": "string",
            "uuid": "string",
            "website": "string"
          },
          "slug": "string"
        },
        {
          "type": "string",
          "full_slug": "string",
          "links": {
            "html": {
              "href": "string"
            },
            "self": {
              "href": "string"
            }
          },
          "members": 8,
          "name": "string",
          "owner": {
            "type": "string",
            "created_on": "string",
            "display_name": "string",
            "links": {
              "avatar": {
                "href": "string"
              },
              "followers": {
                "href": "string"
              },
              "following": {
                "href": "string"
              },
              "html": {
                "href": "string"
              },
              "repositories": {
                "href": "string"
              },
              "self": {
                "href": "string"
              }
            },
            "username": "string",
            "uuid": "string",
            "website": "string"
          },
          "slug": "string"
        },
        {
          "type": "string",
          "full_slug": "string",
          "links": {
            "html": {
              "href": "string"
            },
            "self": {
              "href": "string"
            }
          },
          "members": 2,
          "name": "string",
          "owner": {
            "type": "string",
            "created_on": "string",
            "display_name": "string",
            "links": {
              "avatar": {
                "href": "string"
              },
              "followers": {
                "href": "string"
              },
              "following": {
                "href": "string"
              },
              "html": {
                "href": "string"
              },
              "repositories": {
                "href": "string"
              },
              "self": {
                "href": "string"
              }
            },
            "username": "string",
            "uuid": "string",
            "website": "string"
          },
          "slug": "string"
        },
        {
          "type": "string",
          "full_slug": "string",
          "links": {
            "html": {
              "href": "string"
            },
            "self": {
              "href": "string"
            }
          },
          "members": 10,
          "name": "string",
          "owner": {
            "type": "string",
            "created_on": "string",
            "display_name": "string",
            "links": {
              "avatar": {
                "href": "string"
              },
              "followers": {
                "href": "string"
              },
              "following": {
                "href": "string"
              },
              "html": {
                "href": "string"
              },
              "repositories": {
                "href": "string"
              },
              "self": {
                "href": "string"
              }
            },
            "username": "string",
            "uuid": "string",
            "website": "string"
          },
          "slug": "string"
        },
        {
          "type": "string",
          "full_slug": "string",
          "links": {
            "html": {
              "href": "string"
            },
            "self": {
              "href": "string"
            }
          },
          "members": 7,
          "name": "string",
          "owner": {
            "type": "string",
            "created_on": "string",
            "display_name": "string",
            "links": {
              "avatar": {
                "href": "string"
              },
              "followers": {
                "href": "string"
              },
              "following": {
                "href": "string"
              },
              "html": {
                "href": "string"
              },
              "repositories": {
                "href": "string"
              },
              "self": {
                "href": "string"
              }
            },
            "username": "string",
            "uuid": "string",
            "website": "string"
          },
          "slug": "string"
        },
        {
          "type": "string",
          "full_slug": "string",
          "links": {
            "html": {
              "href": "string"
            },
            "self": {
              "href": "string"
            }
          },
          "members": 5,
          "name": "string",
          "owner": {
            "type": "string",
            "created_on": "string",
            "display_name": "string",
            "links": {
              "avatar": {
                "href": "string"
              },
              "followers": {
                "href": "string"
              },
              "following": {
                "href": "string"
              },
              "html": {
                "href": "string"
              },
              "repositories": {
                "href": "string"
              },
              "self": {
                "href": "string"
              }
            },
            "username": "string",
            "uuid": "string",
            "website": "string"
          },
          "slug": "string"
        }
      ],
      "id": 5,
      "kind": "reset_pullrequest_approvals_on_change",
      "links": {
        "self": {
          "href": "string"
        }
      },
      "users": [
        {
          "type": "string",
          "created_on": "string",
          "display_name": "string",
          "links": {
            "avatar": {
              "href": "string"
            },
            "followers": {
              "href": "string"
            },
            "following": {
              "href": "string"
            },
            "html": {
              "href": "string"
            },
            "repositories": {
              "href": "string"
            },
            "self": {
              "href": "string"
            }
          },
          "username": "string",
          "uuid": "string",
          "website": "string"
        }
      ],
      "value": 9
    },
    {
      "type": "string",
      "groups": [
        {
          "type": "string",
          "full_slug": "string",
          "links": {
            "html": {
              "href": "string"
            },
            "self": {
              "href": "string"
            }
          },
          "members": 9,
          "name": "string",
          "owner": {
            "type": "string",
            "created_on": "string",
            "display_name": "string",
            "links": {
              "avatar": {
                "href": "string"
              },
              "followers": {
                "href": "string"
              },
              "following": {
                "href": "string"
              },
              "html": {
                "href": "string"
              },
              "repositories": {
                "href": "string"
              },
              "self": {
                "href": "string"
              }
            },
            "username": "string",
            "uuid": "string",
            "website": "string"
          },
          "slug": "string"
        }
      ],
      "id": 1,
      "kind": "restrict_merges",
      "links": {
        "self": {
          "href": "string"
        }
      },
      "users": [
        {
          "type": "string",
          "created_on": "string",
          "display_name": "string",
          "links": {
            "avatar": {
              "href": "string"
            },
            "followers": {
              "href": "string"
            },
            "following": {
              "href": "string"
            },
            "html": {
              "href": "string"
            },
            "repositories": {
              "href": "string"
            },
            "self": {
              "href": "string"
            }
          },
          "username": "string",
          "uuid": "string",
          "website": "string"
        },
        {
          "type": "string",
          "created_on": "string",
          "display_name": "string",
          "links": {
            "avatar": {
              "href": "string"
            },
            "followers": {
              "href": "string"
            },
            "following": {
              "href": "string"
            },
            "html": {
              "href": "string"
            },
            "repositories": {
              "href": "string"
            },
            "self": {
              "href": "string"
            }
          },
          "username": "string",
          "uuid": "string",
          "website": "string"
        },
        {
          "type": "string",
          "created_on": "string",
          "display_name": "string",
          "links": {
            "avatar": {
              "href": "string"
            },
            "followers": {
              "href": "string"
            },
            "following": {
              "href": "string"
            },
            "html": {
              "href": "string"
            },
            "repositories": {
              "href": "string"
            },
            "self": {
              "href": "string"
            }
          },
          "username": "string",
          "uuid": "string",
          "website": "string"
        },
        {
          "type": "string",
          "created_on": "string",
          "display_name": "string",
          "links": {
            "avatar": {
              "href": "string"
            },
            "followers": {
              "href": "string"
            },
            "following": {
              "href": "string"
            },
            "html": {
              "href": "string"
            },
            "repositories": {
              "href": "string"
            },
            "self": {
              "href": "string"
            }
          },
          "username": "string",
          "uuid": "string",
          "website": "string"
        },
        {
          "type": "string",
          "created_on": "string",
          "display_name": "string",
          "links": {
            "avatar": {
              "href": "string"
            },
            "followers": {
              "href": "string"
            },
            "following": {
              "href": "string"
            },
            "html": {
              "href": "string"
            },
            "repositories": {
              "href": "string"
            },
            "self": {
              "href": "string"
            }
          },
          "username": "string",
          "uuid": "string",
          "website": "string"
        },
        {
          "type": "string",
          "created_on": "string",
          "display_name": "string",
          "links": {
            "avatar": {
              "href": "string"
            },
            "followers": {
              "href": "string"
            },
            "following": {
              "href": "string"
            },
            "html": {
              "href": "string"
            },
            "repositories": {
              "href": "string"
            },
            "self": {
              "href": "string"
            }
          },
          "username": "string",
          "uuid": "string",
          "website": "string"
        },
        {
          "type": "string",
          "created_on": "string",
          "display_name": "string",
          "links": {
            "avatar": {
              "href": "string"
            },
            "followers": {
              "href": "string"
            },
            "following": {
              "href": "string"
            },
            "html": {
              "href": "string"
            },
            "repositories": {
              "href": "string"
            },
            "self": {
              "href": "string"
            }
          },
          "username": "string",
          "uuid": "string",
          "website": "string"
        },
        {
          "type": "string",
          "created_on": "string",
          "display_name": "string",
          "links": {
            "avatar": {
              "href": "string"
            },
            "followers": {
              "href": "string"
            },
            "following": {
              "href": "string"
            },
            "html": {
              "href": "string"
            },
            "repositories": {
              "href": "string"
            },
            "self": {
              "href": "string"
            }
          },
          "username": "string",
          "uuid": "string",
          "website": "string"
        },
        {
          "type": "string",
          "created_on": "string",
          "display_name": "string",
          "links": {
            "avatar": {
              "href": "string"
            },
            "followers": {
              "href": "string"
            },
            "following": {
              "href": "string"
            },
            "html": {
              "href": "string"
            },
            "repositories": {
              "href": "string"
            },
            "self": {
              "href": "string"
            }
          },
          "username": "string",
          "uuid": "string",
          "website": "string"
        },
        {
          "type": "string",
          "created_on": "string",
          "display_name": "string",
          "links": {
            "avatar": {
              "href": "string"
            },
            "followers": {
              "href": "string"
            },
            "following": {
              "href": "string"
            },
            "html": {
              "href": "string"
            },
            "repositories": {
              "href": "string"
            },
            "self": {
              "href": "string"
            }
          },
          "username": "string",
          "uuid": "string",
          "website": "string"
        }
      ],
      "value": 6
    }
  ]
}