{
  "next": "string",
  "page": 10,
  "pagelen": 4,
  "previous": "string",
  "size": 10,
  "values": [
    {
      "type": "string",
      "created_on": "string",
      "description": "string",
      "is_private": true,
      "key": "string",
      "links": {
        "avatar": {
          "href": "string"
        },
        "html": {
          "href": "string"
        }
      },
      "name": "string",
      "owner": {
        "type": "string",
        "created_on": "string",
        "display_name": "string",
        "links": {
          "avatar": {
            "href": "string"
          },
          "followers": {
            "href": "string"
          },
          "following": {
            "href": "string"
          },
          "html": {
            "href": "string"
          },
          "repositories": {
            "href": "string"
          },
          "self": {
            "href": "string"
          }
        },
        "username": "string",
        "uuid": "string",
        "website": "string"
      },
      "updated_on": "string",
      "uuid": "string"
    },
    {
      "type": "string",
      "created_on": "string",
      "description": "string",
      "is_private": false,
      "key": "string",
      "links": {
        "avatar": {
          "href": "string"
        },
        "html": {
          "href": "string"
        }
      },
      "name": "string",
      "owner": {
        "type": "string",
        "created_on": "string",
        "display_name": "string",
        "links": {
          "avatar": {
            "href": "string"
          },
          "followers": {
            "href": "string"
          },
          "following": {
            "href": "string"
          },
          "html": {
            "href": "string"
          },
          "repositories": {
            "href": "string"
          },
          "self": {
            "href": "string"
          }
        },
        "username": "string",
        "uuid": "string",
        "website": "string"
      },
      "updated_on": "string",
      "uuid": "string"
    },
    {
      "type": "string",
      "created_on": "string",
      "description": "string",
      "is_private": true,
      "key": "string",
      "links": {
        "avatar": {
          "href": "string"
        },
        "html": {
          "href": "string"
        }
      },
      "name": "string",
      "owner": {
        "type": "string",
        "created_on": "string",
        "display_name": "string",
        "links": {
          "avatar": {
            "href": "string"
          },
          "followers": {
            "href": "string"
          },
          "following": {
            "href": "string"
          },
          "html": {
            "href": "string"
          },
          "repositories": {
            "href": "string"
          },
          "self": {
            "href": "string"
          }
        },
        "username": "string",
        "uuid": "string",
        "website": "string"
      },
      "updated_on": "string",
      "uuid": "string"
    },
    {
      "type": "string",
      "created_on": "string",
      "description": "string",
      "is_private": false,
      "key": "string",
      "links": {
        "avatar": {
          "href": "string"
        },
        "html": {
          "href": "string"
        }
      },
      "name": "string",
      "owner": {
        "type": "string",
        "created_on": "string",
        "display_name": "string",
        "links": {
          "avatar": {
            "href": "string"
          },
          "followers": {
            "href": "string"
          },
          "following": {
            "href": "string"
          },
          "html": {
            "href": "string"
          },
          "repositories": {
            "href": "string"
          },
          "self": {
            "href": "string"
          }
        },
        "username": "string",
        "uuid": "string",
        "website": "string"
      },
      "updated_on": "string",
      "uuid": "string"
    },
    {
      "type": "string",
      "created_on": "string",
      "description": "string",
      "is_private": false,
      "key": "string",
      "links": {
        "avatar": {
          "href": "string"
        },
        "html": {
          "href": "string"
        }
      },
      "name": "string",
      "owner": {
        "type": "string",
        "created_on": "string",
        "display_name": "string",
        "links": {
          "avatar": {
            "href": "string"
          },
          "followers": {
            "href": "string"
          },
          "following": {
            "href": "string"
          },
          "html": {
            "href": "string"
          },
          "repositories": {
            "href": "string"
          },
          "self": {
            "href": "string"
          }
        },
        "username": "string",
        "uuid": "string",
        "website": "string"
      },
      "updated_on": "string",
      "uuid": "string"
    },
    {
      "type": "string",
      "created_on": "string",
      "description": "string",
      "is_private": false,
      "key": "string",
      "links": {
        "avatar": {
          "href": "string"
        },
        "html": {
          "href": "string"
        }
      },
      "name": "string",
      "owner": {
        "type": "string",
        "created_on": "string",
        "display_name": "string",
        "links": {
          "avatar": {
            "href": "string"
          },
          "followers": {
            "href": "string"
          },
          "following": {
            "href": "string"
          },
          "html": {
            "href": "string"
          },
          "repositories": {
            "href": "string"
          },
          "self": {
            "href": "string"
          }
        },
        "username": "string",
        "uuid": "string",
        "website": "string"
      },
      "updated_on": "string",
      "uuid": "string"
    },
    {
      "type": "string",
      "created_on": "string",
      "description": "string",
      "is_private": true,
      "key": "string",
      "links": {
        "avatar": {
          "href": "string"
        },
        "html": {
          "href": "string"
        }
      },
      "name": "string",
      "owner": {
        "type": "string",
        "created_on": "string",
        "display_name": "string",
        "links": {
          "avatar": {
            "href": "string"
          },
          "followers": {
            "href": "string"
          },
          "following": {
            "href": "string"
          },
          "html": {
            "href": "string"
          },
          "repositories": {
            "href": "string"
          },
          "self": {
            "href": "string"
          }
        },
        "username": "string",
        "uuid": "string",
        "website": "string"
      },
      "updated_on": "string",
      "uuid": "string"
    },
    {
      "type": "string",
      "created_on": "string",
      "description": "string",
      "is_private": true,
      "key": "string",
      "links": {
        "avatar": {
          "href": "string"
        },
        "html": {
          "href": "string"
        }
      },
      "name": "string",
      "owner": {
        "type": "string",
        "created_on": "string",
        "display_name": "string",
        "links": {
          "avatar": {
            "href": "string"
          },
          "followers": {
            "href": "string"
          },
          "following": {
            "href": "string"
          },
          "html": {
            "href": "string"
          },
          "repositories": {
            "href": "string"
          },
          "self": {
            "href": "string"
          }
        },
        "username": "string",
        "uuid": "string",
        "website": "string"
      },
      "updated_on": "string",
      "uuid": "string"
    },
    {
      "type": "string",
      "created_on": "string",
      "description": "string",
      "is_private": true,
      "key": "string",
      "links": {
        "avatar": {
          "href": "string"
        },
        "html": {
          "href": "string"
        }
      },
      "name": "string",
      "owner": {
        "type": "string",
        "created_on": "string",
        "display_name": "string",
        "links": {
          "avatar": {
            "href": "string"
          },
          "followers": {
            "href": "string"
          },
          "following": {
            "href": "string"
          },
          "html": {
            "href": "string"
          },
          "repositories": {
            "href": "string"
          },
          "self": {
            "href": "string"
          }
        },
        "username": "string",
        "uuid": "string",
        "website": "string"
      },
      "updated_on": "string",
      "uuid": "string"
    }
  ]
}