{
  "type": "string",
  "hostname": "string",
  "public_key": {
    "type": "string",
    "key": "string",
    "key_type": "string",
    "md5_fingerprint": "string",
    "sha256_fingerprint": "string"
  },
  "uuid": "string"
}