{
  "type": "string",
  "created_on": "string",
  "description": "string",
  "key": "string",
  "links": {
    "commit": {
      "href": "string"
    },
    "self": {
      "href": "string"
    }
  },
  "name": "string",
  "refname": "string",
  "state": "FAILED",
  "updated_on": "string",
  "url": "string",
  "uuid": "string"
}