{
  "next": "string",
  "page": 10,
  "pagelen": 9,
  "previous": "string",
  "size": 1,
  "values": [
    {
      "type": "string",
      "links": {
        "html": {
          "href": "string"
        },
        "self": {
          "href": "string"
        }
      },
      "snippet": {
        "type": "string",
        "created_on": "string",
        "creator": {
          "type": "string",
          "created_on": "string",
          "display_name": "string",
          "links": {
            "avatar": {
              "href": "string"
            },
            "followers": {
              "href": "string"
            },
            "following": {
              "href": "string"
            },
            "html": {
              "href": "string"
            },
            "repositories": {
              "href": "string"
            },
            "self": {
              "href": "string"
            }
          },
          "username": "string",
          "uuid": "string",
          "website": "string"
        },
        "id": 3,
        "is_private": true,
        "owner": {
          "type": "string",
          "created_on": "string",
          "display_name": "string",
          "links": {
            "avatar": {
              "href": "string"
            },
            "followers": {
              "href": "string"
            },
            "following": {
              "href": "string"
            },
            "html": {
              "href": "string"
            },
            "repositories": {
              "href": "string"
            },
            "self": {
              "href": "string"
            }
          },
          "username": "string",
          "uuid": "string",
          "website": "string"
        },
        "scm": "git",
        "title": "string",
        "updated_on": "string"
      }
    },
    {
      "type": "string",
      "links": {
        "html": {
          "href": "string"
        },
        "self": {
          "href": "string"
        }
      },
      "snippet": {
        "type": "string",
        "created_on": "string",
        "creator": {
          "type": "string",
          "created_on": "string",
          "display_name": "string",
          "links": {
            "avatar": {
              "href": "string"
            },
            "followers": {
              "href": "string"
            },
            "following": {
              "href": "string"
            },
            "html": {
              "href": "string"
            },
            "repositories": {
              "href": "string"
            },
            "self": {
              "href": "string"
            }
          },
          "username": "string",
          "uuid": "string",
          "website": "string"
        },
        "id": 6,
        "is_private": false,
        "owner": {
          "type": "string",
          "created_on": "string",
          "display_name": "string",
          "links": {
            "avatar": {
              "href": "string"
            },
            "followers": {
              "href": "string"
            },
            "following": {
              "href": "string"
            },
            "html": {
              "href": "string"
            },
            "repositories": {
              "href": "string"
            },
            "self": {
              "href": "string"
            }
          },
          "username": "string",
          "uuid": "string",
          "website": "string"
        },
        "scm": "hg",
        "title": "string",
        "updated_on": "string"
      }
    },
    {
      "type": "string",
      "links": {
        "html": {
          "href": "string"
        },
        "self": {
          "href": "string"
        }
      },
      "snippet": {
        "type": "string",
        "created_on": "string",
        "creator": {
          "type": "string",
          "created_on": "string",
          "display_name": "string",
          "links": {
            "avatar": {
              "href": "string"
            },
            "followers": {
              "href": "string"
            },
            "following": {
              "href": "string"
            },
            "html": {
              "href": "string"
            },
            "repositories": {
              "href": "string"
            },
            "self": {
              "href": "string"
            }
          },
          "username": "string",
          "uuid": "string",
          "website": "string"
        },
        "id": 2,
        "is_private": false,
        "owner": {
          "type": "string",
          "created_on": "string",
          "display_name": "string",
          "links": {
            "avatar": {
              "href": "string"
            },
            "followers": {
              "href": "string"
            },
            "following": {
              "href": "string"
            },
            "html": {
              "href": "string"
            },
            "repositories": {
              "href": "string"
            },
            "self": {
              "href": "string"
            }
          },
          "username": "string",
          "uuid": "string",
          "website": "string"
        },
        "scm": "git",
        "title": "string",
        "updated_on": "string"
      }
    },
    {
      "type": "string",
      "links": {
        "html": {
          "href": "string"
        },
        "self": {
          "href": "string"
        }
      },
      "snippet": {
        "type": "string",
        "created_on": "string",
        "creator": {
          "type": "string",
          "created_on": "string",
          "display_name": "string",
          "links": {
            "avatar": {
              "href": "string"
            },
            "followers": {
              "href": "string"
            },
            "following": {
              "href": "string"
            },
            "html": {
              "href": "string"
            },
            "repositories": {
              "href": "string"
            },
            "self": {
              "href": "string"
            }
          },
          "username": "string",
          "uuid": "string",
          "website": "string"
        },
        "id": 1,
        "is_private": false,
        "owner": {
          "type": "string",
          "created_on": "string",
          "display_name": "string",
          "links": {
            "avatar": {
              "href": "string"
            },
            "followers": {
              "href": "string"
            },
            "following": {
              "href": "string"
            },
            "html": {
              "href": "string"
            },
            "repositories": {
              "href": "string"
            },
            "self": {
              "href": "string"
            }
          },
          "username": "string",
          "uuid": "string",
          "website": "string"
        },
        "scm": "hg",
        "title": "string",
        "updated_on": "string"
      }
    },
    {
      "type": "string",
      "links": {
        "html": {
          "href": "string"
        },
        "self": {
          "href": "string"
        }
      },
      "snippet": {
        "type": "string",
        "created_on": "string",
        "creator": {
          "type": "string",
          "created_on": "string",
          "display_name": "string",
          "links": {
            "avatar": {
              "href": "string"
            },
            "followers": {
              "href": "string"
            },
            "following": {
              "href": "string"
            },
            "html": {
              "href": "string"
            },
            "repositories": {
              "href": "string"
            },
            "self": {
              "href": "string"
            }
          },
          "username": "string",
          "uuid": "string",
          "website": "string"
        },
        "id": 1,
        "is_private": false,
        "owner": {
          "type": "string",
          "created_on": "string",
          "display_name": "string",
          "links": {
            "avatar": {
              "href": "string"
            },
            "followers": {
              "href": "string"
            },
            "following": {
              "href": "string"
            },
            "html": {
              "href": "string"
            },
            "repositories": {
              "href": "string"
            },
            "self": {
              "href": "string"
            }
          },
          "username": "string",
          "uuid": "string",
          "website": "string"
        },
        "scm": "hg",
        "title": "string",
        "updated_on": "string"
      }
    },
    {
      "type": "string",
      "links": {
        "html": {
          "href": "string"
        },
        "self": {
          "href": "string"
        }
      },
      "snippet": {
        "type": "string",
        "created_on": "string",
        "creator": {
          "type": "string",
          "created_on": "string",
          "display_name": "string",
          "links": {
            "avatar": {
              "href": "string"
            },
            "followers": {
              "href": "string"
            },
            "following": {
              "href": "string"
            },
            "html": {
              "href": "string"
            },
            "repositories": {
              "href": "string"
            },
            "self": {
              "href": "string"
            }
          },
          "username": "string",
          "uuid": "string",
          "website": "string"
        },
        "id": 4,
        "is_private": true,
        "owner": {
          "type": "string",
          "created_on": "string",
          "display_name": "string",
          "links": {
            "avatar": {
              "href": "string"
            },
            "followers": {
              "href": "string"
            },
            "following": {
              "href": "string"
            },
            "html": {
              "href": "string"
            },
            "repositories": {
              "href": "string"
            },
            "self": {
              "href": "string"
            }
          },
          "username": "string",
          "uuid": "string",
          "website": "string"
        },
        "scm": "hg",
        "title": "string",
        "updated_on": "string"
      }
    },
    {
      "type": "string",
      "links": {
        "html": {
          "href": "string"
        },
        "self": {
          "href": "string"
        }
      },
      "snippet": {
        "type": "string",
        "created_on": "string",
        "creator": {
          "type": "string",
          "created_on": "string",
          "display_name": "string",
          "links": {
            "avatar": {
              "href": "string"
            },
            "followers": {
              "href": "string"
            },
            "following": {
              "href": "string"
            },
            "html": {
              "href": "string"
            },
            "repositories": {
              "href": "string"
            },
            "self": {
              "href": "string"
            }
          },
          "username": "string",
          "uuid": "string",
          "website": "string"
        },
        "id": 1,
        "is_private": true,
        "owner": {
          "type": "string",
          "created_on": "string",
          "display_name": "string",
          "links": {
            "avatar": {
              "href": "string"
            },
            "followers": {
              "href": "string"
            },
            "following": {
              "href": "string"
            },
            "html": {
              "href": "string"
            },
            "repositories": {
              "href": "string"
            },
            "self": {
              "href": "string"
            }
          },
          "username": "string",
          "uuid": "string",
          "website": "string"
        },
        "scm": "git",
        "title": "string",
        "updated_on": "string"
      }
    },
    {
      "type": "string",
      "links": {
        "html": {
          "href": "string"
        },
        "self": {
          "href": "string"
        }
      },
      "snippet": {
        "type": "string",
        "created_on": "string",
        "creator": {
          "type": "string",
          "created_on": "string",
          "display_name": "string",
          "links": {
            "avatar": {
              "href": "string"
            },
            "followers": {
              "href": "string"
            },
            "following": {
              "href": "string"
            },
            "html": {
              "href": "string"
            },
            "repositories": {
              "href": "string"
            },
            "self": {
              "href": "string"
            }
          },
          "username": "string",
          "uuid": "string",
          "website": "string"
        },
        "id": 6,
        "is_private": true,
        "owner": {
          "type": "string",
          "created_on": "string",
          "display_name": "string",
          "links": {
            "avatar": {
              "href": "string"
            },
            "followers": {
              "href": "string"
            },
            "following": {
              "href": "string"
            },
            "html": {
              "href": "string"
            },
            "repositories": {
              "href": "string"
            },
            "self": {
              "href": "string"
            }
          },
          "username": "string",
          "uuid": "string",
          "website": "string"
        },
        "scm": "hg",
        "title": "string",
        "updated_on": "string"
      }
    },
    {
      "type": "string",
      "links": {
        "html": {
          "href": "string"
        },
        "self": {
          "href": "string"
        }
      },
      "snippet": {
        "type": "string",
        "created_on": "string",
        "creator": {
          "type": "string",
          "created_on": "string",
          "display_name": "string",
          "links": {
            "avatar": {
              "href": "string"
            },
            "followers": {
              "href": "string"
            },
            "following": {
              "href": "string"
            },
            "html": {
              "href": "string"
            },
            "repositories": {
              "href": "string"
            },
            "self": {
              "href": "string"
            }
          },
          "username": "string",
          "uuid": "string",
          "website": "string"
        },
        "id": 5,
        "is_private": true,
        "owner": {
          "type": "string",
          "created_on": "string",
          "display_name": "string",
          "links": {
            "avatar": {
              "href": "string"
            },
            "followers": {
              "href": "string"
            },
            "following": {
              "href": "string"
            },
            "html": {
              "href": "string"
            },
            "repositories": {
              "href": "string"
            },
            "self": {
              "href": "string"
            }
          },
          "username": "string",
          "uuid": "string",
          "website": "string"
        },
        "scm": "git",
        "title": "string",
        "updated_on": "string"
      }
    },
    {
      "type": "string",
      "links": {
        "html": {
          "href": "string"
        },
        "self": {
          "href": "string"
        }
      },
      "snippet": {
        "type": "string",
        "created_on": "string",
        "creator": {
          "type": "string",
          "created_on": "string",
          "display_name": "string",
          "links": {
            "avatar": {
              "href": "string"
            },
            "followers": {
              "href": "string"
            },
            "following": {
              "href": "string"
            },
            "html": {
              "href": "string"
            },
            "repositories": {
              "href": "string"
            },
            "self": {
              "href": "string"
            }
          },
          "username": "string",
          "uuid": "string",
          "website": "string"
        },
        "id": 5,
        "is_private": false,
        "owner": {
          "type": "string",
          "created_on": "string",
          "display_name": "string",
          "links": {
            "avatar": {
              "href": "string"
            },
            "followers": {
              "href": "string"
            },
            "following": {
              "href": "string"
            },
            "html": {
              "href": "string"
            },
            "repositories": {
              "href": "string"
            },
            "self": {
              "href": "string"
            }
          },
          "username": "string",
          "uuid": "string",
          "website": "string"
        },
        "scm": "hg",
        "title": "string",
        "updated_on": "string"
      }
    }
  ]
}