{
  "next": "string",
  "page": 3,
  "pagelen": 4,
  "previous": "string",
  "size": 5,
  "values": [
    {
      "type": "string",
      "created_on": "string",
      "display_name": "string",
      "links": {
        "avatar": {
          "href": "string"
        },
        "followers": {
          "href": "string"
        },
        "following": {
          "href": "string"
        },
        "html": {
          "href": "string"
        },
        "repositories": {
          "href": "string"
        },
        "self": {
          "href": "string"
        }
      },
      "username": "string",
      "uuid": "string",
      "website": "string"
    },
    {
      "type": "string",
      "created_on": "string",
      "display_name": "string",
      "links": {
        "avatar": {
          "href": "string"
        },
        "followers": {
          "href": "string"
        },
        "following": {
          "href": "string"
        },
        "html": {
          "href": "string"
        },
        "repositories": {
          "href": "string"
        },
        "self": {
          "href": "string"
        }
      },
      "username": "string",
      "uuid": "string",
      "website": "string"
    },
    {
      "type": "string",
      "created_on": "string",
      "display_name": "string",
      "links": {
        "avatar": {
          "href": "string"
        },
        "followers": {
          "href": "string"
        },
        "following": {
          "href": "string"
        },
        "html": {
          "href": "string"
        },
        "repositories": {
          "href": "string"
        },
        "self": {
          "href": "string"
        }
      },
      "username": "string",
      "uuid": "string",
      "website": "string"
    },
    {
      "type": "string",
      "created_on": "string",
      "display_name": "string",
      "links": {
        "avatar": {
          "href": "string"
        },
        "followers": {
          "href": "string"
        },
        "following": {
          "href": "string"
        },
        "html": {
          "href": "string"
        },
        "repositories": {
          "href": "string"
        },
        "self": {
          "href": "string"
        }
      },
      "username": "string",
      "uuid": "string",
      "website": "string"
    },
    {
      "type": "string",
      "created_on": "string",
      "display_name": "string",
      "links": {
        "avatar": {
          "href": "string"
        },
        "followers": {
          "href": "string"
        },
        "following": {
          "href": "string"
        },
        "html": {
          "href": "string"
        },
        "repositories": {
          "href": "string"
        },
        "self": {
          "href": "string"
        }
      },
      "username": "string",
      "uuid": "string",
      "website": "string"
    },
    {
      "type": "string",
      "created_on": "string",
      "display_name": "string",
      "links": {
        "avatar": {
          "href": "string"
        },
        "followers": {
          "href": "string"
        },
        "following": {
          "href": "string"
        },
        "html": {
          "href": "string"
        },
        "repositories": {
          "href": "string"
        },
        "self": {
          "href": "string"
        }
      },
      "username": "string",
      "uuid": "string",
      "website": "string"
    },
    {
      "type": "string",
      "created_on": "string",
      "display_name": "string",
      "links": {
        "avatar": {
          "href": "string"
        },
        "followers": {
          "href": "string"
        },
        "following": {
          "href": "string"
        },
        "html": {
          "href": "string"
        },
        "repositories": {
          "href": "string"
        },
        "self": {
          "href": "string"
        }
      },
      "username": "string",
      "uuid": "string",
      "website": "string"
    },
    {
      "type": "string",
      "created_on": "string",
      "display_name": "string",
      "links": {
        "avatar": {
          "href": "string"
        },
        "followers": {
          "href": "string"
        },
        "following": {
          "href": "string"
        },
        "html": {
          "href": "string"
        },
        "repositories": {
          "href": "string"
        },
        "self": {
          "href": "string"
        }
      },
      "username": "string",
      "uuid": "string",
      "website": "string"
    },
    {
      "type": "string",
      "created_on": "string",
      "display_name": "string",
      "links": {
        "avatar": {
          "href": "string"
        },
        "followers": {
          "href": "string"
        },
        "following": {
          "href": "string"
        },
        "html": {
          "href": "string"
        },
        "repositories": {
          "href": "string"
        },
        "self": {
          "href": "string"
        }
      },
      "username": "string",
      "uuid": "string",
      "website": "string"
    },
    {
      "type": "string",
      "created_on": "string",
      "display_name": "string",
      "links": {
        "avatar": {
          "href": "string"
        },
        "followers": {
          "href": "string"
        },
        "following": {
          "href": "string"
        },
        "html": {
          "href": "string"
        },
        "repositories": {
          "href": "string"
        },
        "self": {
          "href": "string"
        }
      },
      "username": "string",
      "uuid": "string",
      "website": "string"
    }
  ]
}