{
  "next": "string",
  "page": 8,
  "pagelen": 9,
  "previous": "string",
  "size": 10,
  "values": [
    {
      "type": "string",
      "hostname": "string",
      "public_key": {
        "type": "string",
        "key": "string",
        "key_type": "string",
        "md5_fingerprint": "string",
        "sha256_fingerprint": "string"
      },
      "uuid": "string"
    },
    {
      "type": "string",
      "hostname": "string",
      "public_key": {
        "type": "string",
        "key": "string",
        "key_type": "string",
        "md5_fingerprint": "string",
        "sha256_fingerprint": "string"
      },
      "uuid": "string"
    },
    {
      "type": "string",
      "hostname": "string",
      "public_key": {
        "type": "string",
        "key": "string",
        "key_type": "string",
        "md5_fingerprint": "string",
        "sha256_fingerprint": "string"
      },
      "uuid": "string"
    },
    {
      "type": "string",
      "hostname": "string",
      "public_key": {
        "type": "string",
        "key": "string",
        "key_type": "string",
        "md5_fingerprint": "string",
        "sha256_fingerprint": "string"
      },
      "uuid": "string"
    },
    {
      "type": "string",
      "hostname": "string",
      "public_key": {
        "type": "string",
        "key": "string",
        "key_type": "string",
        "md5_fingerprint": "string",
        "sha256_fingerprint": "string"
      },
      "uuid": "string"
    },
    {
      "type": "string",
      "hostname": "string",
      "public_key": {
        "type": "string",
        "key": "string",
        "key_type": "string",
        "md5_fingerprint": "string",
        "sha256_fingerprint": "string"
      },
      "uuid": "string"
    }
  ]
}