{
  "type": "string",
  "groups": [
    {
      "type": "string",
      "full_slug": "string",
      "links": {
        "html": {
          "href": "string"
        },
        "self": {
          "href": "string"
        }
      },
      "members": 10,
      "name": "string",
      "owner": {
        "type": "string",
        "created_on": "string",
        "display_name": "string",
        "links": {
          "avatar": {
            "href": "string"
          },
          "followers": {
            "href": "string"
          },
          "following": {
            "href": "string"
          },
          "html": {
            "href": "string"
          },
          "repositories": {
            "href": "string"
          },
          "self": {
            "href": "string"
          }
        },
        "username": "string",
        "uuid": "string",
        "website": "string"
      },
      "slug": "string"
    },
    {
      "type": "string",
      "full_slug": "string",
      "links": {
        "html": {
          "href": "string"
        },
        "self": {
          "href": "string"
        }
      },
      "members": 2,
      "name": "string",
      "owner": {
        "type": "string",
        "created_on": "string",
        "display_name": "string",
        "links": {
          "avatar": {
            "href": "string"
          },
          "followers": {
            "href": "string"
          },
          "following": {
            "href": "string"
          },
          "html": {
            "href": "string"
          },
          "repositories": {
            "href": "string"
          },
          "self": {
            "href": "string"
          }
        },
        "username": "string",
        "uuid": "string",
        "website": "string"
      },
      "slug": "string"
    },
    {
      "type": "string",
      "full_slug": "string",
      "links": {
        "html": {
          "href": "string"
        },
        "self": {
          "href": "string"
        }
      },
      "members": 7,
      "name": "string",
      "owner": {
        "type": "string",
        "created_on": "string",
        "display_name": "string",
        "links": {
          "avatar": {
            "href": "string"
          },
          "followers": {
            "href": "string"
          },
          "following": {
            "href": "string"
          },
          "html": {
            "href": "string"
          },
          "repositories": {
            "href": "string"
          },
          "self": {
            "href": "string"
          }
        },
        "username": "string",
        "uuid": "string",
        "website": "string"
      },
      "slug": "string"
    },
    {
      "type": "string",
      "full_slug": "string",
      "links": {
        "html": {
          "href": "string"
        },
        "self": {
          "href": "string"
        }
      },
      "members": 1,
      "name": "string",
      "owner": {
        "type": "string",
        "created_on": "string",
        "display_name": "string",
        "links": {
          "avatar": {
            "href": "string"
          },
          "followers": {
            "href": "string"
          },
          "following": {
            "href": "string"
          },
          "html": {
            "href": "string"
          },
          "repositories": {
            "href": "string"
          },
          "self": {
            "href": "string"
          }
        },
        "username": "string",
        "uuid": "string",
        "website": "string"
      },
      "slug": "string"
    },
    {
      "type": "string",
      "full_slug": "string",
      "links": {
        "html": {
          "href": "string"
        },
        "self": {
          "href": "string"
        }
      },
      "members": 8,
      "name": "string",
      "owner": {
        "type": "string",
        "created_on": "string",
        "display_name": "string",
        "links": {
          "avatar": {
            "href": "string"
          },
          "followers": {
            "href": "string"
          },
          "following": {
            "href": "string"
          },
          "html": {
            "href": "string"
          },
          "repositories": {
            "href": "string"
          },
          "self": {
            "href": "string"
          }
        },
        "username": "string",
        "uuid": "string",
        "website": "string"
      },
      "slug": "string"
    },
    {
      "type": "string",
      "full_slug": "string",
      "links": {
        "html": {
          "href": "string"
        },
        "self": {
          "href": "string"
        }
      },
      "members": 7,
      "name": "string",
      "owner": {
        "type": "string",
        "created_on": "string",
        "display_name": "string",
        "links": {
          "avatar": {
            "href": "string"
          },
          "followers": {
            "href": "string"
          },
          "following": {
            "href": "string"
          },
          "html": {
            "href": "string"
          },
          "repositories": {
            "href": "string"
          },
          "self": {
            "href": "string"
          }
        },
        "username": "string",
        "uuid": "string",
        "website": "string"
      },
      "slug": "string"
    },
    {
      "type": "string",
      "full_slug": "string",
      "links": {
        "html": {
          "href": "string"
        },
        "self": {
          "href": "string"
        }
      },
      "members": 6,
      "name": "string",
      "owner": {
        "type": "string",
        "created_on": "string",
        "display_name": "string",
        "links": {
          "avatar": {
            "href": "string"
          },
          "followers": {
            "href": "string"
          },
          "following": {
            "href": "string"
          },
          "html": {
            "href": "string"
          },
          "repositories": {
            "href": "string"
          },
          "self": {
            "href": "string"
          }
        },
        "username": "string",
        "uuid": "string",
        "website": "string"
      },
      "slug": "string"
    }
  ],
  "id": 8,
  "kind": "push",
  "links": {
    "self": {
      "href": "string"
    }
  },
  "users": [
    {
      "type": "string",
      "created_on": "string",
      "display_name": "string",
      "links": {
        "avatar": {
          "href": "string"
        },
        "followers": {
          "href": "string"
        },
        "following": {
          "href": "string"
        },
        "html": {
          "href": "string"
        },
        "repositories": {
          "href": "string"
        },
        "self": {
          "href": "string"
        }
      },
      "username": "string",
      "uuid": "string",
      "website": "string"
    },
    {
      "type": "string",
      "created_on": "string",
      "display_name": "string",
      "links": {
        "avatar": {
          "href": "string"
        },
        "followers": {
          "href": "string"
        },
        "following": {
          "href": "string"
        },
        "html": {
          "href": "string"
        },
        "repositories": {
          "href": "string"
        },
        "self": {
          "href": "string"
        }
      },
      "username": "string",
      "uuid": "string",
      "website": "string"
    },
    {
      "type": "string",
      "created_on": "string",
      "display_name": "string",
      "links": {
        "avatar": {
          "href": "string"
        },
        "followers": {
          "href": "string"
        },
        "following": {
          "href": "string"
        },
        "html": {
          "href": "string"
        },
        "repositories": {
          "href": "string"
        },
        "self": {
          "href": "string"
        }
      },
      "username": "string",
      "uuid": "string",
      "website": "string"
    }
  ],
  "value": 7
}