{
  "$id": "schema.json",
  "type": "object",
  "schema": "http://json-schema.org/draft-07/schema#",
  "translate": true,
  "dynamicfields": true,
  "properties": {
    "ph_request_type": {
      "type": "string",
      "description": "type of request (internal to adapter)",
      "default": "getRepositoriesUsernameRepoSlugHooks",
      "enum": [
        "getRepositoriesUsernameRepoSlugHooks",
        "postRepositoriesUsernameRepoSlugHooks",
        "deleteRepositoriesUsernameRepoSlugHooksUid",
        "getRepositoriesUsernameRepoSlugHooksUid",
        "putRepositoriesUsernameRepoSlugHooksUid",
        "getRepositories",
        "getRepositoriesUsername",
        "deleteRepositoriesUsernameRepoSlug",
        "getRepositoriesUsernameRepoSlug",
        "postRepositoriesUsernameRepoSlug",
        "postRepositoriesUsernameRepoSlugSrc",
        "putRepositoriesUsernameRepoSlug",
        "getRepositoriesUsernameRepoSlugCommitNodeStatuses",
        "postRepositoriesUsernameRepoSlugCommitNodeStatusesBuild",
        "getRepositoriesUsernameRepoSlugCommitNodeStatusesBuildKey",
        "putRepositoriesUsernameRepoSlugCommitNodeStatusesBuildKey",
        "getRepositoriesUsernameRepoSlugForks",
        "getRepositoriesUsernameRepoSlugPullrequestsPullRequestIdStatuses",
        "getRepositoriesUsernameRepoSlugWatchers",
        "CreateACommitByUploadingAFile"
      ],
      "external_name": "ph_request_type"
    },
    "repoSlug": {
      "description": "",
      "parse": false,
      "encode": false,
      "encrypt": {
        "type": "AES",
        "key": ""
      },
      "external_name": "repo_slug"
    },
    "body": {
      "description": "The updated build status object",
      "parse": false,
      "encode": false,
      "encrypt": {
        "type": "AES",
        "key": ""
      },
      "external_name": "_body"
    },
    "pullRequestId": {
      "description": "The pull request&#39;s id",
      "parse": false,
      "encode": false,
      "encrypt": {
        "type": "AES",
        "key": ""
      },
      "external_name": "pull_request_id"
    }
  },
  "definitions": {}
}