{
  "actions": [
    {
      "name": "pullRequestReviewersCreatePullRequestReviewers",
      "protocol": "REST",
      "method": "POST",
      "entitypath": "{base_path}/{version}/{pathv1}/{pathv2}/_apis/git/repositories/{pathv3}/pullRequests/{pathv4}/reviewers?{query}",
      "requestSchema": "schema.json",
      "responseSchema": "schema.json",
      "timeout": 0,
      "sendEmpty": false,
      "requestDatatype": "JSON",
      "responseDatatype": "JSON",
      "headers": {},
      "responseObjects": [
        {
          "type": "default",
          "key": "",
          "mockFile": "mockdatafiles/pullRequestReviewersCreatePullRequestReviewers-default.json"
        }
      ]
    },
    {
      "name": "pullRequestReviewersCreateUnmaterializedPullRequestReviewer",
      "protocol": "REST",
      "method": "PUT",
      "entitypath": "{base_path}/{version}/{pathv1}/{pathv2}/_apis/git/repositories/{pathv3}/pullRequests/{pathv4}/reviewers?{query}",
      "requestSchema": "schema.json",
      "responseSchema": "schema.json",
      "timeout": 0,
      "sendEmpty": false,
      "requestDatatype": "JSON",
      "responseDatatype": "JSON",
      "headers": {},
      "responseObjects": [
        {
          "type": "default",
          "key": "",
          "mockFile": ""
        }
      ]
    },
    {
      "name": "pullRequestReviewersList",
      "protocol": "REST",
      "method": "GET",
      "entitypath": "{base_path}/{version}/{pathv1}/{pathv2}/_apis/git/repositories/{pathv3}/pullRequests/{pathv4}/reviewers?{query}",
      "requestSchema": "schema.json",
      "responseSchema": "schema.json",
      "timeout": 0,
      "sendEmpty": false,
      "sendGetBody": false,
      "requestDatatype": "JSON",
      "responseDatatype": "JSON",
      "headers": {},
      "responseObjects": [
        {
          "type": "default",
          "key": "",
          "mockFile": "mockdatafiles/pullRequestReviewersList-default.json"
        }
      ]
    },
    {
      "name": "pullRequestReviewersUpdatePullRequestReviewers",
      "protocol": "REST",
      "method": "PATCH",
      "entitypath": "{base_path}/{version}/{pathv1}/{pathv2}/_apis/git/repositories/{pathv3}/pullRequests/{pathv4}/reviewers?{query}",
      "requestSchema": "schema.json",
      "responseSchema": "schema.json",
      "timeout": 0,
      "sendEmpty": false,
      "requestDatatype": "JSON",
      "responseDatatype": "JSON",
      "headers": {},
      "responseObjects": [
        {
          "type": "default",
          "key": "",
          "mockFile": ""
        }
      ]
    },
    {
      "name": "pullRequestReviewersCreatePullRequestReviewer",
      "protocol": "REST",
      "method": "PUT",
      "entitypath": "{base_path}/{version}/{pathv1}/{pathv2}/_apis/git/repositories/{pathv3}/pullRequests/{pathv4}/reviewers/{pathv5}?{query}",
      "requestSchema": "schema.json",
      "responseSchema": "schema.json",
      "timeout": 0,
      "sendEmpty": false,
      "requestDatatype": "JSON",
      "responseDatatype": "JSON",
      "headers": {},
      "responseObjects": [
        {
          "type": "default",
          "key": "",
          "mockFile": ""
        }
      ]
    },
    {
      "name": "pullRequestReviewersDelete",
      "protocol": "REST",
      "method": "DELETE",
      "entitypath": "{base_path}/{version}/{pathv1}/{pathv2}/_apis/git/repositories/{pathv3}/pullRequests/{pathv4}/reviewers/{pathv5}?{query}",
      "requestSchema": "schema.json",
      "responseSchema": "schema.json",
      "timeout": 0,
      "sendEmpty": false,
      "requestDatatype": "JSON",
      "responseDatatype": "JSON",
      "headers": {},
      "responseObjects": [
        {
          "type": "default",
          "key": "",
          "mockFile": ""
        }
      ]
    },
    {
      "name": "pullRequestReviewersGet",
      "protocol": "REST",
      "method": "GET",
      "entitypath": "{base_path}/{version}/{pathv1}/{pathv2}/_apis/git/repositories/{pathv3}/pullRequests/{pathv4}/reviewers/{pathv5}?{query}",
      "requestSchema": "schema.json",
      "responseSchema": "schema.json",
      "timeout": 0,
      "sendEmpty": false,
      "sendGetBody": false,
      "requestDatatype": "JSON",
      "responseDatatype": "JSON",
      "headers": {},
      "responseObjects": [
        {
          "type": "default",
          "key": "",
          "mockFile": ""
        }
      ]
    },
    {
      "name": "pullRequestReviewersUpdatePullRequestReviewer",
      "protocol": "REST",
      "method": "PATCH",
      "entitypath": "{base_path}/{version}/{pathv1}/{pathv2}/_apis/git/repositories/{pathv3}/pullRequests/{pathv4}/reviewers/{pathv5}?{query}",
      "requestSchema": "schema.json",
      "responseSchema": "schema.json",
      "timeout": 0,
      "sendEmpty": false,
      "requestDatatype": "JSON",
      "responseDatatype": "JSON",
      "headers": {},
      "responseObjects": [
        {
          "type": "default",
          "key": "",
          "mockFile": ""
        }
      ]
    }
  ]
}