{
  "actions": [
    {
      "name": "pullRequestIterationsList",
      "protocol": "REST",
      "method": "GET",
      "entitypath": "{base_path}/{version}/{pathv1}/{pathv2}/_apis/git/repositories/{pathv3}/pullRequests/{pathv4}/iterations?{query}",
      "requestSchema": "schema.json",
      "responseSchema": "schema.json",
      "timeout": 0,
      "sendEmpty": false,
      "sendGetBody": false,
      "requestDatatype": "JSON",
      "responseDatatype": "JSON",
      "headers": {},
      "responseObjects": [
        {
          "type": "default",
          "key": "",
          "mockFile": "mockdatafiles/pullRequestIterationsList-default.json"
        }
      ]
    },
    {
      "name": "pullRequestIterationsGet",
      "protocol": "REST",
      "method": "GET",
      "entitypath": "{base_path}/{version}/{pathv1}/{pathv2}/_apis/git/repositories/{pathv3}/pullRequests/{pathv4}/iterations/{pathv5}?{query}",
      "requestSchema": "schema.json",
      "responseSchema": "schema.json",
      "timeout": 0,
      "sendEmpty": false,
      "sendGetBody": false,
      "requestDatatype": "JSON",
      "responseDatatype": "JSON",
      "headers": {},
      "responseObjects": [
        {
          "type": "default",
          "key": "",
          "mockFile": ""
        }
      ]
    }
  ]
}