[
  {
    "collection": {
      "id": "string",
      "name": "string",
      "url": "string"
    },
    "id": "string",
    "isFork": false,
    "name": "string",
    "project": {
      "abbreviation": "string",
      "defaultTeamImageUrl": "string",
      "description": "string",
      "id": "string",
      "lastUpdateTime": "string",
      "name": "string",
      "revision": 5,
      "state": "all",
      "url": "string",
      "visibility": "private"
    },
    "remoteUrl": "string",
    "sshUrl": "string",
    "url": "string"
  },
  {
    "collection": {
      "id": "string",
      "name": "string",
      "url": "string"
    },
    "id": "string",
    "isFork": true,
    "name": "string",
    "project": {
      "abbreviation": "string",
      "defaultTeamImageUrl": "string",
      "description": "string",
      "id": "string",
      "lastUpdateTime": "string",
      "name": "string",
      "revision": 9,
      "state": "all",
      "url": "string",
      "visibility": "public"
    },
    "remoteUrl": "string",
    "sshUrl": "string",
    "url": "string"
  },
  {
    "collection": {
      "id": "string",
      "name": "string",
      "url": "string"
    },
    "id": "string",
    "isFork": false,
    "name": "string",
    "project": {
      "abbreviation": "string",
      "defaultTeamImageUrl": "string",
      "description": "string",
      "id": "string",
      "lastUpdateTime": "string",
      "name": "string",
      "revision": 3,
      "state": "deleted",
      "url": "string",
      "visibility": "private"
    },
    "remoteUrl": "string",
    "sshUrl": "string",
    "url": "string"
  },
  {
    "collection": {
      "id": "string",
      "name": "string",
      "url": "string"
    },
    "id": "string",
    "isFork": false,
    "name": "string",
    "project": {
      "abbreviation": "string",
      "defaultTeamImageUrl": "string",
      "description": "string",
      "id": "string",
      "lastUpdateTime": "string",
      "name": "string",
      "revision": 10,
      "state": "wellFormed",
      "url": "string",
      "visibility": "private"
    },
    "remoteUrl": "string",
    "sshUrl": "string",
    "url": "string"
  }
]