[
  {
    "_links": {
      "links": {}
    },
    "author": {
      "date": "string",
      "email": "string",
      "imageUrl": "string",
      "name": "string"
    },
    "changeCounts": {},
    "changes": [
      {
        "changeType": "none",
        "item": "string",
        "newContent": {
          "content": "string",
          "contentType": "base64Encoded"
        },
        "sourceServerItem": "string",
        "url": "string"
      },
      {
        "changeType": "lock",
        "item": "string",
        "newContent": {
          "content": "string",
          "contentType": "rawText"
        },
        "sourceServerItem": "string",
        "url": "string"
      },
      {
        "changeType": "undelete",
        "item": "string",
        "newContent": {
          "content": "string",
          "contentType": "rawText"
        },
        "sourceServerItem": "string",
        "url": "string"
      },
      {
        "changeType": "property",
        "item": "string",
        "newContent": {
          "content": "string",
          "contentType": "base64Encoded"
        },
        "sourceServerItem": "string",
        "url": "string"
      },
      {
        "changeType": "branch",
        "item": "string",
        "newContent": {
          "content": "string",
          "contentType": "base64Encoded"
        },
        "sourceServerItem": "string",
        "url": "string"
      },
      {
        "changeType": "branch",
        "item": "string",
        "newContent": {
          "content": "string",
          "contentType": "base64Encoded"
        },
        "sourceServerItem": "string",
        "url": "string"
      }
    ],
    "comment": "string",
    "commentTruncated": false,
    "commitId": "string",
    "committer": {
      "date": "string",
      "email": "string",
      "imageUrl": "string",
      "name": "string"
    },
    "parents": [
      "string",
      "string",
      "string",
      "string",
      "string",
      "string",
      "string",
      "string",
      "string"
    ],
    "push": {
      "_links": {
        "links": {}
      },
      "date": "string",
      "pushedBy": {
        "_links": {
          "links": {}
        },
        "descriptor": "string",
        "displayName": "string",
        "url": "string"
      },
      "pushId": 2,
      "url": "string"
    },
    "remoteUrl": "string",
    "statuses": [
      {
        "_links": {
          "links": {}
        },
        "context": {
          "genre": "string",
          "name": "string"
        },
        "createdBy": {
          "_links": {
            "links": {}
          },
          "descriptor": "string",
          "displayName": "string",
          "url": "string"
        },
        "creationDate": "string",
        "description": "string",
        "id": 1,
        "state": "pending",
        "targetUrl": "string",
        "updatedDate": "string"
      },
      {
        "_links": {
          "links": {}
        },
        "context": {
          "genre": "string",
          "name": "string"
        },
        "createdBy": {
          "_links": {
            "links": {}
          },
          "descriptor": "string",
          "displayName": "string",
          "url": "string"
        },
        "creationDate": "string",
        "description": "string",
        "id": 6,
        "state": "notApplicable",
        "targetUrl": "string",
        "updatedDate": "string"
      },
      {
        "_links": {
          "links": {}
        },
        "context": {
          "genre": "string",
          "name": "string"
        },
        "createdBy": {
          "_links": {
            "links": {}
          },
          "descriptor": "string",
          "displayName": "string",
          "url": "string"
        },
        "creationDate": "string",
        "description": "string",
        "id": 7,
        "state": "pending",
        "targetUrl": "string",
        "updatedDate": "string"
      },
      {
        "_links": {
          "links": {}
        },
        "context": {
          "genre": "string",
          "name": "string"
        },
        "createdBy": {
          "_links": {
            "links": {}
          },
          "descriptor": "string",
          "displayName": "string",
          "url": "string"
        },
        "creationDate": "string",
        "description": "string",
        "id": 9,
        "state": "error",
        "targetUrl": "string",
        "updatedDate": "string"
      },
      {
        "_links": {
          "links": {}
        },
        "context": {
          "genre": "string",
          "name": "string"
        },
        "createdBy": {
          "_links": {
            "links": {}
          },
          "descriptor": "string",
          "displayName": "string",
          "url": "string"
        },
        "creationDate": "string",
        "description": "string",
        "id": 8,
        "state": "error",
        "targetUrl": "string",
        "updatedDate": "string"
      },
      {
        "_links": {
          "links": {}
        },
        "context": {
          "genre": "string",
          "name": "string"
        },
        "createdBy": {
          "_links": {
            "links": {}
          },
          "descriptor": "string",
          "displayName": "string",
          "url": "string"
        },
        "creationDate": "string",
        "description": "string",
        "id": 1,
        "state": "error",
        "targetUrl": "string",
        "updatedDate": "string"
      },
      {
        "_links": {
          "links": {}
        },
        "context": {
          "genre": "string",
          "name": "string"
        },
        "createdBy": {
          "_links": {
            "links": {}
          },
          "descriptor": "string",
          "displayName": "string",
          "url": "string"
        },
        "creationDate": "string",
        "description": "string",
        "id": 6,
        "state": "succeeded",
        "targetUrl": "string",
        "updatedDate": "string"
      },
      {
        "_links": {
          "links": {}
        },
        "context": {
          "genre": "string",
          "name": "string"
        },
        "createdBy": {
          "_links": {
            "links": {}
          },
          "descriptor": "string",
          "displayName": "string",
          "url": "string"
        },
        "creationDate": "string",
        "description": "string",
        "id": 4,
        "state": "failed",
        "targetUrl": "string",
        "updatedDate": "string"
      },
      {
        "_links": {
          "links": {}
        },
        "context": {
          "genre": "string",
          "name": "string"
        },
        "createdBy": {
          "_links": {
            "links": {}
          },
          "descriptor": "string",
          "displayName": "string",
          "url": "string"
        },
        "creationDate": "string",
        "description": "string",
        "id": 7,
        "state": "error",
        "targetUrl": "string",
        "updatedDate": "string"
      }
    ],
    "url": "string",
    "workItems": [
      {
        "id": "string",
        "url": "string"
      }
    ]
  },
  {
    "_links": {
      "links": {}
    },
    "author": {
      "date": "string",
      "email": "string",
      "imageUrl": "string",
      "name": "string"
    },
    "changeCounts": {},
    "changes": [
      {
        "changeType": "undelete",
        "item": "string",
        "newContent": {
          "content": "string",
          "contentType": "rawText"
        },
        "sourceServerItem": "string",
        "url": "string"
      },
      {
        "changeType": "sourceRename",
        "item": "string",
        "newContent": {
          "content": "string",
          "contentType": "base64Encoded"
        },
        "sourceServerItem": "string",
        "url": "string"
      },
      {
        "changeType": "sourceRename",
        "item": "string",
        "newContent": {
          "content": "string",
          "contentType": "rawText"
        },
        "sourceServerItem": "string",
        "url": "string"
      },
      {
        "changeType": "sourceRename",
        "item": "string",
        "newContent": {
          "content": "string",
          "contentType": "rawText"
        },
        "sourceServerItem": "string",
        "url": "string"
      },
      {
        "changeType": "encoding",
        "item": "string",
        "newContent": {
          "content": "string",
          "contentType": "base64Encoded"
        },
        "sourceServerItem": "string",
        "url": "string"
      },
      {
        "changeType": "rename",
        "item": "string",
        "newContent": {
          "content": "string",
          "contentType": "rawText"
        },
        "sourceServerItem": "string",
        "url": "string"
      },
      {
        "changeType": "targetRename",
        "item": "string",
        "newContent": {
          "content": "string",
          "contentType": "base64Encoded"
        },
        "sourceServerItem": "string",
        "url": "string"
      },
      {
        "changeType": "edit",
        "item": "string",
        "newContent": {
          "content": "string",
          "contentType": "base64Encoded"
        },
        "sourceServerItem": "string",
        "url": "string"
      },
      {
        "changeType": "undelete",
        "item": "string",
        "newContent": {
          "content": "string",
          "contentType": "rawText"
        },
        "sourceServerItem": "string",
        "url": "string"
      }
    ],
    "comment": "string",
    "commentTruncated": true,
    "commitId": "string",
    "committer": {
      "date": "string",
      "email": "string",
      "imageUrl": "string",
      "name": "string"
    },
    "parents": [
      "string",
      "string"
    ],
    "push": {
      "_links": {
        "links": {}
      },
      "date": "string",
      "pushedBy": {
        "_links": {
          "links": {}
        },
        "descriptor": "string",
        "displayName": "string",
        "url": "string"
      },
      "pushId": 2,
      "url": "string"
    },
    "remoteUrl": "string",
    "statuses": [
      {
        "_links": {
          "links": {}
        },
        "context": {
          "genre": "string",
          "name": "string"
        },
        "createdBy": {
          "_links": {
            "links": {}
          },
          "descriptor": "string",
          "displayName": "string",
          "url": "string"
        },
        "creationDate": "string",
        "description": "string",
        "id": 2,
        "state": "failed",
        "targetUrl": "string",
        "updatedDate": "string"
      },
      {
        "_links": {
          "links": {}
        },
        "context": {
          "genre": "string",
          "name": "string"
        },
        "createdBy": {
          "_links": {
            "links": {}
          },
          "descriptor": "string",
          "displayName": "string",
          "url": "string"
        },
        "creationDate": "string",
        "description": "string",
        "id": 3,
        "state": "notSet",
        "targetUrl": "string",
        "updatedDate": "string"
      },
      {
        "_links": {
          "links": {}
        },
        "context": {
          "genre": "string",
          "name": "string"
        },
        "createdBy": {
          "_links": {
            "links": {}
          },
          "descriptor": "string",
          "displayName": "string",
          "url": "string"
        },
        "creationDate": "string",
        "description": "string",
        "id": 10,
        "state": "notApplicable",
        "targetUrl": "string",
        "updatedDate": "string"
      },
      {
        "_links": {
          "links": {}
        },
        "context": {
          "genre": "string",
          "name": "string"
        },
        "createdBy": {
          "_links": {
            "links": {}
          },
          "descriptor": "string",
          "displayName": "string",
          "url": "string"
        },
        "creationDate": "string",
        "description": "string",
        "id": 9,
        "state": "notSet",
        "targetUrl": "string",
        "updatedDate": "string"
      }
    ],
    "url": "string",
    "workItems": [
      {
        "id": "string",
        "url": "string"
      },
      {
        "id": "string",
        "url": "string"
      },
      {
        "id": "string",
        "url": "string"
      },
      {
        "id": "string",
        "url": "string"
      },
      {
        "id": "string",
        "url": "string"
      }
    ]
  }
]