[
  {
    "createdDate": "string",
    "deletedBy": {
      "_links": {
        "links": {}
      },
      "descriptor": "string",
      "displayName": "string",
      "url": "string"
    },
    "deletedDate": "string",
    "id": "string",
    "name": "string",
    "project": {
      "abbreviation": "string",
      "defaultTeamImageUrl": "string",
      "description": "string",
      "id": "string",
      "lastUpdateTime": "string",
      "name": "string",
      "revision": 8,
      "state": "deleted",
      "url": "string",
      "visibility": "public"
    }
  }
]