[
  {
    "active": true,
    "id": "string",
    "name": "string",
    "url": "string"
  },
  {
    "active": true,
    "id": "string",
    "name": "string",
    "url": "string"
  },
  {
    "active": false,
    "id": "string",
    "name": "string",
    "url": "string"
  }
]