{
  "$id": "schema.json",
  "type": "object",
  "schema": "http://json-schema.org/draft-07/schema#",
  "translate": true,
  "dynamicfields": true,
  "properties": {
    "ph_request_type": {
      "type": "string",
      "description": "type of request (internal to adapter)",
      "default": "revertsCreate",
      "enum": [
        "revertsCreate",
        "revertsGetRevertForRefName",
        "revertsGetRevert"
      ],
      "external_name": "ph_request_type"
    },
    "apiVersion": {
      "type": "string",
      "description": "Version of the API to use.  This should be set to &#39;6.1-preview.1&#39; to use this version of the api.",
      "parse": false,
      "encode": false,
      "encrypt": {
        "type": "AES",
        "key": ""
      },
      "external_name": "api-version"
    }
  },
  "definitions": {}
}