[
  {
    "customMessage": "string",
    "isLocked": false,
    "name": "string",
    "newObjectId": "string",
    "oldObjectId": "string",
    "rejectedBy": "string",
    "repositoryId": "string",
    "success": false,
    "updateStatus": "succeededCorruptRef"
  }
]