{
  "source": "realtime",
  "admin_status": "DOWN",
  "link_status": "UP",
  "interface_alias": [
    {
      "ip_configuration": "not configured",
      "netmask": "string",
      "ip_address": "string",
      "physical_address": "string",
      "broadcast_address": "string"
    },
    {
      "ip_configuration": "not configured",
      "netmask": "string",
      "ip_address": "string",
      "physical_address": "string",
      "broadcast_address": "string"
    },
    {
      "ip_configuration": "dhcp",
      "netmask": "string",
      "ip_address": "string",
      "physical_address": "string",
      "broadcast_address": "string"
    },
    {
      "ip_configuration": "not configured",
      "netmask": "string",
      "ip_address": "string",
      "physical_address": "string",
      "broadcast_address": "string"
    },
    {
      "ip_configuration": "dhcp",
      "netmask": "string",
      "ip_address": "string",
      "physical_address": "string",
      "broadcast_address": "string"
    },
    {
      "ip_configuration": "not configured",
      "netmask": "string",
      "ip_address": "string",
      "physical_address": "string",
      "broadcast_address": "string"
    }
  ],
  "ens_enabled": true,
  "interface_type": "VIRTUAL",
  "interface_id": "string",
  "connected_switch": "string",
  "ens_capable": true,
  "mtu": 4
}