{
  "_self": {
    "action": "string",
    "href": "string",
    "rel": "string"
  },
  "_links": [
    {
      "action": "string",
      "href": "string",
      "rel": "string"
    },
    {
      "action": "string",
      "href": "string",
      "rel": "string"
    },
    {
      "action": "string",
      "href": "string",
      "rel": "string"
    }
  ],
  "_schema": "string",
  "_revision": 5,
  "_system_owned": true,
  "display_name": "string",
  "description": "string",
  "tags": [
    {
      "scope": "string",
      "tag": "string"
    },
    {
      "scope": "string",
      "tag": "string"
    },
    {
      "scope": "string",
      "tag": "string"
    }
  ],
  "_create_user": "string",
  "_protection": "string",
  "_create_time": 3,
  "_last_modified_time": 10,
  "_last_modified_user": "string",
  "id": "string",
  "resource_type": "string",
  "modified_feature_stack_collection_configurations": {
    "results": [
      {
        "_self": {
          "action": "string",
          "href": "string",
          "rel": "string"
        },
        "_links": [
          {
            "action": "string",
            "href": "string",
            "rel": "string"
          },
          {
            "action": "string",
            "href": "string",
            "rel": "string"
          },
          {
            "action": "string",
            "href": "string",
            "rel": "string"
          },
          {
            "action": "string",
            "href": "string",
            "rel": "string"
          },
          {
            "action": "string",
            "href": "string",
            "rel": "string"
          },
          {
            "action": "string",
            "href": "string",
            "rel": "string"
          },
          {
            "action": "string",
            "href": "string",
            "rel": "string"
          },
          {
            "action": "string",
            "href": "string",
            "rel": "string"
          }
        ],
        "_schema": "string",
        "_revision": 5,
        "_system_owned": false,
        "display_name": "string",
        "description": "string",
        "tags": [
          {
            "scope": "string",
            "tag": "string"
          },
          {
            "scope": "string",
            "tag": "string"
          },
          {
            "scope": "string",
            "tag": "string"
          },
          {
            "scope": "string",
            "tag": "string"
          }
        ],
        "_create_user": "string",
        "_protection": "string",
        "_create_time": 1,
        "_last_modified_time": 1,
        "_last_modified_user": "string",
        "id": "string",
        "resource_type": "string",
        "feature_stack_name": "string",
        "client_type_collection_configurations": [
          {
            "client_type": "HYPERVISOR",
            "data_type_configurations": [
              {
                "collection_frequency": 6,
                "data_type": "STATUS"
              }
            ]
          },
          {
            "client_type": "CONTROL_PLANE",
            "data_type_configurations": [
              {
                "collection_frequency": 7,
                "data_type": "STATISTICS"
              },
              {
                "collection_frequency": 8,
                "data_type": "STATUS"
              },
              {
                "collection_frequency": 4,
                "data_type": "STATISTICS"
              },
              {
                "collection_frequency": 3,
                "data_type": "STATISTICS"
              },
              {
                "collection_frequency": 4,
                "data_type": "STATUS"
              },
              {
                "collection_frequency": 4,
                "data_type": "STATISTICS"
              },
              {
                "collection_frequency": 2,
                "data_type": "STATISTICS"
              },
              {
                "collection_frequency": 2,
                "data_type": "STATUS"
              },
              {
                "collection_frequency": 10,
                "data_type": "STATISTICS"
              }
            ]
          },
          {
            "client_type": "HYPERVISOR",
            "data_type_configurations": [
              {
                "collection_frequency": 1,
                "data_type": "STATUS"
              },
              {
                "collection_frequency": 6,
                "data_type": "STATISTICS"
              },
              {
                "collection_frequency": 2,
                "data_type": "STATUS"
              },
              {
                "collection_frequency": 1,
                "data_type": "STATISTICS"
              },
              {
                "collection_frequency": 2,
                "data_type": "STATISTICS"
              },
              {
                "collection_frequency": 5,
                "data_type": "STATISTICS"
              }
            ]
          }
        ]
      },
      {
        "_self": {
          "action": "string",
          "href": "string",
          "rel": "string"
        },
        "_links": [
          {
            "action": "string",
            "href": "string",
            "rel": "string"
          },
          {
            "action": "string",
            "href": "string",
            "rel": "string"
          },
          {
            "action": "string",
            "href": "string",
            "rel": "string"
          },
          {
            "action": "string",
            "href": "string",
            "rel": "string"
          },
          {
            "action": "string",
            "href": "string",
            "rel": "string"
          },
          {
            "action": "string",
            "href": "string",
            "rel": "string"
          },
          {
            "action": "string",
            "href": "string",
            "rel": "string"
          }
        ],
        "_schema": "string",
        "_revision": 5,
        "_system_owned": false,
        "display_name": "string",
        "description": "string",
        "tags": [
          {
            "scope": "string",
            "tag": "string"
          },
          {
            "scope": "string",
            "tag": "string"
          },
          {
            "scope": "string",
            "tag": "string"
          }
        ],
        "_create_user": "string",
        "_protection": "string",
        "_create_time": 6,
        "_last_modified_time": 5,
        "_last_modified_user": "string",
        "id": "string",
        "resource_type": "string",
        "feature_stack_name": "string",
        "client_type_collection_configurations": [
          {
            "client_type": "EDGE",
            "data_type_configurations": [
              {
                "collection_frequency": 2,
                "data_type": "STATUS"
              },
              {
                "collection_frequency": 10,
                "data_type": "STATISTICS"
              },
              {
                "collection_frequency": 10,
                "data_type": "STATUS"
              },
              {
                "collection_frequency": 4,
                "data_type": "STATUS"
              },
              {
                "collection_frequency": 9,
                "data_type": "STATUS"
              },
              {
                "collection_frequency": 2,
                "data_type": "STATUS"
              },
              {
                "collection_frequency": 7,
                "data_type": "STATUS"
              },
              {
                "collection_frequency": 3,
                "data_type": "STATISTICS"
              },
              {
                "collection_frequency": 6,
                "data_type": "STATUS"
              }
            ]
          },
          {
            "client_type": "MANAGEMENT_PLANE",
            "data_type_configurations": [
              {
                "collection_frequency": 7,
                "data_type": "STATUS"
              }
            ]
          },
          {
            "client_type": "MANAGEMENT_PLANE_PLATFORM",
            "data_type_configurations": [
              {
                "collection_frequency": 1,
                "data_type": "STATISTICS"
              },
              {
                "collection_frequency": 3,
                "data_type": "STATISTICS"
              },
              {
                "collection_frequency": 10,
                "data_type": "STATUS"
              },
              {
                "collection_frequency": 9,
                "data_type": "STATISTICS"
              },
              {
                "collection_frequency": 2,
                "data_type": "STATISTICS"
              },
              {
                "collection_frequency": 5,
                "data_type": "STATUS"
              },
              {
                "collection_frequency": 7,
                "data_type": "STATISTICS"
              },
              {
                "collection_frequency": 4,
                "data_type": "STATUS"
              },
              {
                "collection_frequency": 7,
                "data_type": "STATUS"
              }
            ]
          },
          {
            "client_type": "MANAGEMENT_PLANE_PLATFORM",
            "data_type_configurations": [
              {
                "collection_frequency": 2,
                "data_type": "STATUS"
              }
            ]
          },
          {
            "client_type": "EDGE",
            "data_type_configurations": [
              {
                "collection_frequency": 2,
                "data_type": "STATISTICS"
              },
              {
                "collection_frequency": 9,
                "data_type": "STATISTICS"
              },
              {
                "collection_frequency": 6,
                "data_type": "STATUS"
              }
            ]
          }
        ]
      },
      {
        "_self": {
          "action": "string",
          "href": "string",
          "rel": "string"
        },
        "_links": [
          {
            "action": "string",
            "href": "string",
            "rel": "string"
          },
          {
            "action": "string",
            "href": "string",
            "rel": "string"
          },
          {
            "action": "string",
            "href": "string",
            "rel": "string"
          },
          {
            "action": "string",
            "href": "string",
            "rel": "string"
          },
          {
            "action": "string",
            "href": "string",
            "rel": "string"
          },
          {
            "action": "string",
            "href": "string",
            "rel": "string"
          },
          {
            "action": "string",
            "href": "string",
            "rel": "string"
          },
          {
            "action": "string",
            "href": "string",
            "rel": "string"
          },
          {
            "action": "string",
            "href": "string",
            "rel": "string"
          },
          {
            "action": "string",
            "href": "string",
            "rel": "string"
          }
        ],
        "_schema": "string",
        "_revision": 2,
        "_system_owned": false,
        "display_name": "string",
        "description": "string",
        "tags": [
          {
            "scope": "string",
            "tag": "string"
          }
        ],
        "_create_user": "string",
        "_protection": "string",
        "_create_time": 10,
        "_last_modified_time": 10,
        "_last_modified_user": "string",
        "id": "string",
        "resource_type": "string",
        "feature_stack_name": "string",
        "client_type_collection_configurations": [
          {
            "client_type": "CONTROL_PLANE_PLATFORM",
            "data_type_configurations": [
              {
                "collection_frequency": 4,
                "data_type": "STATISTICS"
              },
              {
                "collection_frequency": 6,
                "data_type": "STATUS"
              },
              {
                "collection_frequency": 10,
                "data_type": "STATISTICS"
              },
              {
                "collection_frequency": 1,
                "data_type": "STATUS"
              },
              {
                "collection_frequency": 5,
                "data_type": "STATISTICS"
              },
              {
                "collection_frequency": 8,
                "data_type": "STATISTICS"
              },
              {
                "collection_frequency": 4,
                "data_type": "STATISTICS"
              },
              {
                "collection_frequency": 6,
                "data_type": "STATUS"
              },
              {
                "collection_frequency": 10,
                "data_type": "STATISTICS"
              },
              {
                "collection_frequency": 8,
                "data_type": "STATUS"
              }
            ]
          },
          {
            "client_type": "EDGE",
            "data_type_configurations": [
              {
                "collection_frequency": 7,
                "data_type": "STATISTICS"
              },
              {
                "collection_frequency": 5,
                "data_type": "STATUS"
              },
              {
                "collection_frequency": 7,
                "data_type": "STATISTICS"
              }
            ]
          },
          {
            "client_type": "MANAGEMENT_PLANE_PLATFORM",
            "data_type_configurations": [
              {
                "collection_frequency": 10,
                "data_type": "STATISTICS"
              }
            ]
          },
          {
            "client_type": "MANAGEMENT_PLANE_PLATFORM",
            "data_type_configurations": [
              {
                "collection_frequency": 4,
                "data_type": "STATUS"
              },
              {
                "collection_frequency": 9,
                "data_type": "STATISTICS"
              },
              {
                "collection_frequency": 1,
                "data_type": "STATUS"
              },
              {
                "collection_frequency": 7,
                "data_type": "STATUS"
              }
            ]
          },
          {
            "client_type": "MANAGEMENT_PLANE",
            "data_type_configurations": [
              {
                "collection_frequency": 3,
                "data_type": "STATUS"
              },
              {
                "collection_frequency": 8,
                "data_type": "STATUS"
              },
              {
                "collection_frequency": 1,
                "data_type": "STATISTICS"
              },
              {
                "collection_frequency": 8,
                "data_type": "STATISTICS"
              },
              {
                "collection_frequency": 7,
                "data_type": "STATUS"
              },
              {
                "collection_frequency": 2,
                "data_type": "STATUS"
              },
              {
                "collection_frequency": 9,
                "data_type": "STATISTICS"
              },
              {
                "collection_frequency": 5,
                "data_type": "STATUS"
              }
            ]
          },
          {
            "client_type": "MANAGEMENT_PLANE",
            "data_type_configurations": [
              {
                "collection_frequency": 2,
                "data_type": "STATUS"
              },
              {
                "collection_frequency": 7,
                "data_type": "STATISTICS"
              },
              {
                "collection_frequency": 8,
                "data_type": "STATISTICS"
              },
              {
                "collection_frequency": 10,
                "data_type": "STATUS"
              },
              {
                "collection_frequency": 6,
                "data_type": "STATUS"
              }
            ]
          },
          {
            "client_type": "MANAGEMENT_PLANE_PLATFORM",
            "data_type_configurations": [
              {
                "collection_frequency": 2,
                "data_type": "STATUS"
              },
              {
                "collection_frequency": 7,
                "data_type": "STATUS"
              },
              {
                "collection_frequency": 10,
                "data_type": "STATUS"
              },
              {
                "collection_frequency": 6,
                "data_type": "STATISTICS"
              },
              {
                "collection_frequency": 9,
                "data_type": "STATUS"
              }
            ]
          },
          {
            "client_type": "EDGE",
            "data_type_configurations": [
              {
                "collection_frequency": 5,
                "data_type": "STATISTICS"
              },
              {
                "collection_frequency": 6,
                "data_type": "STATUS"
              },
              {
                "collection_frequency": 6,
                "data_type": "STATISTICS"
              },
              {
                "collection_frequency": 9,
                "data_type": "STATISTICS"
              },
              {
                "collection_frequency": 9,
                "data_type": "STATUS"
              }
            ]
          },
          {
            "client_type": "CONTROL_PLANE",
            "data_type_configurations": [
              {
                "collection_frequency": 2,
                "data_type": "STATISTICS"
              },
              {
                "collection_frequency": 5,
                "data_type": "STATISTICS"
              },
              {
                "collection_frequency": 2,
                "data_type": "STATUS"
              },
              {
                "collection_frequency": 6,
                "data_type": "STATISTICS"
              },
              {
                "collection_frequency": 10,
                "data_type": "STATUS"
              },
              {
                "collection_frequency": 3,
                "data_type": "STATISTICS"
              }
            ]
          }
        ]
      },
      {
        "_self": {
          "action": "string",
          "href": "string",
          "rel": "string"
        },
        "_links": [
          {
            "action": "string",
            "href": "string",
            "rel": "string"
          },
          {
            "action": "string",
            "href": "string",
            "rel": "string"
          },
          {
            "action": "string",
            "href": "string",
            "rel": "string"
          },
          {
            "action": "string",
            "href": "string",
            "rel": "string"
          },
          {
            "action": "string",
            "href": "string",
            "rel": "string"
          }
        ],
        "_schema": "string",
        "_revision": 7,
        "_system_owned": true,
        "display_name": "string",
        "description": "string",
        "tags": [
          {
            "scope": "string",
            "tag": "string"
          },
          {
            "scope": "string",
            "tag": "string"
          },
          {
            "scope": "string",
            "tag": "string"
          },
          {
            "scope": "string",
            "tag": "string"
          },
          {
            "scope": "string",
            "tag": "string"
          },
          {
            "scope": "string",
            "tag": "string"
          },
          {
            "scope": "string",
            "tag": "string"
          },
          {
            "scope": "string",
            "tag": "string"
          }
        ],
        "_create_user": "string",
        "_protection": "string",
        "_create_time": 9,
        "_last_modified_time": 1,
        "_last_modified_user": "string",
        "id": "string",
        "resource_type": "string",
        "feature_stack_name": "string",
        "client_type_collection_configurations": [
          {
            "client_type": "MANAGEMENT_PLANE",
            "data_type_configurations": [
              {
                "collection_frequency": 9,
                "data_type": "STATUS"
              },
              {
                "collection_frequency": 7,
                "data_type": "STATISTICS"
              },
              {
                "collection_frequency": 7,
                "data_type": "STATISTICS"
              },
              {
                "collection_frequency": 9,
                "data_type": "STATISTICS"
              },
              {
                "collection_frequency": 1,
                "data_type": "STATUS"
              },
              {
                "collection_frequency": 5,
                "data_type": "STATISTICS"
              },
              {
                "collection_frequency": 9,
                "data_type": "STATUS"
              },
              {
                "collection_frequency": 5,
                "data_type": "STATISTICS"
              }
            ]
          },
          {
            "client_type": "HYPERVISOR",
            "data_type_configurations": [
              {
                "collection_frequency": 7,
                "data_type": "STATISTICS"
              },
              {
                "collection_frequency": 10,
                "data_type": "STATISTICS"
              },
              {
                "collection_frequency": 5,
                "data_type": "STATISTICS"
              }
            ]
          },
          {
            "client_type": "MANAGEMENT_PLANE_PLATFORM",
            "data_type_configurations": [
              {
                "collection_frequency": 2,
                "data_type": "STATUS"
              },
              {
                "collection_frequency": 7,
                "data_type": "STATISTICS"
              },
              {
                "collection_frequency": 4,
                "data_type": "STATISTICS"
              },
              {
                "collection_frequency": 5,
                "data_type": "STATUS"
              },
              {
                "collection_frequency": 7,
                "data_type": "STATISTICS"
              },
              {
                "collection_frequency": 2,
                "data_type": "STATUS"
              },
              {
                "collection_frequency": 6,
                "data_type": "STATISTICS"
              },
              {
                "collection_frequency": 3,
                "data_type": "STATUS"
              }
            ]
          },
          {
            "client_type": "CONTROL_PLANE",
            "data_type_configurations": [
              {
                "collection_frequency": 9,
                "data_type": "STATISTICS"
              },
              {
                "collection_frequency": 10,
                "data_type": "STATUS"
              },
              {
                "collection_frequency": 5,
                "data_type": "STATISTICS"
              },
              {
                "collection_frequency": 3,
                "data_type": "STATUS"
              },
              {
                "collection_frequency": 10,
                "data_type": "STATUS"
              },
              {
                "collection_frequency": 6,
                "data_type": "STATISTICS"
              },
              {
                "collection_frequency": 4,
                "data_type": "STATUS"
              },
              {
                "collection_frequency": 5,
                "data_type": "STATUS"
              },
              {
                "collection_frequency": 4,
                "data_type": "STATISTICS"
              },
              {
                "collection_frequency": 9,
                "data_type": "STATISTICS"
              }
            ]
          },
          {
            "client_type": "EDGE",
            "data_type_configurations": [
              {
                "collection_frequency": 10,
                "data_type": "STATUS"
              },
              {
                "collection_frequency": 4,
                "data_type": "STATISTICS"
              }
            ]
          },
          {
            "client_type": "MANAGEMENT_PLANE_PLATFORM",
            "data_type_configurations": [
              {
                "collection_frequency": 10,
                "data_type": "STATISTICS"
              },
              {
                "collection_frequency": 6,
                "data_type": "STATUS"
              },
              {
                "collection_frequency": 4,
                "data_type": "STATISTICS"
              },
              {
                "collection_frequency": 1,
                "data_type": "STATUS"
              },
              {
                "collection_frequency": 8,
                "data_type": "STATISTICS"
              },
              {
                "collection_frequency": 5,
                "data_type": "STATUS"
              },
              {
                "collection_frequency": 8,
                "data_type": "STATISTICS"
              },
              {
                "collection_frequency": 6,
                "data_type": "STATISTICS"
              }
            ]
          },
          {
            "client_type": "MANAGEMENT_PLANE",
            "data_type_configurations": [
              {
                "collection_frequency": 9,
                "data_type": "STATUS"
              },
              {
                "collection_frequency": 7,
                "data_type": "STATISTICS"
              },
              {
                "collection_frequency": 9,
                "data_type": "STATUS"
              },
              {
                "collection_frequency": 2,
                "data_type": "STATISTICS"
              }
            ]
          },
          {
            "client_type": "EDGE",
            "data_type_configurations": [
              {
                "collection_frequency": 1,
                "data_type": "STATISTICS"
              },
              {
                "collection_frequency": 9,
                "data_type": "STATISTICS"
              },
              {
                "collection_frequency": 5,
                "data_type": "STATISTICS"
              },
              {
                "collection_frequency": 2,
                "data_type": "STATISTICS"
              },
              {
                "collection_frequency": 4,
                "data_type": "STATUS"
              },
              {
                "collection_frequency": 2,
                "data_type": "STATISTICS"
              },
              {
                "collection_frequency": 7,
                "data_type": "STATUS"
              }
            ]
          },
          {
            "client_type": "MANAGEMENT_PLANE",
            "data_type_configurations": [
              {
                "collection_frequency": 6,
                "data_type": "STATUS"
              },
              {
                "collection_frequency": 10,
                "data_type": "STATISTICS"
              },
              {
                "collection_frequency": 9,
                "data_type": "STATISTICS"
              },
              {
                "collection_frequency": 4,
                "data_type": "STATISTICS"
              },
              {
                "collection_frequency": 1,
                "data_type": "STATUS"
              },
              {
                "collection_frequency": 4,
                "data_type": "STATISTICS"
              }
            ]
          }
        ]
      },
      {
        "_self": {
          "action": "string",
          "href": "string",
          "rel": "string"
        },
        "_links": [
          {
            "action": "string",
            "href": "string",
            "rel": "string"
          },
          {
            "action": "string",
            "href": "string",
            "rel": "string"
          },
          {
            "action": "string",
            "href": "string",
            "rel": "string"
          },
          {
            "action": "string",
            "href": "string",
            "rel": "string"
          },
          {
            "action": "string",
            "href": "string",
            "rel": "string"
          },
          {
            "action": "string",
            "href": "string",
            "rel": "string"
          }
        ],
        "_schema": "string",
        "_revision": 9,
        "_system_owned": false,
        "display_name": "string",
        "description": "string",
        "tags": [
          {
            "scope": "string",
            "tag": "string"
          },
          {
            "scope": "string",
            "tag": "string"
          },
          {
            "scope": "string",
            "tag": "string"
          },
          {
            "scope": "string",
            "tag": "string"
          },
          {
            "scope": "string",
            "tag": "string"
          },
          {
            "scope": "string",
            "tag": "string"
          },
          {
            "scope": "string",
            "tag": "string"
          },
          {
            "scope": "string",
            "tag": "string"
          }
        ],
        "_create_user": "string",
        "_protection": "string",
        "_create_time": 8,
        "_last_modified_time": 1,
        "_last_modified_user": "string",
        "id": "string",
        "resource_type": "string",
        "feature_stack_name": "string",
        "client_type_collection_configurations": [
          {
            "client_type": "CONTROL_PLANE",
            "data_type_configurations": [
              {
                "collection_frequency": 10,
                "data_type": "STATUS"
              },
              {
                "collection_frequency": 8,
                "data_type": "STATISTICS"
              }
            ]
          },
          {
            "client_type": "EDGE",
            "data_type_configurations": [
              {
                "collection_frequency": 8,
                "data_type": "STATISTICS"
              },
              {
                "collection_frequency": 4,
                "data_type": "STATUS"
              }
            ]
          },
          {
            "client_type": "HYPERVISOR",
            "data_type_configurations": [
              {
                "collection_frequency": 6,
                "data_type": "STATUS"
              },
              {
                "collection_frequency": 6,
                "data_type": "STATUS"
              },
              {
                "collection_frequency": 4,
                "data_type": "STATISTICS"
              },
              {
                "collection_frequency": 1,
                "data_type": "STATISTICS"
              },
              {
                "collection_frequency": 10,
                "data_type": "STATUS"
              },
              {
                "collection_frequency": 5,
                "data_type": "STATUS"
              }
            ]
          }
        ]
      },
      {
        "_self": {
          "action": "string",
          "href": "string",
          "rel": "string"
        },
        "_links": [
          {
            "action": "string",
            "href": "string",
            "rel": "string"
          },
          {
            "action": "string",
            "href": "string",
            "rel": "string"
          },
          {
            "action": "string",
            "href": "string",
            "rel": "string"
          },
          {
            "action": "string",
            "href": "string",
            "rel": "string"
          },
          {
            "action": "string",
            "href": "string",
            "rel": "string"
          },
          {
            "action": "string",
            "href": "string",
            "rel": "string"
          },
          {
            "action": "string",
            "href": "string",
            "rel": "string"
          },
          {
            "action": "string",
            "href": "string",
            "rel": "string"
          }
        ],
        "_schema": "string",
        "_revision": 9,
        "_system_owned": true,
        "display_name": "string",
        "description": "string",
        "tags": [
          {
            "scope": "string",
            "tag": "string"
          },
          {
            "scope": "string",
            "tag": "string"
          },
          {
            "scope": "string",
            "tag": "string"
          },
          {
            "scope": "string",
            "tag": "string"
          },
          {
            "scope": "string",
            "tag": "string"
          },
          {
            "scope": "string",
            "tag": "string"
          },
          {
            "scope": "string",
            "tag": "string"
          },
          {
            "scope": "string",
            "tag": "string"
          }
        ],
        "_create_user": "string",
        "_protection": "string",
        "_create_time": 6,
        "_last_modified_time": 4,
        "_last_modified_user": "string",
        "id": "string",
        "resource_type": "string",
        "feature_stack_name": "string",
        "client_type_collection_configurations": [
          {
            "client_type": "EDGE",
            "data_type_configurations": [
              {
                "collection_frequency": 7,
                "data_type": "STATUS"
              },
              {
                "collection_frequency": 3,
                "data_type": "STATISTICS"
              },
              {
                "collection_frequency": 7,
                "data_type": "STATISTICS"
              },
              {
                "collection_frequency": 4,
                "data_type": "STATUS"
              },
              {
                "collection_frequency": 8,
                "data_type": "STATUS"
              },
              {
                "collection_frequency": 6,
                "data_type": "STATISTICS"
              },
              {
                "collection_frequency": 10,
                "data_type": "STATISTICS"
              }
            ]
          },
          {
            "client_type": "HYPERVISOR",
            "data_type_configurations": [
              {
                "collection_frequency": 8,
                "data_type": "STATUS"
              },
              {
                "collection_frequency": 3,
                "data_type": "STATUS"
              },
              {
                "collection_frequency": 7,
                "data_type": "STATUS"
              },
              {
                "collection_frequency": 8,
                "data_type": "STATISTICS"
              },
              {
                "collection_frequency": 1,
                "data_type": "STATISTICS"
              },
              {
                "collection_frequency": 3,
                "data_type": "STATUS"
              },
              {
                "collection_frequency": 6,
                "data_type": "STATISTICS"
              },
              {
                "collection_frequency": 4,
                "data_type": "STATISTICS"
              },
              {
                "collection_frequency": 9,
                "data_type": "STATISTICS"
              }
            ]
          }
        ]
      },
      {
        "_self": {
          "action": "string",
          "href": "string",
          "rel": "string"
        },
        "_links": [
          {
            "action": "string",
            "href": "string",
            "rel": "string"
          },
          {
            "action": "string",
            "href": "string",
            "rel": "string"
          },
          {
            "action": "string",
            "href": "string",
            "rel": "string"
          },
          {
            "action": "string",
            "href": "string",
            "rel": "string"
          },
          {
            "action": "string",
            "href": "string",
            "rel": "string"
          },
          {
            "action": "string",
            "href": "string",
            "rel": "string"
          },
          {
            "action": "string",
            "href": "string",
            "rel": "string"
          },
          {
            "action": "string",
            "href": "string",
            "rel": "string"
          },
          {
            "action": "string",
            "href": "string",
            "rel": "string"
          },
          {
            "action": "string",
            "href": "string",
            "rel": "string"
          }
        ],
        "_schema": "string",
        "_revision": 2,
        "_system_owned": false,
        "display_name": "string",
        "description": "string",
        "tags": [
          {
            "scope": "string",
            "tag": "string"
          }
        ],
        "_create_user": "string",
        "_protection": "string",
        "_create_time": 8,
        "_last_modified_time": 9,
        "_last_modified_user": "string",
        "id": "string",
        "resource_type": "string",
        "feature_stack_name": "string",
        "client_type_collection_configurations": [
          {
            "client_type": "CONTROL_PLANE",
            "data_type_configurations": [
              {
                "collection_frequency": 8,
                "data_type": "STATISTICS"
              }
            ]
          },
          {
            "client_type": "CONTROL_PLANE_PLATFORM",
            "data_type_configurations": [
              {
                "collection_frequency": 1,
                "data_type": "STATISTICS"
              }
            ]
          },
          {
            "client_type": "MANAGEMENT_PLANE",
            "data_type_configurations": [
              {
                "collection_frequency": 8,
                "data_type": "STATISTICS"
              },
              {
                "collection_frequency": 2,
                "data_type": "STATUS"
              },
              {
                "collection_frequency": 1,
                "data_type": "STATUS"
              },
              {
                "collection_frequency": 9,
                "data_type": "STATISTICS"
              },
              {
                "collection_frequency": 6,
                "data_type": "STATUS"
              },
              {
                "collection_frequency": 5,
                "data_type": "STATISTICS"
              },
              {
                "collection_frequency": 10,
                "data_type": "STATUS"
              },
              {
                "collection_frequency": 8,
                "data_type": "STATISTICS"
              },
              {
                "collection_frequency": 5,
                "data_type": "STATISTICS"
              },
              {
                "collection_frequency": 1,
                "data_type": "STATISTICS"
              }
            ]
          },
          {
            "client_type": "CONTROL_PLANE_PLATFORM",
            "data_type_configurations": [
              {
                "collection_frequency": 5,
                "data_type": "STATISTICS"
              },
              {
                "collection_frequency": 10,
                "data_type": "STATUS"
              },
              {
                "collection_frequency": 4,
                "data_type": "STATISTICS"
              }
            ]
          },
          {
            "client_type": "CONTROL_PLANE_PLATFORM",
            "data_type_configurations": [
              {
                "collection_frequency": 3,
                "data_type": "STATUS"
              }
            ]
          },
          {
            "client_type": "CONTROL_PLANE_PLATFORM",
            "data_type_configurations": [
              {
                "collection_frequency": 8,
                "data_type": "STATUS"
              },
              {
                "collection_frequency": 3,
                "data_type": "STATUS"
              },
              {
                "collection_frequency": 6,
                "data_type": "STATISTICS"
              },
              {
                "collection_frequency": 6,
                "data_type": "STATUS"
              },
              {
                "collection_frequency": 1,
                "data_type": "STATUS"
              },
              {
                "collection_frequency": 6,
                "data_type": "STATUS"
              }
            ]
          },
          {
            "client_type": "CONTROL_PLANE_PLATFORM",
            "data_type_configurations": [
              {
                "collection_frequency": 4,
                "data_type": "STATISTICS"
              },
              {
                "collection_frequency": 2,
                "data_type": "STATISTICS"
              },
              {
                "collection_frequency": 2,
                "data_type": "STATUS"
              },
              {
                "collection_frequency": 2,
                "data_type": "STATUS"
              }
            ]
          },
          {
            "client_type": "MANAGEMENT_PLANE_PLATFORM",
            "data_type_configurations": [
              {
                "collection_frequency": 7,
                "data_type": "STATISTICS"
              },
              {
                "collection_frequency": 8,
                "data_type": "STATUS"
              },
              {
                "collection_frequency": 4,
                "data_type": "STATISTICS"
              },
              {
                "collection_frequency": 1,
                "data_type": "STATUS"
              },
              {
                "collection_frequency": 10,
                "data_type": "STATUS"
              }
            ]
          }
        ]
      },
      {
        "_self": {
          "action": "string",
          "href": "string",
          "rel": "string"
        },
        "_links": [
          {
            "action": "string",
            "href": "string",
            "rel": "string"
          },
          {
            "action": "string",
            "href": "string",
            "rel": "string"
          },
          {
            "action": "string",
            "href": "string",
            "rel": "string"
          }
        ],
        "_schema": "string",
        "_revision": 3,
        "_system_owned": false,
        "display_name": "string",
        "description": "string",
        "tags": [
          {
            "scope": "string",
            "tag": "string"
          },
          {
            "scope": "string",
            "tag": "string"
          },
          {
            "scope": "string",
            "tag": "string"
          }
        ],
        "_create_user": "string",
        "_protection": "string",
        "_create_time": 10,
        "_last_modified_time": 4,
        "_last_modified_user": "string",
        "id": "string",
        "resource_type": "string",
        "feature_stack_name": "string",
        "client_type_collection_configurations": [
          {
            "client_type": "EDGE",
            "data_type_configurations": [
              {
                "collection_frequency": 1,
                "data_type": "STATISTICS"
              },
              {
                "collection_frequency": 8,
                "data_type": "STATUS"
              },
              {
                "collection_frequency": 3,
                "data_type": "STATUS"
              },
              {
                "collection_frequency": 9,
                "data_type": "STATUS"
              },
              {
                "collection_frequency": 6,
                "data_type": "STATISTICS"
              }
            ]
          },
          {
            "client_type": "CONTROL_PLANE_PLATFORM",
            "data_type_configurations": [
              {
                "collection_frequency": 6,
                "data_type": "STATISTICS"
              },
              {
                "collection_frequency": 8,
                "data_type": "STATUS"
              },
              {
                "collection_frequency": 6,
                "data_type": "STATISTICS"
              },
              {
                "collection_frequency": 1,
                "data_type": "STATUS"
              },
              {
                "collection_frequency": 5,
                "data_type": "STATUS"
              },
              {
                "collection_frequency": 2,
                "data_type": "STATISTICS"
              },
              {
                "collection_frequency": 9,
                "data_type": "STATISTICS"
              },
              {
                "collection_frequency": 1,
                "data_type": "STATUS"
              }
            ]
          },
          {
            "client_type": "CONTROL_PLANE",
            "data_type_configurations": [
              {
                "collection_frequency": 10,
                "data_type": "STATISTICS"
              },
              {
                "collection_frequency": 7,
                "data_type": "STATUS"
              },
              {
                "collection_frequency": 6,
                "data_type": "STATISTICS"
              },
              {
                "collection_frequency": 5,
                "data_type": "STATUS"
              },
              {
                "collection_frequency": 4,
                "data_type": "STATUS"
              },
              {
                "collection_frequency": 1,
                "data_type": "STATUS"
              },
              {
                "collection_frequency": 4,
                "data_type": "STATUS"
              },
              {
                "collection_frequency": 8,
                "data_type": "STATUS"
              },
              {
                "collection_frequency": 9,
                "data_type": "STATUS"
              },
              {
                "collection_frequency": 7,
                "data_type": "STATUS"
              }
            ]
          },
          {
            "client_type": "HYPERVISOR",
            "data_type_configurations": [
              {
                "collection_frequency": 6,
                "data_type": "STATUS"
              },
              {
                "collection_frequency": 8,
                "data_type": "STATISTICS"
              },
              {
                "collection_frequency": 10,
                "data_type": "STATUS"
              },
              {
                "collection_frequency": 1,
                "data_type": "STATUS"
              }
            ]
          },
          {
            "client_type": "EDGE",
            "data_type_configurations": [
              {
                "collection_frequency": 9,
                "data_type": "STATUS"
              },
              {
                "collection_frequency": 6,
                "data_type": "STATISTICS"
              },
              {
                "collection_frequency": 10,
                "data_type": "STATUS"
              },
              {
                "collection_frequency": 2,
                "data_type": "STATUS"
              }
            ]
          },
          {
            "client_type": "MANAGEMENT_PLANE_PLATFORM",
            "data_type_configurations": [
              {
                "collection_frequency": 5,
                "data_type": "STATISTICS"
              },
              {
                "collection_frequency": 6,
                "data_type": "STATISTICS"
              },
              {
                "collection_frequency": 10,
                "data_type": "STATISTICS"
              },
              {
                "collection_frequency": 1,
                "data_type": "STATUS"
              }
            ]
          },
          {
            "client_type": "MANAGEMENT_PLANE_PLATFORM",
            "data_type_configurations": [
              {
                "collection_frequency": 10,
                "data_type": "STATISTICS"
              },
              {
                "collection_frequency": 3,
                "data_type": "STATISTICS"
              },
              {
                "collection_frequency": 6,
                "data_type": "STATISTICS"
              },
              {
                "collection_frequency": 1,
                "data_type": "STATUS"
              }
            ]
          },
          {
            "client_type": "EDGE",
            "data_type_configurations": [
              {
                "collection_frequency": 1,
                "data_type": "STATISTICS"
              },
              {
                "collection_frequency": 8,
                "data_type": "STATISTICS"
              },
              {
                "collection_frequency": 3,
                "data_type": "STATUS"
              },
              {
                "collection_frequency": 2,
                "data_type": "STATISTICS"
              }
            ]
          }
        ]
      },
      {
        "_self": {
          "action": "string",
          "href": "string",
          "rel": "string"
        },
        "_links": [
          {
            "action": "string",
            "href": "string",
            "rel": "string"
          }
        ],
        "_schema": "string",
        "_revision": 8,
        "_system_owned": true,
        "display_name": "string",
        "description": "string",
        "tags": [
          {
            "scope": "string",
            "tag": "string"
          }
        ],
        "_create_user": "string",
        "_protection": "string",
        "_create_time": 4,
        "_last_modified_time": 5,
        "_last_modified_user": "string",
        "id": "string",
        "resource_type": "string",
        "feature_stack_name": "string",
        "client_type_collection_configurations": [
          {
            "client_type": "CONTROL_PLANE_PLATFORM",
            "data_type_configurations": [
              {
                "collection_frequency": 6,
                "data_type": "STATUS"
              },
              {
                "collection_frequency": 8,
                "data_type": "STATUS"
              },
              {
                "collection_frequency": 7,
                "data_type": "STATISTICS"
              },
              {
                "collection_frequency": 9,
                "data_type": "STATUS"
              },
              {
                "collection_frequency": 4,
                "data_type": "STATISTICS"
              },
              {
                "collection_frequency": 6,
                "data_type": "STATUS"
              },
              {
                "collection_frequency": 7,
                "data_type": "STATUS"
              },
              {
                "collection_frequency": 2,
                "data_type": "STATISTICS"
              },
              {
                "collection_frequency": 4,
                "data_type": "STATISTICS"
              },
              {
                "collection_frequency": 3,
                "data_type": "STATISTICS"
              }
            ]
          },
          {
            "client_type": "CONTROL_PLANE_PLATFORM",
            "data_type_configurations": [
              {
                "collection_frequency": 7,
                "data_type": "STATUS"
              },
              {
                "collection_frequency": 6,
                "data_type": "STATUS"
              },
              {
                "collection_frequency": 2,
                "data_type": "STATUS"
              },
              {
                "collection_frequency": 5,
                "data_type": "STATUS"
              },
              {
                "collection_frequency": 4,
                "data_type": "STATUS"
              },
              {
                "collection_frequency": 8,
                "data_type": "STATISTICS"
              }
            ]
          },
          {
            "client_type": "HYPERVISOR",
            "data_type_configurations": [
              {
                "collection_frequency": 8,
                "data_type": "STATUS"
              },
              {
                "collection_frequency": 9,
                "data_type": "STATISTICS"
              },
              {
                "collection_frequency": 6,
                "data_type": "STATISTICS"
              },
              {
                "collection_frequency": 9,
                "data_type": "STATUS"
              },
              {
                "collection_frequency": 8,
                "data_type": "STATISTICS"
              }
            ]
          },
          {
            "client_type": "MANAGEMENT_PLANE",
            "data_type_configurations": [
              {
                "collection_frequency": 9,
                "data_type": "STATUS"
              }
            ]
          },
          {
            "client_type": "EDGE",
            "data_type_configurations": [
              {
                "collection_frequency": 10,
                "data_type": "STATISTICS"
              },
              {
                "collection_frequency": 3,
                "data_type": "STATUS"
              },
              {
                "collection_frequency": 4,
                "data_type": "STATISTICS"
              },
              {
                "collection_frequency": 7,
                "data_type": "STATISTICS"
              }
            ]
          },
          {
            "client_type": "EDGE",
            "data_type_configurations": [
              {
                "collection_frequency": 9,
                "data_type": "STATISTICS"
              },
              {
                "collection_frequency": 7,
                "data_type": "STATISTICS"
              },
              {
                "collection_frequency": 6,
                "data_type": "STATUS"
              },
              {
                "collection_frequency": 9,
                "data_type": "STATUS"
              },
              {
                "collection_frequency": 10,
                "data_type": "STATISTICS"
              },
              {
                "collection_frequency": 1,
                "data_type": "STATUS"
              },
              {
                "collection_frequency": 9,
                "data_type": "STATISTICS"
              },
              {
                "collection_frequency": 3,
                "data_type": "STATISTICS"
              },
              {
                "collection_frequency": 2,
                "data_type": "STATUS"
              },
              {
                "collection_frequency": 9,
                "data_type": "STATUS"
              }
            ]
          },
          {
            "client_type": "CONTROL_PLANE",
            "data_type_configurations": [
              {
                "collection_frequency": 9,
                "data_type": "STATISTICS"
              },
              {
                "collection_frequency": 6,
                "data_type": "STATUS"
              },
              {
                "collection_frequency": 8,
                "data_type": "STATISTICS"
              },
              {
                "collection_frequency": 8,
                "data_type": "STATUS"
              },
              {
                "collection_frequency": 10,
                "data_type": "STATUS"
              },
              {
                "collection_frequency": 6,
                "data_type": "STATISTICS"
              }
            ]
          },
          {
            "client_type": "HYPERVISOR",
            "data_type_configurations": [
              {
                "collection_frequency": 2,
                "data_type": "STATISTICS"
              },
              {
                "collection_frequency": 4,
                "data_type": "STATISTICS"
              },
              {
                "collection_frequency": 6,
                "data_type": "STATUS"
              },
              {
                "collection_frequency": 5,
                "data_type": "STATUS"
              },
              {
                "collection_frequency": 5,
                "data_type": "STATISTICS"
              },
              {
                "collection_frequency": 1,
                "data_type": "STATUS"
              },
              {
                "collection_frequency": 6,
                "data_type": "STATISTICS"
              },
              {
                "collection_frequency": 2,
                "data_type": "STATISTICS"
              },
              {
                "collection_frequency": 7,
                "data_type": "STATISTICS"
              }
            ]
          }
        ]
      },
      {
        "_self": {
          "action": "string",
          "href": "string",
          "rel": "string"
        },
        "_links": [
          {
            "action": "string",
            "href": "string",
            "rel": "string"
          }
        ],
        "_schema": "string",
        "_revision": 9,
        "_system_owned": true,
        "display_name": "string",
        "description": "string",
        "tags": [
          {
            "scope": "string",
            "tag": "string"
          },
          {
            "scope": "string",
            "tag": "string"
          },
          {
            "scope": "string",
            "tag": "string"
          }
        ],
        "_create_user": "string",
        "_protection": "string",
        "_create_time": 6,
        "_last_modified_time": 3,
        "_last_modified_user": "string",
        "id": "string",
        "resource_type": "string",
        "feature_stack_name": "string",
        "client_type_collection_configurations": [
          {
            "client_type": "MANAGEMENT_PLANE",
            "data_type_configurations": [
              {
                "collection_frequency": 4,
                "data_type": "STATUS"
              },
              {
                "collection_frequency": 7,
                "data_type": "STATISTICS"
              },
              {
                "collection_frequency": 1,
                "data_type": "STATISTICS"
              },
              {
                "collection_frequency": 4,
                "data_type": "STATUS"
              },
              {
                "collection_frequency": 1,
                "data_type": "STATUS"
              },
              {
                "collection_frequency": 8,
                "data_type": "STATUS"
              },
              {
                "collection_frequency": 7,
                "data_type": "STATUS"
              },
              {
                "collection_frequency": 2,
                "data_type": "STATISTICS"
              },
              {
                "collection_frequency": 6,
                "data_type": "STATUS"
              }
            ]
          },
          {
            "client_type": "EDGE",
            "data_type_configurations": [
              {
                "collection_frequency": 3,
                "data_type": "STATUS"
              },
              {
                "collection_frequency": 5,
                "data_type": "STATUS"
              },
              {
                "collection_frequency": 7,
                "data_type": "STATISTICS"
              },
              {
                "collection_frequency": 1,
                "data_type": "STATUS"
              },
              {
                "collection_frequency": 7,
                "data_type": "STATUS"
              },
              {
                "collection_frequency": 1,
                "data_type": "STATUS"
              },
              {
                "collection_frequency": 7,
                "data_type": "STATISTICS"
              },
              {
                "collection_frequency": 3,
                "data_type": "STATISTICS"
              },
              {
                "collection_frequency": 3,
                "data_type": "STATISTICS"
              }
            ]
          },
          {
            "client_type": "MANAGEMENT_PLANE_PLATFORM",
            "data_type_configurations": [
              {
                "collection_frequency": 8,
                "data_type": "STATISTICS"
              }
            ]
          },
          {
            "client_type": "CONTROL_PLANE",
            "data_type_configurations": [
              {
                "collection_frequency": 8,
                "data_type": "STATUS"
              },
              {
                "collection_frequency": 5,
                "data_type": "STATISTICS"
              },
              {
                "collection_frequency": 3,
                "data_type": "STATUS"
              },
              {
                "collection_frequency": 6,
                "data_type": "STATUS"
              },
              {
                "collection_frequency": 8,
                "data_type": "STATISTICS"
              },
              {
                "collection_frequency": 2,
                "data_type": "STATISTICS"
              },
              {
                "collection_frequency": 7,
                "data_type": "STATUS"
              },
              {
                "collection_frequency": 3,
                "data_type": "STATISTICS"
              },
              {
                "collection_frequency": 7,
                "data_type": "STATISTICS"
              }
            ]
          },
          {
            "client_type": "HYPERVISOR",
            "data_type_configurations": [
              {
                "collection_frequency": 7,
                "data_type": "STATISTICS"
              },
              {
                "collection_frequency": 4,
                "data_type": "STATISTICS"
              },
              {
                "collection_frequency": 4,
                "data_type": "STATISTICS"
              },
              {
                "collection_frequency": 3,
                "data_type": "STATISTICS"
              },
              {
                "collection_frequency": 7,
                "data_type": "STATUS"
              },
              {
                "collection_frequency": 10,
                "data_type": "STATISTICS"
              }
            ]
          }
        ]
      }
    ]
  },
  "is_data_collection_enabled": false,
  "aggregated_data_collection_frequency": 5
}