{
  "_self": {
    "action": "string",
    "href": "string",
    "rel": "string"
  },
  "_links": [
    {
      "action": "string",
      "href": "string",
      "rel": "string"
    }
  ],
  "_schema": "string",
  "cursor": "string",
  "sort_ascending": false,
  "sort_by": "string",
  "result_count": 9,
  "results": [
    {
      "_self": {
        "action": "string",
        "href": "string",
        "rel": "string"
      },
      "_links": [
        {
          "action": "string",
          "href": "string",
          "rel": "string"
        },
        {
          "action": "string",
          "href": "string",
          "rel": "string"
        }
      ],
      "_schema": "string",
      "_revision": 8,
      "_system_owned": false,
      "display_name": "string",
      "description": "string",
      "tags": [
        {
          "scope": "string",
          "tag": "string"
        },
        {
          "scope": "string",
          "tag": "string"
        }
      ],
      "_create_user": "string",
      "_protection": "string",
      "_create_time": 8,
      "_last_modified_time": 2,
      "_last_modified_user": "string",
      "id": "string",
      "resource_type": "RealizedNSService",
      "path": "string",
      "relative_path": "string",
      "intent_reference": [
        "string",
        "string"
      ],
      "realization_specific_identifier": "string",
      "state": "UNAVAILABLE",
      "alarms": [
        {
          "_self": {
            "action": "string",
            "href": "string",
            "rel": "string"
          },
          "_links": [
            {
              "action": "string",
              "href": "string",
              "rel": "string"
            },
            {
              "action": "string",
              "href": "string",
              "rel": "string"
            },
            {
              "action": "string",
              "href": "string",
              "rel": "string"
            },
            {
              "action": "string",
              "href": "string",
              "rel": "string"
            }
          ],
          "_schema": "string",
          "_revision": 5,
          "_system_owned": false,
          "display_name": "string",
          "description": "string",
          "tags": [
            {
              "scope": "string",
              "tag": "string"
            },
            {
              "scope": "string",
              "tag": "string"
            },
            {
              "scope": "string",
              "tag": "string"
            },
            {
              "scope": "string",
              "tag": "string"
            },
            {
              "scope": "string",
              "tag": "string"
            },
            {
              "scope": "string",
              "tag": "string"
            },
            {
              "scope": "string",
              "tag": "string"
            }
          ],
          "_create_user": "string",
          "_protection": "string",
          "_create_time": 6,
          "_last_modified_time": 5,
          "_last_modified_user": "string",
          "id": "string",
          "resource_type": "string",
          "path": "string",
          "relative_path": "string",
          "message": "string"
        }
      ],
      "service_type": "SERVICE_GROUP"
    },
    {
      "_self": {
        "action": "string",
        "href": "string",
        "rel": "string"
      },
      "_links": [
        {
          "action": "string",
          "href": "string",
          "rel": "string"
        },
        {
          "action": "string",
          "href": "string",
          "rel": "string"
        },
        {
          "action": "string",
          "href": "string",
          "rel": "string"
        },
        {
          "action": "string",
          "href": "string",
          "rel": "string"
        },
        {
          "action": "string",
          "href": "string",
          "rel": "string"
        },
        {
          "action": "string",
          "href": "string",
          "rel": "string"
        }
      ],
      "_schema": "string",
      "_revision": 6,
      "_system_owned": true,
      "display_name": "string",
      "description": "string",
      "tags": [
        {
          "scope": "string",
          "tag": "string"
        },
        {
          "scope": "string",
          "tag": "string"
        },
        {
          "scope": "string",
          "tag": "string"
        },
        {
          "scope": "string",
          "tag": "string"
        },
        {
          "scope": "string",
          "tag": "string"
        },
        {
          "scope": "string",
          "tag": "string"
        }
      ],
      "_create_user": "string",
      "_protection": "string",
      "_create_time": 5,
      "_last_modified_time": 1,
      "_last_modified_user": "string",
      "id": "string",
      "resource_type": "RealizedNSService",
      "path": "string",
      "relative_path": "string",
      "intent_reference": [
        "string",
        "string",
        "string",
        "string",
        "string",
        "string",
        "string",
        "string",
        "string",
        "string"
      ],
      "realization_specific_identifier": "string",
      "state": "REALIZED",
      "alarms": [
        {
          "_self": {
            "action": "string",
            "href": "string",
            "rel": "string"
          },
          "_links": [
            {
              "action": "string",
              "href": "string",
              "rel": "string"
            },
            {
              "action": "string",
              "href": "string",
              "rel": "string"
            },
            {
              "action": "string",
              "href": "string",
              "rel": "string"
            },
            {
              "action": "string",
              "href": "string",
              "rel": "string"
            },
            {
              "action": "string",
              "href": "string",
              "rel": "string"
            },
            {
              "action": "string",
              "href": "string",
              "rel": "string"
            },
            {
              "action": "string",
              "href": "string",
              "rel": "string"
            }
          ],
          "_schema": "string",
          "_revision": 10,
          "_system_owned": false,
          "display_name": "string",
          "description": "string",
          "tags": [
            {
              "scope": "string",
              "tag": "string"
            },
            {
              "scope": "string",
              "tag": "string"
            },
            {
              "scope": "string",
              "tag": "string"
            },
            {
              "scope": "string",
              "tag": "string"
            },
            {
              "scope": "string",
              "tag": "string"
            },
            {
              "scope": "string",
              "tag": "string"
            },
            {
              "scope": "string",
              "tag": "string"
            },
            {
              "scope": "string",
              "tag": "string"
            },
            {
              "scope": "string",
              "tag": "string"
            },
            {
              "scope": "string",
              "tag": "string"
            }
          ],
          "_create_user": "string",
          "_protection": "string",
          "_create_time": 9,
          "_last_modified_time": 1,
          "_last_modified_user": "string",
          "id": "string",
          "resource_type": "string",
          "path": "string",
          "relative_path": "string",
          "message": "string"
        },
        {
          "_self": {
            "action": "string",
            "href": "string",
            "rel": "string"
          },
          "_links": [
            {
              "action": "string",
              "href": "string",
              "rel": "string"
            },
            {
              "action": "string",
              "href": "string",
              "rel": "string"
            }
          ],
          "_schema": "string",
          "_revision": 3,
          "_system_owned": false,
          "display_name": "string",
          "description": "string",
          "tags": [
            {
              "scope": "string",
              "tag": "string"
            },
            {
              "scope": "string",
              "tag": "string"
            }
          ],
          "_create_user": "string",
          "_protection": "string",
          "_create_time": 8,
          "_last_modified_time": 4,
          "_last_modified_user": "string",
          "id": "string",
          "resource_type": "string",
          "path": "string",
          "relative_path": "string",
          "message": "string"
        },
        {
          "_self": {
            "action": "string",
            "href": "string",
            "rel": "string"
          },
          "_links": [
            {
              "action": "string",
              "href": "string",
              "rel": "string"
            },
            {
              "action": "string",
              "href": "string",
              "rel": "string"
            }
          ],
          "_schema": "string",
          "_revision": 6,
          "_system_owned": true,
          "display_name": "string",
          "description": "string",
          "tags": [
            {
              "scope": "string",
              "tag": "string"
            },
            {
              "scope": "string",
              "tag": "string"
            },
            {
              "scope": "string",
              "tag": "string"
            },
            {
              "scope": "string",
              "tag": "string"
            },
            {
              "scope": "string",
              "tag": "string"
            }
          ],
          "_create_user": "string",
          "_protection": "string",
          "_create_time": 1,
          "_last_modified_time": 10,
          "_last_modified_user": "string",
          "id": "string",
          "resource_type": "string",
          "path": "string",
          "relative_path": "string",
          "message": "string"
        },
        {
          "_self": {
            "action": "string",
            "href": "string",
            "rel": "string"
          },
          "_links": [
            {
              "action": "string",
              "href": "string",
              "rel": "string"
            },
            {
              "action": "string",
              "href": "string",
              "rel": "string"
            },
            {
              "action": "string",
              "href": "string",
              "rel": "string"
            },
            {
              "action": "string",
              "href": "string",
              "rel": "string"
            }
          ],
          "_schema": "string",
          "_revision": 5,
          "_system_owned": false,
          "display_name": "string",
          "description": "string",
          "tags": [
            {
              "scope": "string",
              "tag": "string"
            },
            {
              "scope": "string",
              "tag": "string"
            },
            {
              "scope": "string",
              "tag": "string"
            },
            {
              "scope": "string",
              "tag": "string"
            },
            {
              "scope": "string",
              "tag": "string"
            },
            {
              "scope": "string",
              "tag": "string"
            },
            {
              "scope": "string",
              "tag": "string"
            }
          ],
          "_create_user": "string",
          "_protection": "string",
          "_create_time": 1,
          "_last_modified_time": 8,
          "_last_modified_user": "string",
          "id": "string",
          "resource_type": "string",
          "path": "string",
          "relative_path": "string",
          "message": "string"
        },
        {
          "_self": {
            "action": "string",
            "href": "string",
            "rel": "string"
          },
          "_links": [
            {
              "action": "string",
              "href": "string",
              "rel": "string"
            },
            {
              "action": "string",
              "href": "string",
              "rel": "string"
            },
            {
              "action": "string",
              "href": "string",
              "rel": "string"
            },
            {
              "action": "string",
              "href": "string",
              "rel": "string"
            }
          ],
          "_schema": "string",
          "_revision": 9,
          "_system_owned": true,
          "display_name": "string",
          "description": "string",
          "tags": [
            {
              "scope": "string",
              "tag": "string"
            },
            {
              "scope": "string",
              "tag": "string"
            },
            {
              "scope": "string",
              "tag": "string"
            },
            {
              "scope": "string",
              "tag": "string"
            },
            {
              "scope": "string",
              "tag": "string"
            }
          ],
          "_create_user": "string",
          "_protection": "string",
          "_create_time": 3,
          "_last_modified_time": 2,
          "_last_modified_user": "string",
          "id": "string",
          "resource_type": "string",
          "path": "string",
          "relative_path": "string",
          "message": "string"
        },
        {
          "_self": {
            "action": "string",
            "href": "string",
            "rel": "string"
          },
          "_links": [
            {
              "action": "string",
              "href": "string",
              "rel": "string"
            },
            {
              "action": "string",
              "href": "string",
              "rel": "string"
            }
          ],
          "_schema": "string",
          "_revision": 4,
          "_system_owned": true,
          "display_name": "string",
          "description": "string",
          "tags": [
            {
              "scope": "string",
              "tag": "string"
            },
            {
              "scope": "string",
              "tag": "string"
            },
            {
              "scope": "string",
              "tag": "string"
            }
          ],
          "_create_user": "string",
          "_protection": "string",
          "_create_time": 1,
          "_last_modified_time": 3,
          "_last_modified_user": "string",
          "id": "string",
          "resource_type": "string",
          "path": "string",
          "relative_path": "string",
          "message": "string"
        }
      ],
      "service_type": "SERVICE_GROUP"
    },
    {
      "_self": {
        "action": "string",
        "href": "string",
        "rel": "string"
      },
      "_links": [
        {
          "action": "string",
          "href": "string",
          "rel": "string"
        },
        {
          "action": "string",
          "href": "string",
          "rel": "string"
        },
        {
          "action": "string",
          "href": "string",
          "rel": "string"
        },
        {
          "action": "string",
          "href": "string",
          "rel": "string"
        },
        {
          "action": "string",
          "href": "string",
          "rel": "string"
        },
        {
          "action": "string",
          "href": "string",
          "rel": "string"
        },
        {
          "action": "string",
          "href": "string",
          "rel": "string"
        },
        {
          "action": "string",
          "href": "string",
          "rel": "string"
        }
      ],
      "_schema": "string",
      "_revision": 4,
      "_system_owned": false,
      "display_name": "string",
      "description": "string",
      "tags": [
        {
          "scope": "string",
          "tag": "string"
        },
        {
          "scope": "string",
          "tag": "string"
        },
        {
          "scope": "string",
          "tag": "string"
        },
        {
          "scope": "string",
          "tag": "string"
        },
        {
          "scope": "string",
          "tag": "string"
        },
        {
          "scope": "string",
          "tag": "string"
        }
      ],
      "_create_user": "string",
      "_protection": "string",
      "_create_time": 1,
      "_last_modified_time": 10,
      "_last_modified_user": "string",
      "id": "string",
      "resource_type": "RealizedNSService",
      "path": "string",
      "relative_path": "string",
      "intent_reference": [
        "string",
        "string"
      ],
      "realization_specific_identifier": "string",
      "state": "REALIZED",
      "alarms": [
        {
          "_self": {
            "action": "string",
            "href": "string",
            "rel": "string"
          },
          "_links": [
            {
              "action": "string",
              "href": "string",
              "rel": "string"
            },
            {
              "action": "string",
              "href": "string",
              "rel": "string"
            },
            {
              "action": "string",
              "href": "string",
              "rel": "string"
            }
          ],
          "_schema": "string",
          "_revision": 1,
          "_system_owned": true,
          "display_name": "string",
          "description": "string",
          "tags": [
            {
              "scope": "string",
              "tag": "string"
            }
          ],
          "_create_user": "string",
          "_protection": "string",
          "_create_time": 7,
          "_last_modified_time": 10,
          "_last_modified_user": "string",
          "id": "string",
          "resource_type": "string",
          "path": "string",
          "relative_path": "string",
          "message": "string"
        },
        {
          "_self": {
            "action": "string",
            "href": "string",
            "rel": "string"
          },
          "_links": [
            {
              "action": "string",
              "href": "string",
              "rel": "string"
            },
            {
              "action": "string",
              "href": "string",
              "rel": "string"
            },
            {
              "action": "string",
              "href": "string",
              "rel": "string"
            }
          ],
          "_schema": "string",
          "_revision": 1,
          "_system_owned": false,
          "display_name": "string",
          "description": "string",
          "tags": [
            {
              "scope": "string",
              "tag": "string"
            },
            {
              "scope": "string",
              "tag": "string"
            },
            {
              "scope": "string",
              "tag": "string"
            },
            {
              "scope": "string",
              "tag": "string"
            },
            {
              "scope": "string",
              "tag": "string"
            },
            {
              "scope": "string",
              "tag": "string"
            },
            {
              "scope": "string",
              "tag": "string"
            },
            {
              "scope": "string",
              "tag": "string"
            }
          ],
          "_create_user": "string",
          "_protection": "string",
          "_create_time": 5,
          "_last_modified_time": 7,
          "_last_modified_user": "string",
          "id": "string",
          "resource_type": "string",
          "path": "string",
          "relative_path": "string",
          "message": "string"
        }
      ],
      "service_type": "SERVICE_GROUP"
    },
    {
      "_self": {
        "action": "string",
        "href": "string",
        "rel": "string"
      },
      "_links": [
        {
          "action": "string",
          "href": "string",
          "rel": "string"
        },
        {
          "action": "string",
          "href": "string",
          "rel": "string"
        }
      ],
      "_schema": "string",
      "_revision": 10,
      "_system_owned": false,
      "display_name": "string",
      "description": "string",
      "tags": [
        {
          "scope": "string",
          "tag": "string"
        },
        {
          "scope": "string",
          "tag": "string"
        },
        {
          "scope": "string",
          "tag": "string"
        },
        {
          "scope": "string",
          "tag": "string"
        }
      ],
      "_create_user": "string",
      "_protection": "string",
      "_create_time": 3,
      "_last_modified_time": 6,
      "_last_modified_user": "string",
      "id": "string",
      "resource_type": "RealizedNSService",
      "path": "string",
      "relative_path": "string",
      "intent_reference": [
        "string",
        "string",
        "string",
        "string",
        "string",
        "string",
        "string",
        "string",
        "string",
        "string"
      ],
      "realization_specific_identifier": "string",
      "state": "UNAVAILABLE",
      "alarms": [
        {
          "_self": {
            "action": "string",
            "href": "string",
            "rel": "string"
          },
          "_links": [
            {
              "action": "string",
              "href": "string",
              "rel": "string"
            },
            {
              "action": "string",
              "href": "string",
              "rel": "string"
            }
          ],
          "_schema": "string",
          "_revision": 10,
          "_system_owned": false,
          "display_name": "string",
          "description": "string",
          "tags": [
            {
              "scope": "string",
              "tag": "string"
            },
            {
              "scope": "string",
              "tag": "string"
            },
            {
              "scope": "string",
              "tag": "string"
            },
            {
              "scope": "string",
              "tag": "string"
            },
            {
              "scope": "string",
              "tag": "string"
            },
            {
              "scope": "string",
              "tag": "string"
            },
            {
              "scope": "string",
              "tag": "string"
            },
            {
              "scope": "string",
              "tag": "string"
            }
          ],
          "_create_user": "string",
          "_protection": "string",
          "_create_time": 10,
          "_last_modified_time": 2,
          "_last_modified_user": "string",
          "id": "string",
          "resource_type": "string",
          "path": "string",
          "relative_path": "string",
          "message": "string"
        },
        {
          "_self": {
            "action": "string",
            "href": "string",
            "rel": "string"
          },
          "_links": [
            {
              "action": "string",
              "href": "string",
              "rel": "string"
            },
            {
              "action": "string",
              "href": "string",
              "rel": "string"
            },
            {
              "action": "string",
              "href": "string",
              "rel": "string"
            },
            {
              "action": "string",
              "href": "string",
              "rel": "string"
            },
            {
              "action": "string",
              "href": "string",
              "rel": "string"
            },
            {
              "action": "string",
              "href": "string",
              "rel": "string"
            },
            {
              "action": "string",
              "href": "string",
              "rel": "string"
            },
            {
              "action": "string",
              "href": "string",
              "rel": "string"
            },
            {
              "action": "string",
              "href": "string",
              "rel": "string"
            }
          ],
          "_schema": "string",
          "_revision": 5,
          "_system_owned": true,
          "display_name": "string",
          "description": "string",
          "tags": [
            {
              "scope": "string",
              "tag": "string"
            },
            {
              "scope": "string",
              "tag": "string"
            },
            {
              "scope": "string",
              "tag": "string"
            },
            {
              "scope": "string",
              "tag": "string"
            },
            {
              "scope": "string",
              "tag": "string"
            },
            {
              "scope": "string",
              "tag": "string"
            },
            {
              "scope": "string",
              "tag": "string"
            },
            {
              "scope": "string",
              "tag": "string"
            },
            {
              "scope": "string",
              "tag": "string"
            },
            {
              "scope": "string",
              "tag": "string"
            }
          ],
          "_create_user": "string",
          "_protection": "string",
          "_create_time": 10,
          "_last_modified_time": 3,
          "_last_modified_user": "string",
          "id": "string",
          "resource_type": "string",
          "path": "string",
          "relative_path": "string",
          "message": "string"
        }
      ],
      "service_type": "SERVICE"
    }
  ]
}