{
  "state": "partial_success",
  "details": [
    {
      "sub_system_address": "string",
      "state": "partial_success",
      "sub_system_type": "string",
      "failure_message": "string",
      "failure_code": 9,
      "sub_system_id": "string"
    },
    {
      "sub_system_address": "string",
      "state": "success",
      "sub_system_type": "string",
      "failure_message": "string",
      "failure_code": 5,
      "sub_system_id": "string"
    },
    {
      "sub_system_address": "string",
      "state": "partial_success",
      "sub_system_type": "string",
      "failure_message": "string",
      "failure_code": 1,
      "sub_system_id": "string"
    },
    {
      "sub_system_address": "string",
      "state": "success",
      "sub_system_type": "string",
      "failure_message": "string",
      "failure_code": 8,
      "sub_system_id": "string"
    },
    {
      "sub_system_address": "string",
      "state": "success",
      "sub_system_type": "string",
      "failure_message": "string",
      "failure_code": 6,
      "sub_system_id": "string"
    },
    {
      "sub_system_address": "string",
      "state": "partial_success",
      "sub_system_type": "string",
      "failure_message": "string",
      "failure_code": 9,
      "sub_system_id": "string"
    },
    {
      "sub_system_address": "string",
      "state": "failed",
      "sub_system_type": "string",
      "failure_message": "string",
      "failure_code": 6,
      "sub_system_id": "string"
    },
    {
      "sub_system_address": "string",
      "state": "failed",
      "sub_system_type": "string",
      "failure_message": "string",
      "failure_code": 3,
      "sub_system_id": "string"
    }
  ],
  "failure_code": 3,
  "failure_message": "string",
  "revision_desired": 8
}