{
  "actions": [
    {
      "name": "postLogicalRouterslogicalRouterIdroutingstaticRoutes",
      "protocol": "REST",
      "method": "POST",
      "entitypath": "{base_path}/{version}/logical-routers/{pathv1}/routing/static-routes?{query}",
      "requestSchema": "schema.json",
      "responseSchema": "schema.json",
      "timeout": 0,
      "sendEmpty": false,
      "sendGetBody": false,
      "requestDatatype": "JSON",
      "responseDatatype": "JSON",
      "headers": {},
      "responseObjects": [
        {
          "type": "default",
          "key": "",
          "mockFile": "mockdatafiles/postLogicalRouterslogicalRouterIdroutingstaticRoutes-default.json"
        }
      ]
    },
    {
      "name": "getLogicalRouterslogicalRouterIdroutingstaticRoutes",
      "protocol": "REST",
      "method": "GET",
      "entitypath": "{base_path}/{version}/logical-routers/{pathv1}/routing/static-routes?{query}",
      "requestSchema": "schema.json",
      "responseSchema": "schema.json",
      "timeout": 0,
      "sendEmpty": false,
      "sendGetBody": false,
      "requestDatatype": "JSON",
      "responseDatatype": "JSON",
      "headers": {},
      "responseObjects": [
        {
          "type": "default",
          "key": "",
          "mockFile": "mockdatafiles/getLogicalRouterslogicalRouterIdroutingstaticRoutes-default.json"
        }
      ]
    },
    {
      "name": "postLogicalRouters",
      "protocol": "REST",
      "method": "POST",
      "entitypath": "{base_path}/{version}/logical-routers?{query}",
      "requestSchema": "schema.json",
      "responseSchema": "schema.json",
      "timeout": 0,
      "sendEmpty": false,
      "sendGetBody": false,
      "requestDatatype": "JSON",
      "responseDatatype": "JSON",
      "headers": {},
      "responseObjects": [
        {
          "type": "default",
          "key": "",
          "mockFile": "mockdatafiles/postLogicalRouters-default.json"
        }
      ]
    },
    {
      "name": "getLogicalRouters",
      "protocol": "REST",
      "method": "GET",
      "entitypath": "{base_path}/{version}/logical-routers?{query}",
      "requestSchema": "schema.json",
      "responseSchema": "schema.json",
      "timeout": 0,
      "sendEmpty": false,
      "sendGetBody": false,
      "requestDatatype": "JSON",
      "responseDatatype": "JSON",
      "headers": {},
      "responseObjects": [
        {
          "type": "default",
          "key": "",
          "mockFile": "mockdatafiles/getLogicalRouters-default.json"
        }
      ]
    },
    {
      "name": "getLogicalRouterslogicalRouterIdroutingforwardingTable",
      "protocol": "REST",
      "method": "GET",
      "entitypath": "{base_path}/{version}/logical-routers/{pathv1}/routing/forwarding-table?{query}",
      "requestSchema": "schema.json",
      "responseSchema": "schema.json",
      "timeout": 0,
      "sendEmpty": false,
      "sendGetBody": false,
      "requestDatatype": "JSON",
      "responseDatatype": "JSON",
      "headers": {},
      "responseObjects": [
        {
          "type": "default",
          "key": "",
          "mockFile": "mockdatafiles/getLogicalRouterslogicalRouterIdroutingforwardingTable-default.json"
        }
      ]
    },
    {
      "name": "postLogicalRouterslogicalRouterIdroutingrouteMaps",
      "protocol": "REST",
      "method": "POST",
      "entitypath": "{base_path}/{version}/logical-routers/{pathv1}/routing/route-maps?{query}",
      "requestSchema": "schema.json",
      "responseSchema": "schema.json",
      "timeout": 0,
      "sendEmpty": false,
      "sendGetBody": false,
      "requestDatatype": "JSON",
      "responseDatatype": "JSON",
      "headers": {},
      "responseObjects": [
        {
          "type": "default",
          "key": "",
          "mockFile": "mockdatafiles/postLogicalRouterslogicalRouterIdroutingrouteMaps-default.json"
        }
      ]
    },
    {
      "name": "getLogicalRouterslogicalRouterIdroutingrouteMaps",
      "protocol": "REST",
      "method": "GET",
      "entitypath": "{base_path}/{version}/logical-routers/{pathv1}/routing/route-maps?{query}",
      "requestSchema": "schema.json",
      "responseSchema": "schema.json",
      "timeout": 0,
      "sendEmpty": false,
      "sendGetBody": false,
      "requestDatatype": "JSON",
      "responseDatatype": "JSON",
      "headers": {},
      "responseObjects": [
        {
          "type": "default",
          "key": "",
          "mockFile": "mockdatafiles/getLogicalRouterslogicalRouterIdroutingrouteMaps-default.json"
        }
      ]
    },
    {
      "name": "getLogicalRouterslogicalRouterIdnatrulesruleIdstatistics",
      "protocol": "REST",
      "method": "GET",
      "entitypath": "{base_path}/{version}/logical-routers/{pathv1}/nat/rules/{pathv2}/statistics?{query}",
      "requestSchema": "schema.json",
      "responseSchema": "schema.json",
      "timeout": 0,
      "sendEmpty": false,
      "sendGetBody": false,
      "requestDatatype": "JSON",
      "responseDatatype": "JSON",
      "headers": {},
      "responseObjects": [
        {
          "type": "default",
          "key": "",
          "mockFile": "mockdatafiles/getLogicalRouterslogicalRouterIdnatrulesruleIdstatistics-default.json"
        }
      ]
    },
    {
      "name": "getLogicalRouterslogicalRouterIdroutingrouteTableformatcsv",
      "protocol": "REST",
      "method": "GET",
      "entitypath": "{base_path}/{version}/logical-routers/{pathv1}/routing/route-table?{query}",
      "requestSchema": "schema.json",
      "responseSchema": "schema.json",
      "timeout": 0,
      "sendEmpty": false,
      "sendGetBody": false,
      "requestDatatype": "JSON",
      "responseDatatype": "JSON",
      "headers": {},
      "responseObjects": [
        {
          "type": "default",
          "key": "",
          "mockFile": "mockdatafiles/getLogicalRouterslogicalRouterIdroutingrouteTableformatcsv-default.json"
        }
      ]
    },
    {
      "name": "putLogicalRouterslogicalRouterIdroutingstaticRoutesbfdPeersbfdPeerId",
      "protocol": "REST",
      "method": "PUT",
      "entitypath": "{base_path}/{version}/logical-routers/{pathv1}/routing/static-routes/bfd-peers/{pathv2}?{query}",
      "requestSchema": "schema.json",
      "responseSchema": "schema.json",
      "timeout": 0,
      "sendEmpty": false,
      "sendGetBody": false,
      "requestDatatype": "JSON",
      "responseDatatype": "JSON",
      "headers": {},
      "responseObjects": [
        {
          "type": "default",
          "key": "",
          "mockFile": "mockdatafiles/putLogicalRouterslogicalRouterIdroutingstaticRoutesbfdPeersbfdPeerId-default.json"
        }
      ]
    },
    {
      "name": "getLogicalRouterslogicalRouterIdroutingstaticRoutesbfdPeersbfdPeerId",
      "protocol": "REST",
      "method": "GET",
      "entitypath": "{base_path}/{version}/logical-routers/{pathv1}/routing/static-routes/bfd-peers/{pathv2}?{query}",
      "requestSchema": "schema.json",
      "responseSchema": "schema.json",
      "timeout": 0,
      "sendEmpty": false,
      "sendGetBody": false,
      "requestDatatype": "JSON",
      "responseDatatype": "JSON",
      "headers": {},
      "responseObjects": [
        {
          "type": "default",
          "key": "",
          "mockFile": "mockdatafiles/getLogicalRouterslogicalRouterIdroutingstaticRoutesbfdPeersbfdPeerId-default.json"
        }
      ]
    },
    {
      "name": "deleteLogicalRouterslogicalRouterIdroutingstaticRoutesbfdPeersbfdPeerId",
      "protocol": "REST",
      "method": "DELETE",
      "entitypath": "{base_path}/{version}/logical-routers/{pathv1}/routing/static-routes/bfd-peers/{pathv2}?{query}",
      "requestSchema": "schema.json",
      "responseSchema": "schema.json",
      "timeout": 0,
      "sendEmpty": false,
      "sendGetBody": false,
      "requestDatatype": "JSON",
      "responseDatatype": "JSON",
      "headers": {},
      "responseObjects": [
        {
          "type": "default",
          "key": "",
          "mockFile": ""
        }
      ]
    },
    {
      "name": "getLogicalRouterslogicalRouterIdstatus",
      "protocol": "REST",
      "method": "GET",
      "entitypath": "{base_path}/{version}/logical-routers/{pathv1}/status?{query}",
      "requestSchema": "schema.json",
      "responseSchema": "schema.json",
      "timeout": 0,
      "sendEmpty": false,
      "sendGetBody": false,
      "requestDatatype": "JSON",
      "responseDatatype": "JSON",
      "headers": {},
      "responseObjects": [
        {
          "type": "default",
          "key": "",
          "mockFile": "mockdatafiles/getLogicalRouterslogicalRouterIdstatus-default.json"
        }
      ]
    },
    {
      "name": "postLogicalRouterslogicalRouterIdroutingipPrefixLists",
      "protocol": "REST",
      "method": "POST",
      "entitypath": "{base_path}/{version}/logical-routers/{pathv1}/routing/ip-prefix-lists?{query}",
      "requestSchema": "schema.json",
      "responseSchema": "schema.json",
      "timeout": 0,
      "sendEmpty": false,
      "sendGetBody": false,
      "requestDatatype": "JSON",
      "responseDatatype": "JSON",
      "headers": {},
      "responseObjects": [
        {
          "type": "default",
          "key": "",
          "mockFile": "mockdatafiles/postLogicalRouterslogicalRouterIdroutingipPrefixLists-default.json"
        }
      ]
    },
    {
      "name": "getLogicalRouterslogicalRouterIdroutingipPrefixLists",
      "protocol": "REST",
      "method": "GET",
      "entitypath": "{base_path}/{version}/logical-routers/{pathv1}/routing/ip-prefix-lists?{query}",
      "requestSchema": "schema.json",
      "responseSchema": "schema.json",
      "timeout": 0,
      "sendEmpty": false,
      "sendGetBody": false,
      "requestDatatype": "JSON",
      "responseDatatype": "JSON",
      "headers": {},
      "responseObjects": [
        {
          "type": "default",
          "key": "",
          "mockFile": "mockdatafiles/getLogicalRouterslogicalRouterIdroutingipPrefixLists-default.json"
        }
      ]
    },
    {
      "name": "putLogicalRouterslogicalRouterIdroutingredistribution",
      "protocol": "REST",
      "method": "PUT",
      "entitypath": "{base_path}/{version}/logical-routers/{pathv1}/routing/redistribution?{query}",
      "requestSchema": "schema.json",
      "responseSchema": "schema.json",
      "timeout": 0,
      "sendEmpty": false,
      "sendGetBody": false,
      "requestDatatype": "JSON",
      "responseDatatype": "JSON",
      "headers": {},
      "responseObjects": [
        {
          "type": "default",
          "key": "",
          "mockFile": "mockdatafiles/putLogicalRouterslogicalRouterIdroutingredistribution-default.json"
        }
      ]
    },
    {
      "name": "getLogicalRouterslogicalRouterIdroutingredistribution",
      "protocol": "REST",
      "method": "GET",
      "entitypath": "{base_path}/{version}/logical-routers/{pathv1}/routing/redistribution?{query}",
      "requestSchema": "schema.json",
      "responseSchema": "schema.json",
      "timeout": 0,
      "sendEmpty": false,
      "sendGetBody": false,
      "requestDatatype": "JSON",
      "responseDatatype": "JSON",
      "headers": {},
      "responseObjects": [
        {
          "type": "default",
          "key": "",
          "mockFile": "mockdatafiles/getLogicalRouterslogicalRouterIdroutingredistribution-default.json"
        }
      ]
    },
    {
      "name": "putDhcprelaysrelayId",
      "protocol": "REST",
      "method": "PUT",
      "entitypath": "{base_path}/{version}/dhcp/relays/{pathv1}?{query}",
      "requestSchema": "schema.json",
      "responseSchema": "schema.json",
      "timeout": 0,
      "sendEmpty": false,
      "sendGetBody": false,
      "requestDatatype": "JSON",
      "responseDatatype": "JSON",
      "headers": {},
      "responseObjects": [
        {
          "type": "default",
          "key": "",
          "mockFile": "mockdatafiles/putDhcprelaysrelayId-default.json"
        }
      ]
    },
    {
      "name": "getDhcprelaysrelayId",
      "protocol": "REST",
      "method": "GET",
      "entitypath": "{base_path}/{version}/dhcp/relays/{pathv1}?{query}",
      "requestSchema": "schema.json",
      "responseSchema": "schema.json",
      "timeout": 0,
      "sendEmpty": false,
      "sendGetBody": false,
      "requestDatatype": "JSON",
      "responseDatatype": "JSON",
      "headers": {},
      "responseObjects": [
        {
          "type": "default",
          "key": "",
          "mockFile": "mockdatafiles/getDhcprelaysrelayId-default.json"
        }
      ]
    },
    {
      "name": "deleteDhcprelaysrelayId",
      "protocol": "REST",
      "method": "DELETE",
      "entitypath": "{base_path}/{version}/dhcp/relays/{pathv1}?{query}",
      "requestSchema": "schema.json",
      "responseSchema": "schema.json",
      "timeout": 0,
      "sendEmpty": false,
      "sendGetBody": false,
      "requestDatatype": "JSON",
      "responseDatatype": "JSON",
      "headers": {},
      "responseObjects": [
        {
          "type": "default",
          "key": "",
          "mockFile": ""
        }
      ]
    },
    {
      "name": "putLogicalRouterslogicalRouterIdroutingstaticRoutesid",
      "protocol": "REST",
      "method": "PUT",
      "entitypath": "{base_path}/{version}/logical-routers/{pathv1}/routing/static-routes/{pathv2}?{query}",
      "requestSchema": "schema.json",
      "responseSchema": "schema.json",
      "timeout": 0,
      "sendEmpty": false,
      "sendGetBody": false,
      "requestDatatype": "JSON",
      "responseDatatype": "JSON",
      "headers": {},
      "responseObjects": [
        {
          "type": "default",
          "key": "",
          "mockFile": "mockdatafiles/putLogicalRouterslogicalRouterIdroutingstaticRoutesid-default.json"
        }
      ]
    },
    {
      "name": "getLogicalRouterslogicalRouterIdroutingstaticRoutesid",
      "protocol": "REST",
      "method": "GET",
      "entitypath": "{base_path}/{version}/logical-routers/{pathv1}/routing/static-routes/{pathv2}?{query}",
      "requestSchema": "schema.json",
      "responseSchema": "schema.json",
      "timeout": 0,
      "sendEmpty": false,
      "sendGetBody": false,
      "requestDatatype": "JSON",
      "responseDatatype": "JSON",
      "headers": {},
      "responseObjects": [
        {
          "type": "default",
          "key": "",
          "mockFile": "mockdatafiles/getLogicalRouterslogicalRouterIdroutingstaticRoutesid-default.json"
        }
      ]
    },
    {
      "name": "deleteLogicalRouterslogicalRouterIdroutingstaticRoutesid",
      "protocol": "REST",
      "method": "DELETE",
      "entitypath": "{base_path}/{version}/logical-routers/{pathv1}/routing/static-routes/{pathv2}?{query}",
      "requestSchema": "schema.json",
      "responseSchema": "schema.json",
      "timeout": 0,
      "sendEmpty": false,
      "sendGetBody": false,
      "requestDatatype": "JSON",
      "responseDatatype": "JSON",
      "headers": {},
      "responseObjects": [
        {
          "type": "default",
          "key": "",
          "mockFile": ""
        }
      ]
    },
    {
      "name": "putDhcprelayProfilesrelayProfileId",
      "protocol": "REST",
      "method": "PUT",
      "entitypath": "{base_path}/{version}/dhcp/relay-profiles/{pathv1}?{query}",
      "requestSchema": "schema.json",
      "responseSchema": "schema.json",
      "timeout": 0,
      "sendEmpty": false,
      "sendGetBody": false,
      "requestDatatype": "JSON",
      "responseDatatype": "JSON",
      "headers": {},
      "responseObjects": [
        {
          "type": "default",
          "key": "",
          "mockFile": "mockdatafiles/putDhcprelayProfilesrelayProfileId-default.json"
        }
      ]
    },
    {
      "name": "deleteDhcprelayProfilesrelayProfileId",
      "protocol": "REST",
      "method": "DELETE",
      "entitypath": "{base_path}/{version}/dhcp/relay-profiles/{pathv1}?{query}",
      "requestSchema": "schema.json",
      "responseSchema": "schema.json",
      "timeout": 0,
      "sendEmpty": false,
      "sendGetBody": false,
      "requestDatatype": "JSON",
      "responseDatatype": "JSON",
      "headers": {},
      "responseObjects": [
        {
          "type": "default",
          "key": "",
          "mockFile": ""
        }
      ]
    },
    {
      "name": "getDhcprelayProfilesrelayProfileId",
      "protocol": "REST",
      "method": "GET",
      "entitypath": "{base_path}/{version}/dhcp/relay-profiles/{pathv1}?{query}",
      "requestSchema": "schema.json",
      "responseSchema": "schema.json",
      "timeout": 0,
      "sendEmpty": false,
      "sendGetBody": false,
      "requestDatatype": "JSON",
      "responseDatatype": "JSON",
      "headers": {},
      "responseObjects": [
        {
          "type": "default",
          "key": "",
          "mockFile": "mockdatafiles/getDhcprelayProfilesrelayProfileId-default.json"
        }
      ]
    },
    {
      "name": "postLogicalRouterslogicalRouterIdactionreprocess",
      "protocol": "REST",
      "method": "POST",
      "entitypath": "{base_path}/{version}/logical-routers/{pathv1}?{query}",
      "requestSchema": "schema.json",
      "responseSchema": "schema.json",
      "timeout": 0,
      "sendEmpty": false,
      "sendGetBody": false,
      "requestDatatype": "JSON",
      "responseDatatype": "JSON",
      "headers": {},
      "responseObjects": [
        {
          "type": "default",
          "key": "",
          "mockFile": ""
        }
      ]
    },
    {
      "name": "getLogicalRouterslogicalRouterIddebugInfoformattext",
      "protocol": "REST",
      "method": "GET",
      "entitypath": "{base_path}/{version}/logical-routers/{pathv1}/debug-info?{query}",
      "requestSchema": "schema.json",
      "responseSchema": "schema.json",
      "timeout": 0,
      "sendEmpty": false,
      "sendGetBody": false,
      "requestDatatype": "JSON",
      "responseDatatype": "JSON",
      "headers": {},
      "responseObjects": [
        {
          "type": "default",
          "key": "",
          "mockFile": ""
        }
      ]
    },
    {
      "name": "getLogicalRouterslogicalRouterIdroutingbgpneighborsstatus",
      "protocol": "REST",
      "method": "GET",
      "entitypath": "{base_path}/{version}/logical-routers/{pathv1}/routing/bgp/neighbors/status?{query}",
      "requestSchema": "schema.json",
      "responseSchema": "schema.json",
      "timeout": 0,
      "sendEmpty": false,
      "sendGetBody": false,
      "requestDatatype": "JSON",
      "responseDatatype": "JSON",
      "headers": {},
      "responseObjects": [
        {
          "type": "default",
          "key": "",
          "mockFile": "mockdatafiles/getLogicalRouterslogicalRouterIdroutingbgpneighborsstatus-default.json"
        }
      ]
    },
    {
      "name": "putLogicalRouterslogicalRouterIdroutingredistributionrules",
      "protocol": "REST",
      "method": "PUT",
      "entitypath": "{base_path}/{version}/logical-routers/{pathv1}/routing/redistribution/rules?{query}",
      "requestSchema": "schema.json",
      "responseSchema": "schema.json",
      "timeout": 0,
      "sendEmpty": false,
      "sendGetBody": false,
      "requestDatatype": "JSON",
      "responseDatatype": "JSON",
      "headers": {},
      "responseObjects": [
        {
          "type": "default",
          "key": "",
          "mockFile": "mockdatafiles/putLogicalRouterslogicalRouterIdroutingredistributionrules-default.json"
        }
      ]
    },
    {
      "name": "getLogicalRouterslogicalRouterIdroutingredistributionrules",
      "protocol": "REST",
      "method": "GET",
      "entitypath": "{base_path}/{version}/logical-routers/{pathv1}/routing/redistribution/rules?{query}",
      "requestSchema": "schema.json",
      "responseSchema": "schema.json",
      "timeout": 0,
      "sendEmpty": false,
      "sendGetBody": false,
      "requestDatatype": "JSON",
      "responseDatatype": "JSON",
      "headers": {},
      "responseObjects": [
        {
          "type": "default",
          "key": "",
          "mockFile": "mockdatafiles/getLogicalRouterslogicalRouterIdroutingredistributionrules-default.json"
        }
      ]
    },
    {
      "name": "postServices",
      "protocol": "REST",
      "method": "POST",
      "entitypath": "{base_path}/{version}/services?{query}",
      "requestSchema": "schema.json",
      "responseSchema": "schema.json",
      "timeout": 0,
      "sendEmpty": false,
      "sendGetBody": false,
      "requestDatatype": "JSON",
      "responseDatatype": "JSON",
      "headers": {},
      "responseObjects": [
        {
          "type": "default",
          "key": "",
          "mockFile": "mockdatafiles/postServices-default.json"
        }
      ]
    },
    {
      "name": "getServices",
      "protocol": "REST",
      "method": "GET",
      "entitypath": "{base_path}/{version}/services?{query}",
      "requestSchema": "schema.json",
      "responseSchema": "schema.json",
      "timeout": 0,
      "sendEmpty": false,
      "sendGetBody": false,
      "requestDatatype": "JSON",
      "responseDatatype": "JSON",
      "headers": {},
      "responseObjects": [
        {
          "type": "default",
          "key": "",
          "mockFile": "mockdatafiles/getServices-default.json"
        }
      ]
    },
    {
      "name": "postDhcprelayProfiles",
      "protocol": "REST",
      "method": "POST",
      "entitypath": "{base_path}/{version}/dhcp/relay-profiles?{query}",
      "requestSchema": "schema.json",
      "responseSchema": "schema.json",
      "timeout": 0,
      "sendEmpty": false,
      "sendGetBody": false,
      "requestDatatype": "JSON",
      "responseDatatype": "JSON",
      "headers": {},
      "responseObjects": [
        {
          "type": "default",
          "key": "",
          "mockFile": "mockdatafiles/postDhcprelayProfiles-default.json"
        }
      ]
    },
    {
      "name": "getDhcprelayProfiles",
      "protocol": "REST",
      "method": "GET",
      "entitypath": "{base_path}/{version}/dhcp/relay-profiles?{query}",
      "requestSchema": "schema.json",
      "responseSchema": "schema.json",
      "timeout": 0,
      "sendEmpty": false,
      "sendGetBody": false,
      "requestDatatype": "JSON",
      "responseDatatype": "JSON",
      "headers": {},
      "responseObjects": [
        {
          "type": "default",
          "key": "",
          "mockFile": "mockdatafiles/getDhcprelayProfiles-default.json"
        }
      ]
    },
    {
      "name": "getLogicalRouterslogicalRouterIdroutingrouteTable",
      "protocol": "REST",
      "method": "GET",
      "entitypath": "{base_path}/{version}/logical-routers/{pathv1}/routing/route-table?{query}",
      "requestSchema": "schema.json",
      "responseSchema": "schema.json",
      "timeout": 0,
      "sendEmpty": false,
      "sendGetBody": false,
      "requestDatatype": "JSON",
      "responseDatatype": "JSON",
      "headers": {},
      "responseObjects": [
        {
          "type": "default",
          "key": "",
          "mockFile": "mockdatafiles/getLogicalRouterslogicalRouterIdroutingrouteTable-default.json"
        }
      ]
    },
    {
      "name": "postLogicalRouterslogicalRouterIdroutingbgpneighbors",
      "protocol": "REST",
      "method": "POST",
      "entitypath": "{base_path}/{version}/logical-routers/{pathv1}/routing/bgp/neighbors?{query}",
      "requestSchema": "schema.json",
      "responseSchema": "schema.json",
      "timeout": 0,
      "sendEmpty": false,
      "sendGetBody": false,
      "requestDatatype": "JSON",
      "responseDatatype": "JSON",
      "headers": {},
      "responseObjects": [
        {
          "type": "default",
          "key": "",
          "mockFile": "mockdatafiles/postLogicalRouterslogicalRouterIdroutingbgpneighbors-default.json"
        }
      ]
    },
    {
      "name": "getLogicalRouterslogicalRouterIdroutingbgpneighbors",
      "protocol": "REST",
      "method": "GET",
      "entitypath": "{base_path}/{version}/logical-routers/{pathv1}/routing/bgp/neighbors?{query}",
      "requestSchema": "schema.json",
      "responseSchema": "schema.json",
      "timeout": 0,
      "sendEmpty": false,
      "sendGetBody": false,
      "requestDatatype": "JSON",
      "responseDatatype": "JSON",
      "headers": {},
      "responseObjects": [
        {
          "type": "default",
          "key": "",
          "mockFile": "mockdatafiles/getLogicalRouterslogicalRouterIdroutingbgpneighbors-default.json"
        }
      ]
    },
    {
      "name": "getLogicalRouterslogicalRouterIdroutingforwardingTableformatcsv",
      "protocol": "REST",
      "method": "GET",
      "entitypath": "{base_path}/{version}/logical-routers/{pathv1}/routing/forwarding-table?{query}",
      "requestSchema": "schema.json",
      "responseSchema": "schema.json",
      "timeout": 0,
      "sendEmpty": false,
      "sendGetBody": false,
      "requestDatatype": "JSON",
      "responseDatatype": "JSON",
      "headers": {},
      "responseObjects": [
        {
          "type": "default",
          "key": "",
          "mockFile": "mockdatafiles/getLogicalRouterslogicalRouterIdroutingforwardingTableformatcsv-default.json"
        }
      ]
    },
    {
      "name": "getLogicalRouterslogicalRouterIdroutingroutingTable",
      "protocol": "REST",
      "method": "GET",
      "entitypath": "{base_path}/{version}/logical-routers/{pathv1}/routing/routing-table?{query}",
      "requestSchema": "schema.json",
      "responseSchema": "schema.json",
      "timeout": 0,
      "sendEmpty": false,
      "sendGetBody": false,
      "requestDatatype": "JSON",
      "responseDatatype": "JSON",
      "headers": {},
      "responseObjects": [
        {
          "type": "default",
          "key": "",
          "mockFile": "mockdatafiles/getLogicalRouterslogicalRouterIdroutingroutingTable-default.json"
        }
      ]
    },
    {
      "name": "getLogicalRouterPortslogicalRouterPortIdarpTable",
      "protocol": "REST",
      "method": "GET",
      "entitypath": "{base_path}/{version}/logical-router-ports/{pathv1}/arp-table?{query}",
      "requestSchema": "schema.json",
      "responseSchema": "schema.json",
      "timeout": 0,
      "sendEmpty": false,
      "sendGetBody": false,
      "requestDatatype": "JSON",
      "responseDatatype": "JSON",
      "headers": {},
      "responseObjects": [
        {
          "type": "default",
          "key": "",
          "mockFile": "mockdatafiles/getLogicalRouterPortslogicalRouterPortIdarpTable-default.json"
        }
      ]
    },
    {
      "name": "getLogicalRouterPortslogicalRouterPortIdstatisticssummary",
      "protocol": "REST",
      "method": "GET",
      "entitypath": "{base_path}/{version}/logical-router-ports/{pathv1}/statistics/summary?{query}",
      "requestSchema": "schema.json",
      "responseSchema": "schema.json",
      "timeout": 0,
      "sendEmpty": false,
      "sendGetBody": false,
      "requestDatatype": "JSON",
      "responseDatatype": "JSON",
      "headers": {},
      "responseObjects": [
        {
          "type": "default",
          "key": "",
          "mockFile": "mockdatafiles/getLogicalRouterPortslogicalRouterPortIdstatisticssummary-default.json"
        }
      ]
    },
    {
      "name": "postServiceProfiles",
      "protocol": "REST",
      "method": "POST",
      "entitypath": "{base_path}/{version}/service-profiles?{query}",
      "requestSchema": "schema.json",
      "responseSchema": "schema.json",
      "timeout": 0,
      "sendEmpty": false,
      "sendGetBody": false,
      "requestDatatype": "JSON",
      "responseDatatype": "JSON",
      "headers": {},
      "responseObjects": [
        {
          "type": "default",
          "key": "",
          "mockFile": "mockdatafiles/postServiceProfiles-default.json"
        }
      ]
    },
    {
      "name": "getServiceProfiles",
      "protocol": "REST",
      "method": "GET",
      "entitypath": "{base_path}/{version}/service-profiles?{query}",
      "requestSchema": "schema.json",
      "responseSchema": "schema.json",
      "timeout": 0,
      "sendEmpty": false,
      "sendGetBody": false,
      "requestDatatype": "JSON",
      "responseDatatype": "JSON",
      "headers": {},
      "responseObjects": [
        {
          "type": "default",
          "key": "",
          "mockFile": "mockdatafiles/getServiceProfiles-default.json"
        }
      ]
    },
    {
      "name": "postLogicalRouterPorts",
      "protocol": "REST",
      "method": "POST",
      "entitypath": "{base_path}/{version}/logical-router-ports?{query}",
      "requestSchema": "schema.json",
      "responseSchema": "schema.json",
      "timeout": 0,
      "sendEmpty": false,
      "sendGetBody": false,
      "requestDatatype": "JSON",
      "responseDatatype": "JSON",
      "headers": {},
      "responseObjects": [
        {
          "type": "default",
          "key": "",
          "mockFile": "mockdatafiles/postLogicalRouterPorts-default.json"
        }
      ]
    },
    {
      "name": "getLogicalRouterPorts",
      "protocol": "REST",
      "method": "GET",
      "entitypath": "{base_path}/{version}/logical-router-ports?{query}",
      "requestSchema": "schema.json",
      "responseSchema": "schema.json",
      "timeout": 0,
      "sendEmpty": false,
      "sendGetBody": false,
      "requestDatatype": "JSON",
      "responseDatatype": "JSON",
      "headers": {},
      "responseObjects": [
        {
          "type": "default",
          "key": "",
          "mockFile": "mockdatafiles/getLogicalRouterPorts-default.json"
        }
      ]
    },
    {
      "name": "getLogicalRouterslogicalRouterIdnatrulesstatistics",
      "protocol": "REST",
      "method": "GET",
      "entitypath": "{base_path}/{version}/logical-routers/{pathv1}/nat/rules/statistics?{query}",
      "requestSchema": "schema.json",
      "responseSchema": "schema.json",
      "timeout": 0,
      "sendEmpty": false,
      "sendGetBody": false,
      "requestDatatype": "JSON",
      "responseDatatype": "JSON",
      "headers": {},
      "responseObjects": [
        {
          "type": "default",
          "key": "",
          "mockFile": "mockdatafiles/getLogicalRouterslogicalRouterIdnatrulesstatistics-default.json"
        }
      ]
    },
    {
      "name": "getTransportNodesnodeIdstatisticsnatRules",
      "protocol": "REST",
      "method": "GET",
      "entitypath": "{base_path}/{version}/transport-nodes/{pathv1}/statistics/nat-rules?{query}",
      "requestSchema": "schema.json",
      "responseSchema": "schema.json",
      "timeout": 0,
      "sendEmpty": false,
      "sendGetBody": false,
      "requestDatatype": "JSON",
      "responseDatatype": "JSON",
      "headers": {},
      "responseObjects": [
        {
          "type": "default",
          "key": "",
          "mockFile": "mockdatafiles/getTransportNodesnodeIdstatisticsnatRules-default.json"
        }
      ]
    },
    {
      "name": "postLogicalRouterslogicalRouterIdroutingstaticRoutesbfdPeers",
      "protocol": "REST",
      "method": "POST",
      "entitypath": "{base_path}/{version}/logical-routers/{pathv1}/routing/static-routes/bfd-peers?{query}",
      "requestSchema": "schema.json",
      "responseSchema": "schema.json",
      "timeout": 0,
      "sendEmpty": false,
      "sendGetBody": false,
      "requestDatatype": "JSON",
      "responseDatatype": "JSON",
      "headers": {},
      "responseObjects": [
        {
          "type": "default",
          "key": "",
          "mockFile": "mockdatafiles/postLogicalRouterslogicalRouterIdroutingstaticRoutesbfdPeers-default.json"
        }
      ]
    },
    {
      "name": "getLogicalRouterslogicalRouterIdroutingstaticRoutesbfdPeers",
      "protocol": "REST",
      "method": "GET",
      "entitypath": "{base_path}/{version}/logical-routers/{pathv1}/routing/static-routes/bfd-peers?{query}",
      "requestSchema": "schema.json",
      "responseSchema": "schema.json",
      "timeout": 0,
      "sendEmpty": false,
      "sendGetBody": false,
      "requestDatatype": "JSON",
      "responseDatatype": "JSON",
      "headers": {},
      "responseObjects": [
        {
          "type": "default",
          "key": "",
          "mockFile": "mockdatafiles/getLogicalRouterslogicalRouterIdroutingstaticRoutesbfdPeers-default.json"
        }
      ]
    },
    {
      "name": "putLogicalRouterslogicalRouterId",
      "protocol": "REST",
      "method": "PUT",
      "entitypath": "{base_path}/{version}/logical-routers/{pathv1}?{query}",
      "requestSchema": "schema.json",
      "responseSchema": "schema.json",
      "timeout": 0,
      "sendEmpty": false,
      "sendGetBody": false,
      "requestDatatype": "JSON",
      "responseDatatype": "JSON",
      "headers": {},
      "responseObjects": [
        {
          "type": "default",
          "key": "",
          "mockFile": "mockdatafiles/putLogicalRouterslogicalRouterId-default.json"
        }
      ]
    },
    {
      "name": "getLogicalRouterslogicalRouterId",
      "protocol": "REST",
      "method": "GET",
      "entitypath": "{base_path}/{version}/logical-routers/{pathv1}?{query}",
      "requestSchema": "schema.json",
      "responseSchema": "schema.json",
      "timeout": 0,
      "sendEmpty": false,
      "sendGetBody": false,
      "requestDatatype": "JSON",
      "responseDatatype": "JSON",
      "headers": {},
      "responseObjects": [
        {
          "type": "default",
          "key": "",
          "mockFile": "mockdatafiles/getLogicalRouterslogicalRouterId-default.json"
        }
      ]
    },
    {
      "name": "deleteLogicalRouterslogicalRouterId",
      "protocol": "REST",
      "method": "DELETE",
      "entitypath": "{base_path}/{version}/logical-routers/{pathv1}?{query}",
      "requestSchema": "schema.json",
      "responseSchema": "schema.json",
      "timeout": 0,
      "sendEmpty": false,
      "sendGetBody": false,
      "requestDatatype": "JSON",
      "responseDatatype": "JSON",
      "headers": {},
      "responseObjects": [
        {
          "type": "default",
          "key": "",
          "mockFile": ""
        }
      ]
    },
    {
      "name": "putLogicalRouterslogicalRouterIdroutingadvertisementrules",
      "protocol": "REST",
      "method": "PUT",
      "entitypath": "{base_path}/{version}/logical-routers/{pathv1}/routing/advertisement/rules?{query}",
      "requestSchema": "schema.json",
      "responseSchema": "schema.json",
      "timeout": 0,
      "sendEmpty": false,
      "sendGetBody": false,
      "requestDatatype": "JSON",
      "responseDatatype": "JSON",
      "headers": {},
      "responseObjects": [
        {
          "type": "default",
          "key": "",
          "mockFile": "mockdatafiles/putLogicalRouterslogicalRouterIdroutingadvertisementrules-default.json"
        }
      ]
    },
    {
      "name": "getLogicalRouterslogicalRouterIdroutingadvertisementrules",
      "protocol": "REST",
      "method": "GET",
      "entitypath": "{base_path}/{version}/logical-routers/{pathv1}/routing/advertisement/rules?{query}",
      "requestSchema": "schema.json",
      "responseSchema": "schema.json",
      "timeout": 0,
      "sendEmpty": false,
      "sendGetBody": false,
      "requestDatatype": "JSON",
      "responseDatatype": "JSON",
      "headers": {},
      "responseObjects": [
        {
          "type": "default",
          "key": "",
          "mockFile": "mockdatafiles/getLogicalRouterslogicalRouterIdroutingadvertisementrules-default.json"
        }
      ]
    },
    {
      "name": "getLogicalRouterslogicalRouterIdroutingroutingTableformatcsv",
      "protocol": "REST",
      "method": "GET",
      "entitypath": "{base_path}/{version}/logical-routers/{pathv1}/routing/routing-table?{query}",
      "requestSchema": "schema.json",
      "responseSchema": "schema.json",
      "timeout": 0,
      "sendEmpty": false,
      "sendGetBody": false,
      "requestDatatype": "JSON",
      "responseDatatype": "JSON",
      "headers": {},
      "responseObjects": [
        {
          "type": "default",
          "key": "",
          "mockFile": "mockdatafiles/getLogicalRouterslogicalRouterIdroutingroutingTableformatcsv-default.json"
        }
      ]
    },
    {
      "name": "postDhcprelays",
      "protocol": "REST",
      "method": "POST",
      "entitypath": "{base_path}/{version}/dhcp/relays?{query}",
      "requestSchema": "schema.json",
      "responseSchema": "schema.json",
      "timeout": 0,
      "sendEmpty": false,
      "sendGetBody": false,
      "requestDatatype": "JSON",
      "responseDatatype": "JSON",
      "headers": {},
      "responseObjects": [
        {
          "type": "default",
          "key": "",
          "mockFile": "mockdatafiles/postDhcprelays-default.json"
        }
      ]
    },
    {
      "name": "getDhcprelays",
      "protocol": "REST",
      "method": "GET",
      "entitypath": "{base_path}/{version}/dhcp/relays?{query}",
      "requestSchema": "schema.json",
      "responseSchema": "schema.json",
      "timeout": 0,
      "sendEmpty": false,
      "sendGetBody": false,
      "requestDatatype": "JSON",
      "responseDatatype": "JSON",
      "headers": {},
      "responseObjects": [
        {
          "type": "default",
          "key": "",
          "mockFile": "mockdatafiles/getDhcprelays-default.json"
        }
      ]
    },
    {
      "name": "putLogicalRouterslogicalRouterIdroutingipPrefixListsid",
      "protocol": "REST",
      "method": "PUT",
      "entitypath": "{base_path}/{version}/logical-routers/{pathv1}/routing/ip-prefix-lists/{pathv2}?{query}",
      "requestSchema": "schema.json",
      "responseSchema": "schema.json",
      "timeout": 0,
      "sendEmpty": false,
      "sendGetBody": false,
      "requestDatatype": "JSON",
      "responseDatatype": "JSON",
      "headers": {},
      "responseObjects": [
        {
          "type": "default",
          "key": "",
          "mockFile": "mockdatafiles/putLogicalRouterslogicalRouterIdroutingipPrefixListsid-default.json"
        }
      ]
    },
    {
      "name": "getLogicalRouterslogicalRouterIdroutingipPrefixListsid",
      "protocol": "REST",
      "method": "GET",
      "entitypath": "{base_path}/{version}/logical-routers/{pathv1}/routing/ip-prefix-lists/{pathv2}?{query}",
      "requestSchema": "schema.json",
      "responseSchema": "schema.json",
      "timeout": 0,
      "sendEmpty": false,
      "sendGetBody": false,
      "requestDatatype": "JSON",
      "responseDatatype": "JSON",
      "headers": {},
      "responseObjects": [
        {
          "type": "default",
          "key": "",
          "mockFile": "mockdatafiles/getLogicalRouterslogicalRouterIdroutingipPrefixListsid-default.json"
        }
      ]
    },
    {
      "name": "deleteLogicalRouterslogicalRouterIdroutingipPrefixListsid",
      "protocol": "REST",
      "method": "DELETE",
      "entitypath": "{base_path}/{version}/logical-routers/{pathv1}/routing/ip-prefix-lists/{pathv2}?{query}",
      "requestSchema": "schema.json",
      "responseSchema": "schema.json",
      "timeout": 0,
      "sendEmpty": false,
      "sendGetBody": false,
      "requestDatatype": "JSON",
      "responseDatatype": "JSON",
      "headers": {},
      "responseObjects": [
        {
          "type": "default",
          "key": "",
          "mockFile": ""
        }
      ]
    },
    {
      "name": "getLogicalRouterPortslogicalRouterPortIdstatistics",
      "protocol": "REST",
      "method": "GET",
      "entitypath": "{base_path}/{version}/logical-router-ports/{pathv1}/statistics?{query}",
      "requestSchema": "schema.json",
      "responseSchema": "schema.json",
      "timeout": 0,
      "sendEmpty": false,
      "sendGetBody": false,
      "requestDatatype": "JSON",
      "responseDatatype": "JSON",
      "headers": {},
      "responseObjects": [
        {
          "type": "default",
          "key": "",
          "mockFile": "mockdatafiles/getLogicalRouterPortslogicalRouterPortIdstatistics-default.json"
        }
      ]
    },
    {
      "name": "putLogicalRouterslogicalRouterIdroutingrouteMapsid",
      "protocol": "REST",
      "method": "PUT",
      "entitypath": "{base_path}/{version}/logical-routers/{pathv1}/routing/route-maps/{pathv2}?{query}",
      "requestSchema": "schema.json",
      "responseSchema": "schema.json",
      "timeout": 0,
      "sendEmpty": false,
      "sendGetBody": false,
      "requestDatatype": "JSON",
      "responseDatatype": "JSON",
      "headers": {},
      "responseObjects": [
        {
          "type": "default",
          "key": "",
          "mockFile": "mockdatafiles/putLogicalRouterslogicalRouterIdroutingrouteMapsid-default.json"
        }
      ]
    },
    {
      "name": "getLogicalRouterslogicalRouterIdroutingrouteMapsid",
      "protocol": "REST",
      "method": "GET",
      "entitypath": "{base_path}/{version}/logical-routers/{pathv1}/routing/route-maps/{pathv2}?{query}",
      "requestSchema": "schema.json",
      "responseSchema": "schema.json",
      "timeout": 0,
      "sendEmpty": false,
      "sendGetBody": false,
      "requestDatatype": "JSON",
      "responseDatatype": "JSON",
      "headers": {},
      "responseObjects": [
        {
          "type": "default",
          "key": "",
          "mockFile": "mockdatafiles/getLogicalRouterslogicalRouterIdroutingrouteMapsid-default.json"
        }
      ]
    },
    {
      "name": "deleteLogicalRouterslogicalRouterIdroutingrouteMapsid",
      "protocol": "REST",
      "method": "DELETE",
      "entitypath": "{base_path}/{version}/logical-routers/{pathv1}/routing/route-maps/{pathv2}?{query}",
      "requestSchema": "schema.json",
      "responseSchema": "schema.json",
      "timeout": 0,
      "sendEmpty": false,
      "sendGetBody": false,
      "requestDatatype": "JSON",
      "responseDatatype": "JSON",
      "headers": {},
      "responseObjects": [
        {
          "type": "default",
          "key": "",
          "mockFile": ""
        }
      ]
    },
    {
      "name": "putLogicalRouterslogicalRouterIdroutingbgp",
      "protocol": "REST",
      "method": "PUT",
      "entitypath": "{base_path}/{version}/logical-routers/{pathv1}/routing/bgp?{query}",
      "requestSchema": "schema.json",
      "responseSchema": "schema.json",
      "timeout": 0,
      "sendEmpty": false,
      "sendGetBody": false,
      "requestDatatype": "JSON",
      "responseDatatype": "JSON",
      "headers": {},
      "responseObjects": [
        {
          "type": "default",
          "key": "",
          "mockFile": "mockdatafiles/putLogicalRouterslogicalRouterIdroutingbgp-default.json"
        }
      ]
    },
    {
      "name": "getLogicalRouterslogicalRouterIdroutingbgp",
      "protocol": "REST",
      "method": "GET",
      "entitypath": "{base_path}/{version}/logical-routers/{pathv1}/routing/bgp?{query}",
      "requestSchema": "schema.json",
      "responseSchema": "schema.json",
      "timeout": 0,
      "sendEmpty": false,
      "sendGetBody": false,
      "requestDatatype": "JSON",
      "responseDatatype": "JSON",
      "headers": {},
      "responseObjects": [
        {
          "type": "default",
          "key": "",
          "mockFile": "mockdatafiles/getLogicalRouterslogicalRouterIdroutingbgp-default.json"
        }
      ]
    },
    {
      "name": "putLogicalRouterslogicalRouterIdrouting",
      "protocol": "REST",
      "method": "PUT",
      "entitypath": "{base_path}/{version}/logical-routers/{pathv1}/routing?{query}",
      "requestSchema": "schema.json",
      "responseSchema": "schema.json",
      "timeout": 0,
      "sendEmpty": false,
      "sendGetBody": false,
      "requestDatatype": "JSON",
      "responseDatatype": "JSON",
      "headers": {},
      "responseObjects": [
        {
          "type": "default",
          "key": "",
          "mockFile": "mockdatafiles/putLogicalRouterslogicalRouterIdrouting-default.json"
        }
      ]
    },
    {
      "name": "getLogicalRouterslogicalRouterIdrouting",
      "protocol": "REST",
      "method": "GET",
      "entitypath": "{base_path}/{version}/logical-routers/{pathv1}/routing?{query}",
      "requestSchema": "schema.json",
      "responseSchema": "schema.json",
      "timeout": 0,
      "sendEmpty": false,
      "sendGetBody": false,
      "requestDatatype": "JSON",
      "responseDatatype": "JSON",
      "headers": {},
      "responseObjects": [
        {
          "type": "default",
          "key": "",
          "mockFile": "mockdatafiles/getLogicalRouterslogicalRouterIdrouting-default.json"
        }
      ]
    },
    {
      "name": "putLogicalRouterslogicalRouterIdroutingadvertisement",
      "protocol": "REST",
      "method": "PUT",
      "entitypath": "{base_path}/{version}/logical-routers/{pathv1}/routing/advertisement?{query}",
      "requestSchema": "schema.json",
      "responseSchema": "schema.json",
      "timeout": 0,
      "sendEmpty": false,
      "sendGetBody": false,
      "requestDatatype": "JSON",
      "responseDatatype": "JSON",
      "headers": {},
      "responseObjects": [
        {
          "type": "default",
          "key": "",
          "mockFile": "mockdatafiles/putLogicalRouterslogicalRouterIdroutingadvertisement-default.json"
        }
      ]
    },
    {
      "name": "getLogicalRouterslogicalRouterIdroutingadvertisement",
      "protocol": "REST",
      "method": "GET",
      "entitypath": "{base_path}/{version}/logical-routers/{pathv1}/routing/advertisement?{query}",
      "requestSchema": "schema.json",
      "responseSchema": "schema.json",
      "timeout": 0,
      "sendEmpty": false,
      "sendGetBody": false,
      "requestDatatype": "JSON",
      "responseDatatype": "JSON",
      "headers": {},
      "responseObjects": [
        {
          "type": "default",
          "key": "",
          "mockFile": "mockdatafiles/getLogicalRouterslogicalRouterIdroutingadvertisement-default.json"
        }
      ]
    },
    {
      "name": "putServicesserviceId",
      "protocol": "REST",
      "method": "PUT",
      "entitypath": "{base_path}/{version}/services/{pathv1}?{query}",
      "requestSchema": "schema.json",
      "responseSchema": "schema.json",
      "timeout": 0,
      "sendEmpty": false,
      "sendGetBody": false,
      "requestDatatype": "JSON",
      "responseDatatype": "JSON",
      "headers": {},
      "responseObjects": [
        {
          "type": "default",
          "key": "",
          "mockFile": "mockdatafiles/putServicesserviceId-default.json"
        }
      ]
    },
    {
      "name": "getServicesserviceId",
      "protocol": "REST",
      "method": "GET",
      "entitypath": "{base_path}/{version}/services/{pathv1}?{query}",
      "requestSchema": "schema.json",
      "responseSchema": "schema.json",
      "timeout": 0,
      "sendEmpty": false,
      "sendGetBody": false,
      "requestDatatype": "JSON",
      "responseDatatype": "JSON",
      "headers": {},
      "responseObjects": [
        {
          "type": "default",
          "key": "",
          "mockFile": "mockdatafiles/getServicesserviceId-default.json"
        }
      ]
    },
    {
      "name": "deleteServicesserviceId",
      "protocol": "REST",
      "method": "DELETE",
      "entitypath": "{base_path}/{version}/services/{pathv1}?{query}",
      "requestSchema": "schema.json",
      "responseSchema": "schema.json",
      "timeout": 0,
      "sendEmpty": false,
      "sendGetBody": false,
      "requestDatatype": "JSON",
      "responseDatatype": "JSON",
      "headers": {},
      "responseObjects": [
        {
          "type": "default",
          "key": "",
          "mockFile": ""
        }
      ]
    },
    {
      "name": "putLogicalRouterslogicalRouterIdroutingbgpneighborsid",
      "protocol": "REST",
      "method": "PUT",
      "entitypath": "{base_path}/{version}/logical-routers/{pathv1}/routing/bgp/neighbors/{pathv2}?{query}",
      "requestSchema": "schema.json",
      "responseSchema": "schema.json",
      "timeout": 0,
      "sendEmpty": false,
      "sendGetBody": false,
      "requestDatatype": "JSON",
      "responseDatatype": "JSON",
      "headers": {},
      "responseObjects": [
        {
          "type": "default",
          "key": "",
          "mockFile": "mockdatafiles/putLogicalRouterslogicalRouterIdroutingbgpneighborsid-default.json"
        }
      ]
    },
    {
      "name": "postLogicalRouterslogicalRouterIdroutingbgpneighborsid",
      "protocol": "REST",
      "method": "POST",
      "entitypath": "{base_path}/{version}/logical-routers/{pathv1}/routing/bgp/neighbors/{pathv2}?{query}",
      "requestSchema": "schema.json",
      "responseSchema": "schema.json",
      "timeout": 0,
      "sendEmpty": false,
      "sendGetBody": false,
      "requestDatatype": "JSON",
      "responseDatatype": "JSON",
      "headers": {},
      "responseObjects": [
        {
          "type": "default",
          "key": "",
          "mockFile": "mockdatafiles/postLogicalRouterslogicalRouterIdroutingbgpneighborsid-default.json"
        }
      ]
    },
    {
      "name": "getLogicalRouterslogicalRouterIdroutingbgpneighborsid",
      "protocol": "REST",
      "method": "GET",
      "entitypath": "{base_path}/{version}/logical-routers/{pathv1}/routing/bgp/neighbors/{pathv2}?{query}",
      "requestSchema": "schema.json",
      "responseSchema": "schema.json",
      "timeout": 0,
      "sendEmpty": false,
      "sendGetBody": false,
      "requestDatatype": "JSON",
      "responseDatatype": "JSON",
      "headers": {},
      "responseObjects": [
        {
          "type": "default",
          "key": "",
          "mockFile": "mockdatafiles/getLogicalRouterslogicalRouterIdroutingbgpneighborsid-default.json"
        }
      ]
    },
    {
      "name": "deleteLogicalRouterslogicalRouterIdroutingbgpneighborsid",
      "protocol": "REST",
      "method": "DELETE",
      "entitypath": "{base_path}/{version}/logical-routers/{pathv1}/routing/bgp/neighbors/{pathv2}?{query}",
      "requestSchema": "schema.json",
      "responseSchema": "schema.json",
      "timeout": 0,
      "sendEmpty": false,
      "sendGetBody": false,
      "requestDatatype": "JSON",
      "responseDatatype": "JSON",
      "headers": {},
      "responseObjects": [
        {
          "type": "default",
          "key": "",
          "mockFile": ""
        }
      ]
    },
    {
      "name": "putLogicalRouterslogicalRouterIdroutingbfdConfig",
      "protocol": "REST",
      "method": "PUT",
      "entitypath": "{base_path}/{version}/logical-routers/{pathv1}/routing/bfd-config?{query}",
      "requestSchema": "schema.json",
      "responseSchema": "schema.json",
      "timeout": 0,
      "sendEmpty": false,
      "sendGetBody": false,
      "requestDatatype": "JSON",
      "responseDatatype": "JSON",
      "headers": {},
      "responseObjects": [
        {
          "type": "default",
          "key": "",
          "mockFile": "mockdatafiles/putLogicalRouterslogicalRouterIdroutingbfdConfig-default.json"
        }
      ]
    },
    {
      "name": "getLogicalRouterslogicalRouterIdroutingbfdConfig",
      "protocol": "REST",
      "method": "GET",
      "entitypath": "{base_path}/{version}/logical-routers/{pathv1}/routing/bfd-config?{query}",
      "requestSchema": "schema.json",
      "responseSchema": "schema.json",
      "timeout": 0,
      "sendEmpty": false,
      "sendGetBody": false,
      "requestDatatype": "JSON",
      "responseDatatype": "JSON",
      "headers": {},
      "responseObjects": [
        {
          "type": "default",
          "key": "",
          "mockFile": "mockdatafiles/getLogicalRouterslogicalRouterIdroutingbfdConfig-default.json"
        }
      ]
    },
    {
      "name": "putServiceProfilesserviceProfileId",
      "protocol": "REST",
      "method": "PUT",
      "entitypath": "{base_path}/{version}/service-profiles/{pathv1}?{query}",
      "requestSchema": "schema.json",
      "responseSchema": "schema.json",
      "timeout": 0,
      "sendEmpty": false,
      "sendGetBody": false,
      "requestDatatype": "JSON",
      "responseDatatype": "JSON",
      "headers": {},
      "responseObjects": [
        {
          "type": "default",
          "key": "",
          "mockFile": "mockdatafiles/putServiceProfilesserviceProfileId-default.json"
        }
      ]
    },
    {
      "name": "getServiceProfilesserviceProfileId",
      "protocol": "REST",
      "method": "GET",
      "entitypath": "{base_path}/{version}/service-profiles/{pathv1}?{query}",
      "requestSchema": "schema.json",
      "responseSchema": "schema.json",
      "timeout": 0,
      "sendEmpty": false,
      "sendGetBody": false,
      "requestDatatype": "JSON",
      "responseDatatype": "JSON",
      "headers": {},
      "responseObjects": [
        {
          "type": "default",
          "key": "",
          "mockFile": "mockdatafiles/getServiceProfilesserviceProfileId-default.json"
        }
      ]
    },
    {
      "name": "deleteServiceProfilesserviceProfileId",
      "protocol": "REST",
      "method": "DELETE",
      "entitypath": "{base_path}/{version}/service-profiles/{pathv1}?{query}",
      "requestSchema": "schema.json",
      "responseSchema": "schema.json",
      "timeout": 0,
      "sendEmpty": false,
      "sendGetBody": false,
      "requestDatatype": "JSON",
      "responseDatatype": "JSON",
      "headers": {},
      "responseObjects": [
        {
          "type": "default",
          "key": "",
          "mockFile": ""
        }
      ]
    },
    {
      "name": "getLogicalRouterPortslogicalRouterPortIdarpTableformatcsv",
      "protocol": "REST",
      "method": "GET",
      "entitypath": "{base_path}/{version}/logical-router-ports/{pathv1}/arp-table?{query}",
      "requestSchema": "schema.json",
      "responseSchema": "schema.json",
      "timeout": 0,
      "sendEmpty": false,
      "sendGetBody": false,
      "requestDatatype": "JSON",
      "responseDatatype": "JSON",
      "headers": {},
      "responseObjects": [
        {
          "type": "default",
          "key": "",
          "mockFile": "mockdatafiles/getLogicalRouterPortslogicalRouterPortIdarpTableformatcsv-default.json"
        }
      ]
    },
    {
      "name": "putLogicalRouterPortslogicalRouterPortId",
      "protocol": "REST",
      "method": "PUT",
      "entitypath": "{base_path}/{version}/logical-router-ports/{pathv1}?{query}",
      "requestSchema": "schema.json",
      "responseSchema": "schema.json",
      "timeout": 0,
      "sendEmpty": false,
      "sendGetBody": false,
      "requestDatatype": "JSON",
      "responseDatatype": "JSON",
      "headers": {},
      "responseObjects": [
        {
          "type": "default",
          "key": "",
          "mockFile": "mockdatafiles/putLogicalRouterPortslogicalRouterPortId-default.json"
        }
      ]
    },
    {
      "name": "getLogicalRouterPortslogicalRouterPortId",
      "protocol": "REST",
      "method": "GET",
      "entitypath": "{base_path}/{version}/logical-router-ports/{pathv1}?{query}",
      "requestSchema": "schema.json",
      "responseSchema": "schema.json",
      "timeout": 0,
      "sendEmpty": false,
      "sendGetBody": false,
      "requestDatatype": "JSON",
      "responseDatatype": "JSON",
      "headers": {},
      "responseObjects": [
        {
          "type": "default",
          "key": "",
          "mockFile": "mockdatafiles/getLogicalRouterPortslogicalRouterPortId-default.json"
        }
      ]
    },
    {
      "name": "deleteLogicalRouterPortslogicalRouterPortId",
      "protocol": "REST",
      "method": "DELETE",
      "entitypath": "{base_path}/{version}/logical-router-ports/{pathv1}?{query}",
      "requestSchema": "schema.json",
      "responseSchema": "schema.json",
      "timeout": 0,
      "sendEmpty": false,
      "sendGetBody": false,
      "requestDatatype": "JSON",
      "responseDatatype": "JSON",
      "headers": {},
      "responseObjects": [
        {
          "type": "default",
          "key": "",
          "mockFile": ""
        }
      ]
    },
    {
      "name": "putLogicalRouterslogicalRouterIdnatrulesruleId",
      "protocol": "REST",
      "method": "PUT",
      "entitypath": "{base_path}/{version}/logical-routers/{pathv1}/nat/rules/{pathv2}?{query}",
      "requestSchema": "schema.json",
      "responseSchema": "schema.json",
      "timeout": 0,
      "sendEmpty": false,
      "sendGetBody": false,
      "requestDatatype": "JSON",
      "responseDatatype": "JSON",
      "headers": {},
      "responseObjects": [
        {
          "type": "default",
          "key": "",
          "mockFile": "mockdatafiles/putLogicalRouterslogicalRouterIdnatrulesruleId-default.json"
        }
      ]
    },
    {
      "name": "getLogicalRouterslogicalRouterIdnatrulesruleId",
      "protocol": "REST",
      "method": "GET",
      "entitypath": "{base_path}/{version}/logical-routers/{pathv1}/nat/rules/{pathv2}?{query}",
      "requestSchema": "schema.json",
      "responseSchema": "schema.json",
      "timeout": 0,
      "sendEmpty": false,
      "sendGetBody": false,
      "requestDatatype": "JSON",
      "responseDatatype": "JSON",
      "headers": {},
      "responseObjects": [
        {
          "type": "default",
          "key": "",
          "mockFile": "mockdatafiles/getLogicalRouterslogicalRouterIdnatrulesruleId-default.json"
        }
      ]
    },
    {
      "name": "deleteLogicalRouterslogicalRouterIdnatrulesruleId",
      "protocol": "REST",
      "method": "DELETE",
      "entitypath": "{base_path}/{version}/logical-routers/{pathv1}/nat/rules/{pathv2}?{query}",
      "requestSchema": "schema.json",
      "responseSchema": "schema.json",
      "timeout": 0,
      "sendEmpty": false,
      "sendGetBody": false,
      "requestDatatype": "JSON",
      "responseDatatype": "JSON",
      "headers": {},
      "responseObjects": [
        {
          "type": "default",
          "key": "",
          "mockFile": ""
        }
      ]
    },
    {
      "name": "postLogicalRouterslogicalRouterIdnatrules",
      "protocol": "REST",
      "method": "POST",
      "entitypath": "{base_path}/{version}/logical-routers/{pathv1}/nat/rules?{query}",
      "requestSchema": "schema.json",
      "responseSchema": "schema.json",
      "timeout": 0,
      "sendEmpty": false,
      "sendGetBody": false,
      "requestDatatype": "JSON",
      "responseDatatype": "JSON",
      "headers": {},
      "responseObjects": [
        {
          "type": "default",
          "key": "",
          "mockFile": "mockdatafiles/postLogicalRouterslogicalRouterIdnatrules-default.json"
        }
      ]
    },
    {
      "name": "getLogicalRouterslogicalRouterIdnatrules",
      "protocol": "REST",
      "method": "GET",
      "entitypath": "{base_path}/{version}/logical-routers/{pathv1}/nat/rules?{query}",
      "requestSchema": "schema.json",
      "responseSchema": "schema.json",
      "timeout": 0,
      "sendEmpty": false,
      "sendGetBody": false,
      "requestDatatype": "JSON",
      "responseDatatype": "JSON",
      "headers": {},
      "responseObjects": [
        {
          "type": "default",
          "key": "",
          "mockFile": "mockdatafiles/getLogicalRouterslogicalRouterIdnatrules-default.json"
        }
      ]
    }
  ]
}