{
  "status": {
    "description": "string",
    "value": "ABORTED"
  },
  "step": {
    "status": {
      "description": "string",
      "value": "INITIAL"
    },
    "step_number": 1,
    "description": "string",
    "value": "string"
  },
  "endpoints": [
    {
      "action": "string",
      "href": "string",
      "rel": "string"
    }
  ],
  "total_steps": 1,
  "restore_start_time": 10,
  "restore_end_time": 2,
  "backup_timestamp": 5,
  "id": "string",
  "instructions": [
    {
      "fields": [
        "string",
        "string",
        "string",
        "string",
        "string",
        "string",
        "string"
      ],
      "id": "string",
      "actions": [
        "string",
        "string",
        "string",
        "string",
        "string",
        "string"
      ],
      "name": "string"
    },
    {
      "fields": [
        "string",
        "string",
        "string"
      ],
      "id": "string",
      "actions": [
        "string",
        "string",
        "string",
        "string",
        "string",
        "string",
        "string",
        "string",
        "string",
        "string"
      ],
      "name": "string"
    }
  ]
}