{
  "errors": 8,
  "releases": 1,
  "informs": 9,
  "declines": 4,
  "dhcp_server_id": "string",
  "nacks": 6,
  "offers": 9,
  "discovers": 7,
  "acks": 5,
  "timestamp": 5,
  "requests": 7,
  "ip_pool_stats": [
    {
      "allocated_percentage": 5,
      "pool_size": 9,
      "allocated_number": 8,
      "dhcp_ip_pool_id": "string"
    },
    {
      "allocated_percentage": 3,
      "pool_size": 1,
      "allocated_number": 2,
      "dhcp_ip_pool_id": "string"
    },
    {
      "allocated_percentage": 5,
      "pool_size": 7,
      "allocated_number": 5,
      "dhcp_ip_pool_id": "string"
    },
    {
      "allocated_percentage": 5,
      "pool_size": 6,
      "allocated_number": 8,
      "dhcp_ip_pool_id": "string"
    }
  ]
}