{
  "state": "pending",
  "details": [
    {
      "sub_system_address": "string",
      "state": "in_progress",
      "sub_system_type": "string",
      "failure_message": "string",
      "failure_code": 3,
      "sub_system_id": "string"
    },
    {
      "sub_system_address": "string",
      "state": "failed",
      "sub_system_type": "string",
      "failure_message": "string",
      "failure_code": 6,
      "sub_system_id": "string"
    }
  ],
  "failure_code": 8,
  "failure_message": "string",
  "host_switch_states": [
    {
      "host_switch_id": "string",
      "endpoints": [
        {
          "ip": "string",
          "subnet_mask": "string",
          "default_gateway": "string",
          "label": 5,
          "device_name": "string"
        },
        {
          "ip": "string",
          "subnet_mask": "string",
          "default_gateway": "string",
          "label": 2,
          "device_name": "string"
        },
        {
          "ip": "string",
          "subnet_mask": "string",
          "default_gateway": "string",
          "label": 9,
          "device_name": "string"
        },
        {
          "ip": "string",
          "subnet_mask": "string",
          "default_gateway": "string",
          "label": 1,
          "device_name": "string"
        },
        {
          "ip": "string",
          "subnet_mask": "string",
          "default_gateway": "string",
          "label": 7,
          "device_name": "string"
        },
        {
          "ip": "string",
          "subnet_mask": "string",
          "default_gateway": "string",
          "label": 10,
          "device_name": "string"
        }
      ],
      "transport_zone_ids": [
        "string",
        "string",
        "string",
        "string",
        "string",
        "string",
        "string",
        "string",
        "string"
      ],
      "host_switch_name": "string"
    },
    {
      "host_switch_id": "string",
      "endpoints": [
        {
          "ip": "string",
          "subnet_mask": "string",
          "default_gateway": "string",
          "label": 10,
          "device_name": "string"
        }
      ],
      "transport_zone_ids": [
        "string",
        "string",
        "string",
        "string",
        "string",
        "string",
        "string",
        "string"
      ],
      "host_switch_name": "string"
    },
    {
      "host_switch_id": "string",
      "endpoints": [
        {
          "ip": "string",
          "subnet_mask": "string",
          "default_gateway": "string",
          "label": 3,
          "device_name": "string"
        },
        {
          "ip": "string",
          "subnet_mask": "string",
          "default_gateway": "string",
          "label": 2,
          "device_name": "string"
        },
        {
          "ip": "string",
          "subnet_mask": "string",
          "default_gateway": "string",
          "label": 2,
          "device_name": "string"
        },
        {
          "ip": "string",
          "subnet_mask": "string",
          "default_gateway": "string",
          "label": 9,
          "device_name": "string"
        },
        {
          "ip": "string",
          "subnet_mask": "string",
          "default_gateway": "string",
          "label": 2,
          "device_name": "string"
        },
        {
          "ip": "string",
          "subnet_mask": "string",
          "default_gateway": "string",
          "label": 1,
          "device_name": "string"
        }
      ],
      "transport_zone_ids": [
        "string",
        "string",
        "string",
        "string",
        "string",
        "string",
        "string"
      ],
      "host_switch_name": "string"
    },
    {
      "host_switch_id": "string",
      "endpoints": [
        {
          "ip": "string",
          "subnet_mask": "string",
          "default_gateway": "string",
          "label": 2,
          "device_name": "string"
        },
        {
          "ip": "string",
          "subnet_mask": "string",
          "default_gateway": "string",
          "label": 5,
          "device_name": "string"
        },
        {
          "ip": "string",
          "subnet_mask": "string",
          "default_gateway": "string",
          "label": 8,
          "device_name": "string"
        },
        {
          "ip": "string",
          "subnet_mask": "string",
          "default_gateway": "string",
          "label": 8,
          "device_name": "string"
        },
        {
          "ip": "string",
          "subnet_mask": "string",
          "default_gateway": "string",
          "label": 6,
          "device_name": "string"
        },
        {
          "ip": "string",
          "subnet_mask": "string",
          "default_gateway": "string",
          "label": 10,
          "device_name": "string"
        },
        {
          "ip": "string",
          "subnet_mask": "string",
          "default_gateway": "string",
          "label": 10,
          "device_name": "string"
        },
        {
          "ip": "string",
          "subnet_mask": "string",
          "default_gateway": "string",
          "label": 5,
          "device_name": "string"
        },
        {
          "ip": "string",
          "subnet_mask": "string",
          "default_gateway": "string",
          "label": 8,
          "device_name": "string"
        }
      ],
      "transport_zone_ids": [
        "string",
        "string",
        "string",
        "string",
        "string",
        "string"
      ],
      "host_switch_name": "string"
    },
    {
      "host_switch_id": "string",
      "endpoints": [
        {
          "ip": "string",
          "subnet_mask": "string",
          "default_gateway": "string",
          "label": 6,
          "device_name": "string"
        },
        {
          "ip": "string",
          "subnet_mask": "string",
          "default_gateway": "string",
          "label": 9,
          "device_name": "string"
        },
        {
          "ip": "string",
          "subnet_mask": "string",
          "default_gateway": "string",
          "label": 8,
          "device_name": "string"
        },
        {
          "ip": "string",
          "subnet_mask": "string",
          "default_gateway": "string",
          "label": 1,
          "device_name": "string"
        },
        {
          "ip": "string",
          "subnet_mask": "string",
          "default_gateway": "string",
          "label": 1,
          "device_name": "string"
        },
        {
          "ip": "string",
          "subnet_mask": "string",
          "default_gateway": "string",
          "label": 1,
          "device_name": "string"
        },
        {
          "ip": "string",
          "subnet_mask": "string",
          "default_gateway": "string",
          "label": 9,
          "device_name": "string"
        }
      ],
      "transport_zone_ids": [
        "string",
        "string",
        "string",
        "string",
        "string",
        "string",
        "string",
        "string",
        "string",
        "string"
      ],
      "host_switch_name": "string"
    },
    {
      "host_switch_id": "string",
      "endpoints": [
        {
          "ip": "string",
          "subnet_mask": "string",
          "default_gateway": "string",
          "label": 5,
          "device_name": "string"
        },
        {
          "ip": "string",
          "subnet_mask": "string",
          "default_gateway": "string",
          "label": 10,
          "device_name": "string"
        },
        {
          "ip": "string",
          "subnet_mask": "string",
          "default_gateway": "string",
          "label": 10,
          "device_name": "string"
        },
        {
          "ip": "string",
          "subnet_mask": "string",
          "default_gateway": "string",
          "label": 10,
          "device_name": "string"
        },
        {
          "ip": "string",
          "subnet_mask": "string",
          "default_gateway": "string",
          "label": 7,
          "device_name": "string"
        },
        {
          "ip": "string",
          "subnet_mask": "string",
          "default_gateway": "string",
          "label": 2,
          "device_name": "string"
        }
      ],
      "transport_zone_ids": [
        "string",
        "string",
        "string"
      ],
      "host_switch_name": "string"
    }
  ],
  "maintenance_mode_state": "ENABLED",
  "transport_node_id": "string"
}