{
  "_self": {
    "action": "string",
    "href": "string",
    "rel": "string"
  },
  "_links": [
    {
      "action": "string",
      "href": "string",
      "rel": "string"
    }
  ],
  "_schema": "string",
  "_revision": 7,
  "_system_owned": true,
  "display_name": "string",
  "description": "string",
  "tags": [
    {
      "scope": "string",
      "tag": "string"
    },
    {
      "scope": "string",
      "tag": "string"
    },
    {
      "scope": "string",
      "tag": "string"
    }
  ],
  "_create_user": "string",
  "_protection": "string",
  "_create_time": 2,
  "_last_modified_time": 9,
  "_last_modified_user": "string",
  "id": "string",
  "resource_type": "string",
  "secret": "string",
  "metadata_server_ca_ids": [
    "string",
    "string",
    "string",
    "string",
    "string",
    "string",
    "string"
  ],
  "edge_cluster_member_indexes": [
    1,
    9,
    10,
    1
  ],
  "metadata_server_url": "string",
  "attached_logical_port_id": "string",
  "edge_cluster_id": "string"
}