{
  "_self": {
    "action": "string",
    "href": "string",
    "rel": "string"
  },
  "_links": [
    {
      "action": "string",
      "href": "string",
      "rel": "string"
    },
    {
      "action": "string",
      "href": "string",
      "rel": "string"
    }
  ],
  "_schema": "string",
  "cursor": "string",
  "sort_ascending": true,
  "sort_by": "string",
  "result_count": 5,
  "results": [
    {
      "_self": {
        "action": "string",
        "href": "string",
        "rel": "string"
      },
      "_links": [
        {
          "action": "string",
          "href": "string",
          "rel": "string"
        },
        {
          "action": "string",
          "href": "string",
          "rel": "string"
        },
        {
          "action": "string",
          "href": "string",
          "rel": "string"
        },
        {
          "action": "string",
          "href": "string",
          "rel": "string"
        },
        {
          "action": "string",
          "href": "string",
          "rel": "string"
        },
        {
          "action": "string",
          "href": "string",
          "rel": "string"
        },
        {
          "action": "string",
          "href": "string",
          "rel": "string"
        }
      ],
      "_schema": "string",
      "status": "canceling",
      "end_time": 2,
      "async_response_available": false,
      "description": "string",
      "start_time": 8,
      "cancelable": true,
      "request_method": "string",
      "details": {},
      "progress": 7,
      "message": "string",
      "user": "string",
      "id": "string",
      "request_uri": "string"
    },
    {
      "_self": {
        "action": "string",
        "href": "string",
        "rel": "string"
      },
      "_links": [
        {
          "action": "string",
          "href": "string",
          "rel": "string"
        },
        {
          "action": "string",
          "href": "string",
          "rel": "string"
        },
        {
          "action": "string",
          "href": "string",
          "rel": "string"
        },
        {
          "action": "string",
          "href": "string",
          "rel": "string"
        },
        {
          "action": "string",
          "href": "string",
          "rel": "string"
        },
        {
          "action": "string",
          "href": "string",
          "rel": "string"
        },
        {
          "action": "string",
          "href": "string",
          "rel": "string"
        },
        {
          "action": "string",
          "href": "string",
          "rel": "string"
        },
        {
          "action": "string",
          "href": "string",
          "rel": "string"
        }
      ],
      "_schema": "string",
      "status": "error",
      "end_time": 4,
      "async_response_available": false,
      "description": "string",
      "start_time": 7,
      "cancelable": true,
      "request_method": "string",
      "details": {},
      "progress": 7,
      "message": "string",
      "user": "string",
      "id": "string",
      "request_uri": "string"
    }
  ]
}