{
  "_self": {
    "action": "string",
    "href": "string",
    "rel": "string"
  },
  "_links": [
    {
      "action": "string",
      "href": "string",
      "rel": "string"
    },
    {
      "action": "string",
      "href": "string",
      "rel": "string"
    },
    {
      "action": "string",
      "href": "string",
      "rel": "string"
    },
    {
      "action": "string",
      "href": "string",
      "rel": "string"
    },
    {
      "action": "string",
      "href": "string",
      "rel": "string"
    },
    {
      "action": "string",
      "href": "string",
      "rel": "string"
    },
    {
      "action": "string",
      "href": "string",
      "rel": "string"
    }
  ],
  "_schema": "string",
  "cursor": "string",
  "sort_ascending": true,
  "sort_by": "string",
  "result_count": 7,
  "results": [
    {
      "_self": {
        "action": "string",
        "href": "string",
        "rel": "string"
      },
      "_links": [
        {
          "action": "string",
          "href": "string",
          "rel": "string"
        },
        {
          "action": "string",
          "href": "string",
          "rel": "string"
        }
      ],
      "_schema": "string",
      "_last_sync_time": 3,
      "display_name": "string",
      "description": "string",
      "resource_type": "string",
      "tags": [
        {
          "scope": "string",
          "tag": "string"
        },
        {
          "scope": "string",
          "tag": "string"
        },
        {
          "scope": "string",
          "tag": "string"
        },
        {
          "scope": "string",
          "tag": "string"
        }
      ],
      "origin_id": "string",
      "origin_properties": [
        {
          "value": "string",
          "key": "string"
        },
        {
          "value": "string",
          "key": "string"
        },
        {
          "value": "string",
          "key": "string"
        },
        {
          "value": "string",
          "key": "string"
        }
      ],
      "external_id": "string",
      "owner_id": "string",
      "origin_type": "string",
      "cm_local_id": "string"
    },
    {
      "_self": {
        "action": "string",
        "href": "string",
        "rel": "string"
      },
      "_links": [
        {
          "action": "string",
          "href": "string",
          "rel": "string"
        },
        {
          "action": "string",
          "href": "string",
          "rel": "string"
        },
        {
          "action": "string",
          "href": "string",
          "rel": "string"
        },
        {
          "action": "string",
          "href": "string",
          "rel": "string"
        },
        {
          "action": "string",
          "href": "string",
          "rel": "string"
        }
      ],
      "_schema": "string",
      "_last_sync_time": 7,
      "display_name": "string",
      "description": "string",
      "resource_type": "string",
      "tags": [
        {
          "scope": "string",
          "tag": "string"
        },
        {
          "scope": "string",
          "tag": "string"
        },
        {
          "scope": "string",
          "tag": "string"
        },
        {
          "scope": "string",
          "tag": "string"
        },
        {
          "scope": "string",
          "tag": "string"
        },
        {
          "scope": "string",
          "tag": "string"
        }
      ],
      "origin_id": "string",
      "origin_properties": [
        {
          "value": "string",
          "key": "string"
        },
        {
          "value": "string",
          "key": "string"
        },
        {
          "value": "string",
          "key": "string"
        },
        {
          "value": "string",
          "key": "string"
        },
        {
          "value": "string",
          "key": "string"
        },
        {
          "value": "string",
          "key": "string"
        }
      ],
      "external_id": "string",
      "owner_id": "string",
      "origin_type": "string",
      "cm_local_id": "string"
    },
    {
      "_self": {
        "action": "string",
        "href": "string",
        "rel": "string"
      },
      "_links": [
        {
          "action": "string",
          "href": "string",
          "rel": "string"
        },
        {
          "action": "string",
          "href": "string",
          "rel": "string"
        },
        {
          "action": "string",
          "href": "string",
          "rel": "string"
        },
        {
          "action": "string",
          "href": "string",
          "rel": "string"
        },
        {
          "action": "string",
          "href": "string",
          "rel": "string"
        },
        {
          "action": "string",
          "href": "string",
          "rel": "string"
        },
        {
          "action": "string",
          "href": "string",
          "rel": "string"
        },
        {
          "action": "string",
          "href": "string",
          "rel": "string"
        },
        {
          "action": "string",
          "href": "string",
          "rel": "string"
        }
      ],
      "_schema": "string",
      "_last_sync_time": 8,
      "display_name": "string",
      "description": "string",
      "resource_type": "string",
      "tags": [
        {
          "scope": "string",
          "tag": "string"
        },
        {
          "scope": "string",
          "tag": "string"
        },
        {
          "scope": "string",
          "tag": "string"
        },
        {
          "scope": "string",
          "tag": "string"
        },
        {
          "scope": "string",
          "tag": "string"
        },
        {
          "scope": "string",
          "tag": "string"
        },
        {
          "scope": "string",
          "tag": "string"
        },
        {
          "scope": "string",
          "tag": "string"
        },
        {
          "scope": "string",
          "tag": "string"
        },
        {
          "scope": "string",
          "tag": "string"
        }
      ],
      "origin_id": "string",
      "origin_properties": [
        {
          "value": "string",
          "key": "string"
        },
        {
          "value": "string",
          "key": "string"
        }
      ],
      "external_id": "string",
      "owner_id": "string",
      "origin_type": "string",
      "cm_local_id": "string"
    },
    {
      "_self": {
        "action": "string",
        "href": "string",
        "rel": "string"
      },
      "_links": [
        {
          "action": "string",
          "href": "string",
          "rel": "string"
        },
        {
          "action": "string",
          "href": "string",
          "rel": "string"
        },
        {
          "action": "string",
          "href": "string",
          "rel": "string"
        },
        {
          "action": "string",
          "href": "string",
          "rel": "string"
        },
        {
          "action": "string",
          "href": "string",
          "rel": "string"
        },
        {
          "action": "string",
          "href": "string",
          "rel": "string"
        },
        {
          "action": "string",
          "href": "string",
          "rel": "string"
        },
        {
          "action": "string",
          "href": "string",
          "rel": "string"
        }
      ],
      "_schema": "string",
      "_last_sync_time": 2,
      "display_name": "string",
      "description": "string",
      "resource_type": "string",
      "tags": [
        {
          "scope": "string",
          "tag": "string"
        },
        {
          "scope": "string",
          "tag": "string"
        },
        {
          "scope": "string",
          "tag": "string"
        }
      ],
      "origin_id": "string",
      "origin_properties": [
        {
          "value": "string",
          "key": "string"
        },
        {
          "value": "string",
          "key": "string"
        },
        {
          "value": "string",
          "key": "string"
        },
        {
          "value": "string",
          "key": "string"
        },
        {
          "value": "string",
          "key": "string"
        },
        {
          "value": "string",
          "key": "string"
        },
        {
          "value": "string",
          "key": "string"
        },
        {
          "value": "string",
          "key": "string"
        },
        {
          "value": "string",
          "key": "string"
        }
      ],
      "external_id": "string",
      "owner_id": "string",
      "origin_type": "string",
      "cm_local_id": "string"
    },
    {
      "_self": {
        "action": "string",
        "href": "string",
        "rel": "string"
      },
      "_links": [
        {
          "action": "string",
          "href": "string",
          "rel": "string"
        },
        {
          "action": "string",
          "href": "string",
          "rel": "string"
        },
        {
          "action": "string",
          "href": "string",
          "rel": "string"
        },
        {
          "action": "string",
          "href": "string",
          "rel": "string"
        },
        {
          "action": "string",
          "href": "string",
          "rel": "string"
        },
        {
          "action": "string",
          "href": "string",
          "rel": "string"
        },
        {
          "action": "string",
          "href": "string",
          "rel": "string"
        },
        {
          "action": "string",
          "href": "string",
          "rel": "string"
        }
      ],
      "_schema": "string",
      "_last_sync_time": 3,
      "display_name": "string",
      "description": "string",
      "resource_type": "string",
      "tags": [
        {
          "scope": "string",
          "tag": "string"
        }
      ],
      "origin_id": "string",
      "origin_properties": [
        {
          "value": "string",
          "key": "string"
        }
      ],
      "external_id": "string",
      "owner_id": "string",
      "origin_type": "string",
      "cm_local_id": "string"
    },
    {
      "_self": {
        "action": "string",
        "href": "string",
        "rel": "string"
      },
      "_links": [
        {
          "action": "string",
          "href": "string",
          "rel": "string"
        },
        {
          "action": "string",
          "href": "string",
          "rel": "string"
        },
        {
          "action": "string",
          "href": "string",
          "rel": "string"
        },
        {
          "action": "string",
          "href": "string",
          "rel": "string"
        },
        {
          "action": "string",
          "href": "string",
          "rel": "string"
        },
        {
          "action": "string",
          "href": "string",
          "rel": "string"
        },
        {
          "action": "string",
          "href": "string",
          "rel": "string"
        },
        {
          "action": "string",
          "href": "string",
          "rel": "string"
        }
      ],
      "_schema": "string",
      "_last_sync_time": 3,
      "display_name": "string",
      "description": "string",
      "resource_type": "string",
      "tags": [
        {
          "scope": "string",
          "tag": "string"
        },
        {
          "scope": "string",
          "tag": "string"
        },
        {
          "scope": "string",
          "tag": "string"
        },
        {
          "scope": "string",
          "tag": "string"
        },
        {
          "scope": "string",
          "tag": "string"
        },
        {
          "scope": "string",
          "tag": "string"
        },
        {
          "scope": "string",
          "tag": "string"
        },
        {
          "scope": "string",
          "tag": "string"
        },
        {
          "scope": "string",
          "tag": "string"
        },
        {
          "scope": "string",
          "tag": "string"
        }
      ],
      "origin_id": "string",
      "origin_properties": [
        {
          "value": "string",
          "key": "string"
        },
        {
          "value": "string",
          "key": "string"
        },
        {
          "value": "string",
          "key": "string"
        }
      ],
      "external_id": "string",
      "owner_id": "string",
      "origin_type": "string",
      "cm_local_id": "string"
    },
    {
      "_self": {
        "action": "string",
        "href": "string",
        "rel": "string"
      },
      "_links": [
        {
          "action": "string",
          "href": "string",
          "rel": "string"
        },
        {
          "action": "string",
          "href": "string",
          "rel": "string"
        },
        {
          "action": "string",
          "href": "string",
          "rel": "string"
        },
        {
          "action": "string",
          "href": "string",
          "rel": "string"
        },
        {
          "action": "string",
          "href": "string",
          "rel": "string"
        }
      ],
      "_schema": "string",
      "_last_sync_time": 9,
      "display_name": "string",
      "description": "string",
      "resource_type": "string",
      "tags": [
        {
          "scope": "string",
          "tag": "string"
        },
        {
          "scope": "string",
          "tag": "string"
        },
        {
          "scope": "string",
          "tag": "string"
        },
        {
          "scope": "string",
          "tag": "string"
        },
        {
          "scope": "string",
          "tag": "string"
        },
        {
          "scope": "string",
          "tag": "string"
        },
        {
          "scope": "string",
          "tag": "string"
        },
        {
          "scope": "string",
          "tag": "string"
        },
        {
          "scope": "string",
          "tag": "string"
        },
        {
          "scope": "string",
          "tag": "string"
        }
      ],
      "origin_id": "string",
      "origin_properties": [
        {
          "value": "string",
          "key": "string"
        },
        {
          "value": "string",
          "key": "string"
        },
        {
          "value": "string",
          "key": "string"
        },
        {
          "value": "string",
          "key": "string"
        },
        {
          "value": "string",
          "key": "string"
        },
        {
          "value": "string",
          "key": "string"
        }
      ],
      "external_id": "string",
      "owner_id": "string",
      "origin_type": "string",
      "cm_local_id": "string"
    },
    {
      "_self": {
        "action": "string",
        "href": "string",
        "rel": "string"
      },
      "_links": [
        {
          "action": "string",
          "href": "string",
          "rel": "string"
        },
        {
          "action": "string",
          "href": "string",
          "rel": "string"
        },
        {
          "action": "string",
          "href": "string",
          "rel": "string"
        },
        {
          "action": "string",
          "href": "string",
          "rel": "string"
        },
        {
          "action": "string",
          "href": "string",
          "rel": "string"
        }
      ],
      "_schema": "string",
      "_last_sync_time": 7,
      "display_name": "string",
      "description": "string",
      "resource_type": "string",
      "tags": [
        {
          "scope": "string",
          "tag": "string"
        },
        {
          "scope": "string",
          "tag": "string"
        },
        {
          "scope": "string",
          "tag": "string"
        },
        {
          "scope": "string",
          "tag": "string"
        },
        {
          "scope": "string",
          "tag": "string"
        },
        {
          "scope": "string",
          "tag": "string"
        },
        {
          "scope": "string",
          "tag": "string"
        },
        {
          "scope": "string",
          "tag": "string"
        }
      ],
      "origin_id": "string",
      "origin_properties": [
        {
          "value": "string",
          "key": "string"
        },
        {
          "value": "string",
          "key": "string"
        },
        {
          "value": "string",
          "key": "string"
        },
        {
          "value": "string",
          "key": "string"
        }
      ],
      "external_id": "string",
      "owner_id": "string",
      "origin_type": "string",
      "cm_local_id": "string"
    }
  ]
}