{
  "_self": {
    "action": "string",
    "href": "string",
    "rel": "string"
  },
  "_links": [
    {
      "action": "string",
      "href": "string",
      "rel": "string"
    },
    {
      "action": "string",
      "href": "string",
      "rel": "string"
    },
    {
      "action": "string",
      "href": "string",
      "rel": "string"
    },
    {
      "action": "string",
      "href": "string",
      "rel": "string"
    },
    {
      "action": "string",
      "href": "string",
      "rel": "string"
    },
    {
      "action": "string",
      "href": "string",
      "rel": "string"
    }
  ],
  "_schema": "string",
  "cursor": "string",
  "sort_ascending": false,
  "sort_by": "string",
  "result_count": 1,
  "results": [
    {
      "_self": {
        "action": "string",
        "href": "string",
        "rel": "string"
      },
      "_links": [
        {
          "action": "string",
          "href": "string",
          "rel": "string"
        },
        {
          "action": "string",
          "href": "string",
          "rel": "string"
        },
        {
          "action": "string",
          "href": "string",
          "rel": "string"
        },
        {
          "action": "string",
          "href": "string",
          "rel": "string"
        },
        {
          "action": "string",
          "href": "string",
          "rel": "string"
        },
        {
          "action": "string",
          "href": "string",
          "rel": "string"
        }
      ],
      "_schema": "string",
      "_revision": 2,
      "_system_owned": false,
      "display_name": "string",
      "description": "string",
      "tags": [
        {
          "scope": "string",
          "tag": "string"
        },
        {
          "scope": "string",
          "tag": "string"
        },
        {
          "scope": "string",
          "tag": "string"
        },
        {
          "scope": "string",
          "tag": "string"
        },
        {
          "scope": "string",
          "tag": "string"
        },
        {
          "scope": "string",
          "tag": "string"
        },
        {
          "scope": "string",
          "tag": "string"
        }
      ],
      "_create_user": "string",
      "_protection": "string",
      "_create_time": 6,
      "_last_modified_time": 3,
      "_last_modified_user": "string",
      "id": "string",
      "resource_type": "string",
      "bfd_config": {
        "receive_interval": 1000,
        "declare_dead_multiple": 3,
        "transmit_interval": 1000
      },
      "enabled": true,
      "peer_ip_address": "string"
    }
  ]
}