{
  "_self": {
    "action": "string",
    "href": "string",
    "rel": "string"
  },
  "_links": [
    {
      "action": "string",
      "href": "string",
      "rel": "string"
    },
    {
      "action": "string",
      "href": "string",
      "rel": "string"
    },
    {
      "action": "string",
      "href": "string",
      "rel": "string"
    }
  ],
  "_schema": "string",
  "features": "string",
  "description": "string",
  "product_version": "string",
  "expiry": 1,
  "is_eval": true,
  "is_mh": false,
  "license_key": "string",
  "is_expired": true,
  "product_name": "string",
  "capacity_type": "VM",
  "quantity": 1
}