{
  "_self": {
    "action": "string",
    "href": "string",
    "rel": "string"
  },
  "_links": [
    {
      "action": "string",
      "href": "string",
      "rel": "string"
    },
    {
      "action": "string",
      "href": "string",
      "rel": "string"
    },
    {
      "action": "string",
      "href": "string",
      "rel": "string"
    },
    {
      "action": "string",
      "href": "string",
      "rel": "string"
    }
  ],
  "_schema": "string",
  "_revision": 10,
  "_system_owned": false,
  "display_name": "string",
  "description": "string",
  "tags": [
    {
      "scope": "string",
      "tag": "string"
    }
  ],
  "_create_user": "string",
  "_protection": "string",
  "_create_time": 5,
  "_last_modified_time": 2,
  "_last_modified_user": "string",
  "id": "string",
  "resource_type": "string",
  "stateful": false,
  "is_default": false,
  "applied_tos": [
    {
      "target_display_name": "string",
      "is_valid": true,
      "target_id": "string",
      "target_type": "string"
    },
    {
      "target_display_name": "string",
      "is_valid": false,
      "target_id": "string",
      "target_type": "string"
    },
    {
      "target_display_name": "string",
      "is_valid": true,
      "target_id": "string",
      "target_type": "string"
    }
  ],
  "rule_count": 5,
  "section_type": "LAYER3"
}