{
  "_self": {
    "action": "string",
    "href": "string",
    "rel": "string"
  },
  "_links": [
    {
      "action": "string",
      "href": "string",
      "rel": "string"
    }
  ],
  "_schema": "string",
  "service_name": "string",
  "service_properties": {
    "package_logging_level": [
      {
        "logging_level": "DEBUG",
        "package_name": "string"
      },
      {
        "logging_level": "ERROR",
        "package_name": "string"
      },
      {
        "logging_level": "WARN",
        "package_name": "string"
      },
      {
        "logging_level": "TRACE",
        "package_name": "string"
      },
      {
        "logging_level": "TRACE",
        "package_name": "string"
      },
      {
        "logging_level": "DEBUG",
        "package_name": "string"
      },
      {
        "logging_level": "DEBUG",
        "package_name": "string"
      },
      {
        "logging_level": "INFO",
        "package_name": "string"
      },
      {
        "logging_level": "INFO",
        "package_name": "string"
      },
      {
        "logging_level": "WARN",
        "package_name": "string"
      }
    ],
    "logging_level": "INFO"
  }
}