{
  "remote_file_server": {
    "directory_path": "string",
    "protocol": {
      "protocol_name": "sftp",
      "ssh_fingerprint": "string",
      "authentication_scheme": {
        "username": "string",
        "scheme_name": "PASSWORD",
        "password": "string"
      }
    },
    "port": 22,
    "server": "string"
  },
  "passphrase": "string"
}