{
  "actions": [
    {
      "name": "getEulacontent",
      "protocol": "REST",
      "method": "GET",
      "entitypath": "{base_path}/{version}/eula/content?{query}",
      "requestSchema": "schema.json",
      "responseSchema": "schema.json",
      "timeout": 0,
      "sendEmpty": false,
      "sendGetBody": false,
      "requestDatatype": "JSON",
      "responseDatatype": "JSON",
      "headers": {},
      "responseObjects": [
        {
          "type": "default",
          "key": "",
          "mockFile": "mockdatafiles/getEulacontent-default.json"
        }
      ]
    },
    {
      "name": "putLicense",
      "protocol": "REST",
      "method": "PUT",
      "entitypath": "{base_path}/{version}/license?{query}",
      "requestSchema": "schema.json",
      "responseSchema": "schema.json",
      "timeout": 0,
      "sendEmpty": false,
      "sendGetBody": false,
      "requestDatatype": "JSON",
      "responseDatatype": "JSON",
      "headers": {},
      "responseObjects": [
        {
          "type": "default",
          "key": "",
          "mockFile": "mockdatafiles/putLicense-default.json"
        }
      ]
    },
    {
      "name": "getLicense",
      "protocol": "REST",
      "method": "GET",
      "entitypath": "{base_path}/{version}/license?{query}",
      "requestSchema": "schema.json",
      "responseSchema": "schema.json",
      "timeout": 0,
      "sendEmpty": false,
      "sendGetBody": false,
      "requestDatatype": "JSON",
      "responseDatatype": "JSON",
      "headers": {},
      "responseObjects": [
        {
          "type": "default",
          "key": "",
          "mockFile": "mockdatafiles/getLicense-default.json"
        }
      ]
    },
    {
      "name": "getEulaacceptance",
      "protocol": "REST",
      "method": "GET",
      "entitypath": "{base_path}/{version}/eula/acceptance?{query}",
      "requestSchema": "schema.json",
      "responseSchema": "schema.json",
      "timeout": 0,
      "sendEmpty": false,
      "sendGetBody": false,
      "requestDatatype": "JSON",
      "responseDatatype": "JSON",
      "headers": {},
      "responseObjects": [
        {
          "type": "default",
          "key": "",
          "mockFile": "mockdatafiles/getEulaacceptance-default.json"
        }
      ]
    },
    {
      "name": "postUpgradeeulaaccept",
      "protocol": "REST",
      "method": "POST",
      "entitypath": "{base_path}/{version}/upgrade/eula/accept?{query}",
      "requestSchema": "schema.json",
      "responseSchema": "schema.json",
      "timeout": 0,
      "sendEmpty": false,
      "sendGetBody": false,
      "requestDatatype": "JSON",
      "responseDatatype": "JSON",
      "headers": {},
      "responseObjects": [
        {
          "type": "default",
          "key": "",
          "mockFile": ""
        }
      ]
    },
    {
      "name": "getLicenseslicensesUsage",
      "protocol": "REST",
      "method": "GET",
      "entitypath": "{base_path}/{version}/licenses/licenses-usage?{query}",
      "requestSchema": "schema.json",
      "responseSchema": "schema.json",
      "timeout": 0,
      "sendEmpty": false,
      "sendGetBody": false,
      "requestDatatype": "JSON",
      "responseDatatype": "JSON",
      "headers": {},
      "responseObjects": [
        {
          "type": "default",
          "key": "",
          "mockFile": "mockdatafiles/getLicenseslicensesUsage-default.json"
        }
      ]
    },
    {
      "name": "getLicenseslicenseKey",
      "protocol": "REST",
      "method": "GET",
      "entitypath": "{base_path}/{version}/licenses/{pathv1}?{query}",
      "requestSchema": "schema.json",
      "responseSchema": "schema.json",
      "timeout": 0,
      "sendEmpty": false,
      "sendGetBody": false,
      "requestDatatype": "JSON",
      "responseDatatype": "JSON",
      "headers": {},
      "responseObjects": [
        {
          "type": "default",
          "key": "",
          "mockFile": "mockdatafiles/getLicenseslicenseKey-default.json"
        }
      ]
    },
    {
      "name": "deleteLicenseslicenseKey",
      "protocol": "REST",
      "method": "DELETE",
      "entitypath": "{base_path}/{version}/licenses/{pathv1}?{query}",
      "requestSchema": "schema.json",
      "responseSchema": "schema.json",
      "timeout": 0,
      "sendEmpty": false,
      "sendGetBody": false,
      "requestDatatype": "JSON",
      "responseDatatype": "JSON",
      "headers": {},
      "responseObjects": [
        {
          "type": "default",
          "key": "",
          "mockFile": ""
        }
      ]
    },
    {
      "name": "postEulaaccept",
      "protocol": "REST",
      "method": "POST",
      "entitypath": "{base_path}/{version}/eula/accept?{query}",
      "requestSchema": "schema.json",
      "responseSchema": "schema.json",
      "timeout": 0,
      "sendEmpty": false,
      "sendGetBody": false,
      "requestDatatype": "JSON",
      "responseDatatype": "JSON",
      "headers": {},
      "responseObjects": [
        {
          "type": "default",
          "key": "",
          "mockFile": ""
        }
      ]
    },
    {
      "name": "getLicenseslicensesUsageformatcsv",
      "protocol": "REST",
      "method": "GET",
      "entitypath": "{base_path}/{version}/licenses/licenses-usage?{query}",
      "requestSchema": "schema.json",
      "responseSchema": "schema.json",
      "timeout": 0,
      "sendEmpty": false,
      "sendGetBody": false,
      "requestDatatype": "JSON",
      "responseDatatype": "JSON",
      "headers": {},
      "responseObjects": [
        {
          "type": "default",
          "key": "",
          "mockFile": "mockdatafiles/getLicenseslicensesUsageformatcsv-default.json"
        }
      ]
    },
    {
      "name": "getUpgradeeulacontent",
      "protocol": "REST",
      "method": "GET",
      "entitypath": "{base_path}/{version}/upgrade/eula/content?{query}",
      "requestSchema": "schema.json",
      "responseSchema": "schema.json",
      "timeout": 0,
      "sendEmpty": false,
      "sendGetBody": false,
      "requestDatatype": "JSON",
      "responseDatatype": "JSON",
      "headers": {},
      "responseObjects": [
        {
          "type": "default",
          "key": "",
          "mockFile": "mockdatafiles/getUpgradeeulacontent-default.json"
        }
      ]
    },
    {
      "name": "postLicensesactiondelete",
      "protocol": "REST",
      "method": "POST",
      "entitypath": "{base_path}/{version}/licenses?{query}",
      "requestSchema": "schema.json",
      "responseSchema": "schema.json",
      "timeout": 0,
      "sendEmpty": false,
      "sendGetBody": false,
      "requestDatatype": "JSON",
      "responseDatatype": "JSON",
      "headers": {},
      "responseObjects": [
        {
          "type": "default",
          "key": "",
          "mockFile": ""
        }
      ]
    },
    {
      "name": "postLicenses",
      "protocol": "REST",
      "method": "POST",
      "entitypath": "{base_path}/{version}/licenses?{query}",
      "requestSchema": "schema.json",
      "responseSchema": "schema.json",
      "timeout": 0,
      "sendEmpty": false,
      "sendGetBody": false,
      "requestDatatype": "JSON",
      "responseDatatype": "JSON",
      "headers": {},
      "responseObjects": [
        {
          "type": "default",
          "key": "",
          "mockFile": "mockdatafiles/postLicenses-default.json"
        }
      ]
    },
    {
      "name": "getLicenses",
      "protocol": "REST",
      "method": "GET",
      "entitypath": "{base_path}/{version}/licenses?{query}",
      "requestSchema": "schema.json",
      "responseSchema": "schema.json",
      "timeout": 0,
      "sendEmpty": false,
      "sendGetBody": false,
      "requestDatatype": "JSON",
      "responseDatatype": "JSON",
      "headers": {},
      "responseObjects": [
        {
          "type": "default",
          "key": "",
          "mockFile": "mockdatafiles/getLicenses-default.json"
        }
      ]
    },
    {
      "name": "getUpgradeeulaacceptance",
      "protocol": "REST",
      "method": "GET",
      "entitypath": "{base_path}/{version}/upgrade/eula/acceptance?{query}",
      "requestSchema": "schema.json",
      "responseSchema": "schema.json",
      "timeout": 0,
      "sendEmpty": false,
      "sendGetBody": false,
      "requestDatatype": "JSON",
      "responseDatatype": "JSON",
      "headers": {},
      "responseObjects": [
        {
          "type": "default",
          "key": "",
          "mockFile": "mockdatafiles/getUpgradeeulaacceptance-default.json"
        }
      ]
    }
  ]
}