{
  "_self": {
    "action": "string",
    "href": "string",
    "rel": "string"
  },
  "_links": [
    {
      "action": "string",
      "href": "string",
      "rel": "string"
    },
    {
      "action": "string",
      "href": "string",
      "rel": "string"
    },
    {
      "action": "string",
      "href": "string",
      "rel": "string"
    },
    {
      "action": "string",
      "href": "string",
      "rel": "string"
    },
    {
      "action": "string",
      "href": "string",
      "rel": "string"
    },
    {
      "action": "string",
      "href": "string",
      "rel": "string"
    },
    {
      "action": "string",
      "href": "string",
      "rel": "string"
    }
  ],
  "_schema": "string",
  "pids": [
    7
  ],
  "runtime_state": "stopped",
  "monitor_runtime_state": "running",
  "monitor_pid": 7
}