{
  "_self": {
    "action": "string",
    "href": "string",
    "rel": "string"
  },
  "_links": [
    {
      "action": "string",
      "href": "string",
      "rel": "string"
    },
    {
      "action": "string",
      "href": "string",
      "rel": "string"
    }
  ],
  "_schema": "string",
  "_revision": 10,
  "_system_owned": true,
  "display_name": "string",
  "description": "string",
  "tags": [
    {
      "scope": "string",
      "tag": "string"
    }
  ],
  "_create_user": "string",
  "_protection": "string",
  "_create_time": 8,
  "_last_modified_time": 9,
  "_last_modified_user": "string",
  "id": "string",
  "resource_type": "string",
  "lease_time": 86400,
  "gateway_ip": "string",
  "options": {
    "option121": {
      "static_routes": [
        {
          "next_hop": "string",
          "network": "string"
        },
        {
          "next_hop": "string",
          "network": "string"
        }
      ]
    },
    "others": [
      {
        "code": 3,
        "values": [
          "string",
          "string",
          "string",
          "string"
        ]
      },
      {
        "code": 7,
        "values": [
          "string",
          "string",
          "string",
          "string",
          "string",
          "string",
          "string",
          "string"
        ]
      },
      {
        "code": 7,
        "values": [
          "string",
          "string",
          "string",
          "string",
          "string",
          "string"
        ]
      },
      {
        "code": 5,
        "values": [
          "string",
          "string",
          "string",
          "string",
          "string",
          "string",
          "string"
        ]
      },
      {
        "code": 2,
        "values": [
          "string",
          "string",
          "string",
          "string",
          "string"
        ]
      },
      {
        "code": 2,
        "values": [
          "string",
          "string",
          "string",
          "string",
          "string",
          "string",
          "string",
          "string",
          "string"
        ]
      },
      {
        "code": 10,
        "values": [
          "string",
          "string",
          "string"
        ]
      },
      {
        "code": 2,
        "values": [
          "string",
          "string",
          "string",
          "string",
          "string",
          "string",
          "string",
          "string",
          "string"
        ]
      },
      {
        "code": 2,
        "values": [
          "string",
          "string"
        ]
      }
    ]
  },
  "allocation_ranges": [
    {
      "_self": {
        "action": "string",
        "href": "string",
        "rel": "string"
      },
      "_links": [
        {
          "action": "string",
          "href": "string",
          "rel": "string"
        },
        {
          "action": "string",
          "href": "string",
          "rel": "string"
        },
        {
          "action": "string",
          "href": "string",
          "rel": "string"
        },
        {
          "action": "string",
          "href": "string",
          "rel": "string"
        },
        {
          "action": "string",
          "href": "string",
          "rel": "string"
        }
      ],
      "_schema": "string",
      "start": "string",
      "end": "string"
    },
    {
      "_self": {
        "action": "string",
        "href": "string",
        "rel": "string"
      },
      "_links": [
        {
          "action": "string",
          "href": "string",
          "rel": "string"
        },
        {
          "action": "string",
          "href": "string",
          "rel": "string"
        },
        {
          "action": "string",
          "href": "string",
          "rel": "string"
        },
        {
          "action": "string",
          "href": "string",
          "rel": "string"
        }
      ],
      "_schema": "string",
      "start": "string",
      "end": "string"
    },
    {
      "_self": {
        "action": "string",
        "href": "string",
        "rel": "string"
      },
      "_links": [
        {
          "action": "string",
          "href": "string",
          "rel": "string"
        },
        {
          "action": "string",
          "href": "string",
          "rel": "string"
        },
        {
          "action": "string",
          "href": "string",
          "rel": "string"
        }
      ],
      "_schema": "string",
      "start": "string",
      "end": "string"
    },
    {
      "_self": {
        "action": "string",
        "href": "string",
        "rel": "string"
      },
      "_links": [
        {
          "action": "string",
          "href": "string",
          "rel": "string"
        },
        {
          "action": "string",
          "href": "string",
          "rel": "string"
        },
        {
          "action": "string",
          "href": "string",
          "rel": "string"
        },
        {
          "action": "string",
          "href": "string",
          "rel": "string"
        }
      ],
      "_schema": "string",
      "start": "string",
      "end": "string"
    },
    {
      "_self": {
        "action": "string",
        "href": "string",
        "rel": "string"
      },
      "_links": [
        {
          "action": "string",
          "href": "string",
          "rel": "string"
        },
        {
          "action": "string",
          "href": "string",
          "rel": "string"
        },
        {
          "action": "string",
          "href": "string",
          "rel": "string"
        },
        {
          "action": "string",
          "href": "string",
          "rel": "string"
        },
        {
          "action": "string",
          "href": "string",
          "rel": "string"
        }
      ],
      "_schema": "string",
      "start": "string",
      "end": "string"
    },
    {
      "_self": {
        "action": "string",
        "href": "string",
        "rel": "string"
      },
      "_links": [
        {
          "action": "string",
          "href": "string",
          "rel": "string"
        },
        {
          "action": "string",
          "href": "string",
          "rel": "string"
        },
        {
          "action": "string",
          "href": "string",
          "rel": "string"
        },
        {
          "action": "string",
          "href": "string",
          "rel": "string"
        }
      ],
      "_schema": "string",
      "start": "string",
      "end": "string"
    },
    {
      "_self": {
        "action": "string",
        "href": "string",
        "rel": "string"
      },
      "_links": [
        {
          "action": "string",
          "href": "string",
          "rel": "string"
        },
        {
          "action": "string",
          "href": "string",
          "rel": "string"
        },
        {
          "action": "string",
          "href": "string",
          "rel": "string"
        },
        {
          "action": "string",
          "href": "string",
          "rel": "string"
        },
        {
          "action": "string",
          "href": "string",
          "rel": "string"
        },
        {
          "action": "string",
          "href": "string",
          "rel": "string"
        }
      ],
      "_schema": "string",
      "start": "string",
      "end": "string"
    },
    {
      "_self": {
        "action": "string",
        "href": "string",
        "rel": "string"
      },
      "_links": [
        {
          "action": "string",
          "href": "string",
          "rel": "string"
        }
      ],
      "_schema": "string",
      "start": "string",
      "end": "string"
    },
    {
      "_self": {
        "action": "string",
        "href": "string",
        "rel": "string"
      },
      "_links": [
        {
          "action": "string",
          "href": "string",
          "rel": "string"
        },
        {
          "action": "string",
          "href": "string",
          "rel": "string"
        },
        {
          "action": "string",
          "href": "string",
          "rel": "string"
        },
        {
          "action": "string",
          "href": "string",
          "rel": "string"
        },
        {
          "action": "string",
          "href": "string",
          "rel": "string"
        },
        {
          "action": "string",
          "href": "string",
          "rel": "string"
        }
      ],
      "_schema": "string",
      "start": "string",
      "end": "string"
    },
    {
      "_self": {
        "action": "string",
        "href": "string",
        "rel": "string"
      },
      "_links": [
        {
          "action": "string",
          "href": "string",
          "rel": "string"
        },
        {
          "action": "string",
          "href": "string",
          "rel": "string"
        },
        {
          "action": "string",
          "href": "string",
          "rel": "string"
        },
        {
          "action": "string",
          "href": "string",
          "rel": "string"
        },
        {
          "action": "string",
          "href": "string",
          "rel": "string"
        },
        {
          "action": "string",
          "href": "string",
          "rel": "string"
        },
        {
          "action": "string",
          "href": "string",
          "rel": "string"
        },
        {
          "action": "string",
          "href": "string",
          "rel": "string"
        },
        {
          "action": "string",
          "href": "string",
          "rel": "string"
        }
      ],
      "_schema": "string",
      "start": "string",
      "end": "string"
    }
  ],
  "warning_threshold": 80,
  "error_threshold": 100
}