{
  "_self": {
    "action": "string",
    "href": "string",
    "rel": "string"
  },
  "_links": [
    {
      "action": "string",
      "href": "string",
      "rel": "string"
    },
    {
      "action": "string",
      "href": "string",
      "rel": "string"
    },
    {
      "action": "string",
      "href": "string",
      "rel": "string"
    },
    {
      "action": "string",
      "href": "string",
      "rel": "string"
    },
    {
      "action": "string",
      "href": "string",
      "rel": "string"
    }
  ],
  "_schema": "string",
  "_revision": 1,
  "_system_owned": false,
  "display_name": "string",
  "description": "string",
  "tags": [
    {
      "scope": "string",
      "tag": "string"
    },
    {
      "scope": "string",
      "tag": "string"
    },
    {
      "scope": "string",
      "tag": "string"
    },
    {
      "scope": "string",
      "tag": "string"
    },
    {
      "scope": "string",
      "tag": "string"
    },
    {
      "scope": "string",
      "tag": "string"
    },
    {
      "scope": "string",
      "tag": "string"
    },
    {
      "scope": "string",
      "tag": "string"
    }
  ],
  "_create_user": "string",
  "_protection": "string",
  "_create_time": 8,
  "_last_modified_time": 2,
  "_last_modified_user": "string",
  "id": "string",
  "resource_type": "string",
  "enabled": true,
  "upgrade_unit_count": 9,
  "type": "string",
  "upgrade_units": [
    {
      "_self": {
        "action": "string",
        "href": "string",
        "rel": "string"
      },
      "_links": [
        {
          "action": "string",
          "href": "string",
          "rel": "string"
        },
        {
          "action": "string",
          "href": "string",
          "rel": "string"
        },
        {
          "action": "string",
          "href": "string",
          "rel": "string"
        },
        {
          "action": "string",
          "href": "string",
          "rel": "string"
        },
        {
          "action": "string",
          "href": "string",
          "rel": "string"
        },
        {
          "action": "string",
          "href": "string",
          "rel": "string"
        },
        {
          "action": "string",
          "href": "string",
          "rel": "string"
        },
        {
          "action": "string",
          "href": "string",
          "rel": "string"
        },
        {
          "action": "string",
          "href": "string",
          "rel": "string"
        },
        {
          "action": "string",
          "href": "string",
          "rel": "string"
        }
      ],
      "_schema": "string",
      "group": {
        "display_name": "string",
        "id": "string"
      },
      "warnings": [
        "string",
        "string",
        "string",
        "string",
        "string",
        "string",
        "string"
      ],
      "current_version": "string",
      "metadata": [
        {
          "value": "string",
          "key": "string"
        },
        {
          "value": "string",
          "key": "string"
        },
        {
          "value": "string",
          "key": "string"
        },
        {
          "value": "string",
          "key": "string"
        },
        {
          "value": "string",
          "key": "string"
        }
      ],
      "type": "string",
      "id": "string",
      "display_name": "string"
    },
    {
      "_self": {
        "action": "string",
        "href": "string",
        "rel": "string"
      },
      "_links": [
        {
          "action": "string",
          "href": "string",
          "rel": "string"
        },
        {
          "action": "string",
          "href": "string",
          "rel": "string"
        },
        {
          "action": "string",
          "href": "string",
          "rel": "string"
        },
        {
          "action": "string",
          "href": "string",
          "rel": "string"
        },
        {
          "action": "string",
          "href": "string",
          "rel": "string"
        }
      ],
      "_schema": "string",
      "group": {
        "display_name": "string",
        "id": "string"
      },
      "warnings": [
        "string",
        "string",
        "string",
        "string",
        "string",
        "string"
      ],
      "current_version": "string",
      "metadata": [
        {
          "value": "string",
          "key": "string"
        },
        {
          "value": "string",
          "key": "string"
        },
        {
          "value": "string",
          "key": "string"
        },
        {
          "value": "string",
          "key": "string"
        },
        {
          "value": "string",
          "key": "string"
        },
        {
          "value": "string",
          "key": "string"
        },
        {
          "value": "string",
          "key": "string"
        },
        {
          "value": "string",
          "key": "string"
        }
      ],
      "type": "string",
      "id": "string",
      "display_name": "string"
    },
    {
      "_self": {
        "action": "string",
        "href": "string",
        "rel": "string"
      },
      "_links": [
        {
          "action": "string",
          "href": "string",
          "rel": "string"
        },
        {
          "action": "string",
          "href": "string",
          "rel": "string"
        }
      ],
      "_schema": "string",
      "group": {
        "display_name": "string",
        "id": "string"
      },
      "warnings": [
        "string",
        "string",
        "string",
        "string",
        "string"
      ],
      "current_version": "string",
      "metadata": [
        {
          "value": "string",
          "key": "string"
        },
        {
          "value": "string",
          "key": "string"
        },
        {
          "value": "string",
          "key": "string"
        },
        {
          "value": "string",
          "key": "string"
        },
        {
          "value": "string",
          "key": "string"
        },
        {
          "value": "string",
          "key": "string"
        },
        {
          "value": "string",
          "key": "string"
        },
        {
          "value": "string",
          "key": "string"
        },
        {
          "value": "string",
          "key": "string"
        }
      ],
      "type": "string",
      "id": "string",
      "display_name": "string"
    },
    {
      "_self": {
        "action": "string",
        "href": "string",
        "rel": "string"
      },
      "_links": [
        {
          "action": "string",
          "href": "string",
          "rel": "string"
        },
        {
          "action": "string",
          "href": "string",
          "rel": "string"
        },
        {
          "action": "string",
          "href": "string",
          "rel": "string"
        }
      ],
      "_schema": "string",
      "group": {
        "display_name": "string",
        "id": "string"
      },
      "warnings": [
        "string",
        "string",
        "string",
        "string",
        "string",
        "string",
        "string"
      ],
      "current_version": "string",
      "metadata": [
        {
          "value": "string",
          "key": "string"
        },
        {
          "value": "string",
          "key": "string"
        },
        {
          "value": "string",
          "key": "string"
        },
        {
          "value": "string",
          "key": "string"
        }
      ],
      "type": "string",
      "id": "string",
      "display_name": "string"
    },
    {
      "_self": {
        "action": "string",
        "href": "string",
        "rel": "string"
      },
      "_links": [
        {
          "action": "string",
          "href": "string",
          "rel": "string"
        },
        {
          "action": "string",
          "href": "string",
          "rel": "string"
        },
        {
          "action": "string",
          "href": "string",
          "rel": "string"
        },
        {
          "action": "string",
          "href": "string",
          "rel": "string"
        },
        {
          "action": "string",
          "href": "string",
          "rel": "string"
        },
        {
          "action": "string",
          "href": "string",
          "rel": "string"
        },
        {
          "action": "string",
          "href": "string",
          "rel": "string"
        },
        {
          "action": "string",
          "href": "string",
          "rel": "string"
        },
        {
          "action": "string",
          "href": "string",
          "rel": "string"
        },
        {
          "action": "string",
          "href": "string",
          "rel": "string"
        }
      ],
      "_schema": "string",
      "group": {
        "display_name": "string",
        "id": "string"
      },
      "warnings": [
        "string",
        "string",
        "string",
        "string"
      ],
      "current_version": "string",
      "metadata": [
        {
          "value": "string",
          "key": "string"
        },
        {
          "value": "string",
          "key": "string"
        },
        {
          "value": "string",
          "key": "string"
        },
        {
          "value": "string",
          "key": "string"
        },
        {
          "value": "string",
          "key": "string"
        },
        {
          "value": "string",
          "key": "string"
        }
      ],
      "type": "string",
      "id": "string",
      "display_name": "string"
    },
    {
      "_self": {
        "action": "string",
        "href": "string",
        "rel": "string"
      },
      "_links": [
        {
          "action": "string",
          "href": "string",
          "rel": "string"
        },
        {
          "action": "string",
          "href": "string",
          "rel": "string"
        },
        {
          "action": "string",
          "href": "string",
          "rel": "string"
        }
      ],
      "_schema": "string",
      "group": {
        "display_name": "string",
        "id": "string"
      },
      "warnings": [
        "string"
      ],
      "current_version": "string",
      "metadata": [
        {
          "value": "string",
          "key": "string"
        },
        {
          "value": "string",
          "key": "string"
        },
        {
          "value": "string",
          "key": "string"
        },
        {
          "value": "string",
          "key": "string"
        },
        {
          "value": "string",
          "key": "string"
        },
        {
          "value": "string",
          "key": "string"
        },
        {
          "value": "string",
          "key": "string"
        },
        {
          "value": "string",
          "key": "string"
        }
      ],
      "type": "string",
      "id": "string",
      "display_name": "string"
    },
    {
      "_self": {
        "action": "string",
        "href": "string",
        "rel": "string"
      },
      "_links": [
        {
          "action": "string",
          "href": "string",
          "rel": "string"
        },
        {
          "action": "string",
          "href": "string",
          "rel": "string"
        }
      ],
      "_schema": "string",
      "group": {
        "display_name": "string",
        "id": "string"
      },
      "warnings": [
        "string",
        "string",
        "string",
        "string",
        "string",
        "string",
        "string",
        "string"
      ],
      "current_version": "string",
      "metadata": [
        {
          "value": "string",
          "key": "string"
        },
        {
          "value": "string",
          "key": "string"
        },
        {
          "value": "string",
          "key": "string"
        },
        {
          "value": "string",
          "key": "string"
        }
      ],
      "type": "string",
      "id": "string",
      "display_name": "string"
    },
    {
      "_self": {
        "action": "string",
        "href": "string",
        "rel": "string"
      },
      "_links": [
        {
          "action": "string",
          "href": "string",
          "rel": "string"
        },
        {
          "action": "string",
          "href": "string",
          "rel": "string"
        },
        {
          "action": "string",
          "href": "string",
          "rel": "string"
        },
        {
          "action": "string",
          "href": "string",
          "rel": "string"
        },
        {
          "action": "string",
          "href": "string",
          "rel": "string"
        },
        {
          "action": "string",
          "href": "string",
          "rel": "string"
        },
        {
          "action": "string",
          "href": "string",
          "rel": "string"
        },
        {
          "action": "string",
          "href": "string",
          "rel": "string"
        },
        {
          "action": "string",
          "href": "string",
          "rel": "string"
        },
        {
          "action": "string",
          "href": "string",
          "rel": "string"
        }
      ],
      "_schema": "string",
      "group": {
        "display_name": "string",
        "id": "string"
      },
      "warnings": [
        "string",
        "string",
        "string",
        "string",
        "string",
        "string"
      ],
      "current_version": "string",
      "metadata": [
        {
          "value": "string",
          "key": "string"
        },
        {
          "value": "string",
          "key": "string"
        },
        {
          "value": "string",
          "key": "string"
        },
        {
          "value": "string",
          "key": "string"
        },
        {
          "value": "string",
          "key": "string"
        }
      ],
      "type": "string",
      "id": "string",
      "display_name": "string"
    },
    {
      "_self": {
        "action": "string",
        "href": "string",
        "rel": "string"
      },
      "_links": [
        {
          "action": "string",
          "href": "string",
          "rel": "string"
        },
        {
          "action": "string",
          "href": "string",
          "rel": "string"
        },
        {
          "action": "string",
          "href": "string",
          "rel": "string"
        },
        {
          "action": "string",
          "href": "string",
          "rel": "string"
        },
        {
          "action": "string",
          "href": "string",
          "rel": "string"
        },
        {
          "action": "string",
          "href": "string",
          "rel": "string"
        }
      ],
      "_schema": "string",
      "group": {
        "display_name": "string",
        "id": "string"
      },
      "warnings": [
        "string",
        "string",
        "string"
      ],
      "current_version": "string",
      "metadata": [
        {
          "value": "string",
          "key": "string"
        }
      ],
      "type": "string",
      "id": "string",
      "display_name": "string"
    },
    {
      "_self": {
        "action": "string",
        "href": "string",
        "rel": "string"
      },
      "_links": [
        {
          "action": "string",
          "href": "string",
          "rel": "string"
        },
        {
          "action": "string",
          "href": "string",
          "rel": "string"
        },
        {
          "action": "string",
          "href": "string",
          "rel": "string"
        },
        {
          "action": "string",
          "href": "string",
          "rel": "string"
        },
        {
          "action": "string",
          "href": "string",
          "rel": "string"
        },
        {
          "action": "string",
          "href": "string",
          "rel": "string"
        },
        {
          "action": "string",
          "href": "string",
          "rel": "string"
        },
        {
          "action": "string",
          "href": "string",
          "rel": "string"
        }
      ],
      "_schema": "string",
      "group": {
        "display_name": "string",
        "id": "string"
      },
      "warnings": [
        "string",
        "string",
        "string",
        "string"
      ],
      "current_version": "string",
      "metadata": [
        {
          "value": "string",
          "key": "string"
        },
        {
          "value": "string",
          "key": "string"
        },
        {
          "value": "string",
          "key": "string"
        },
        {
          "value": "string",
          "key": "string"
        },
        {
          "value": "string",
          "key": "string"
        },
        {
          "value": "string",
          "key": "string"
        }
      ],
      "type": "string",
      "id": "string",
      "display_name": "string"
    }
  ],
  "extended_configuration": [
    {
      "value": "string",
      "key": "string"
    },
    {
      "value": "string",
      "key": "string"
    }
  ],
  "parallel": true
}