{
  "_self": {
    "action": "string",
    "href": "string",
    "rel": "string"
  },
  "_links": [
    {
      "action": "string",
      "href": "string",
      "rel": "string"
    },
    {
      "action": "string",
      "href": "string",
      "rel": "string"
    },
    {
      "action": "string",
      "href": "string",
      "rel": "string"
    },
    {
      "action": "string",
      "href": "string",
      "rel": "string"
    },
    {
      "action": "string",
      "href": "string",
      "rel": "string"
    },
    {
      "action": "string",
      "href": "string",
      "rel": "string"
    },
    {
      "action": "string",
      "href": "string",
      "rel": "string"
    },
    {
      "action": "string",
      "href": "string",
      "rel": "string"
    }
  ],
  "_schema": "string",
  "_revision": 7,
  "_system_owned": true,
  "display_name": "string",
  "description": "string",
  "tags": [
    {
      "scope": "string",
      "tag": "string"
    },
    {
      "scope": "string",
      "tag": "string"
    },
    {
      "scope": "string",
      "tag": "string"
    },
    {
      "scope": "string",
      "tag": "string"
    }
  ],
  "_create_user": "string",
  "_protection": "string",
  "_create_time": 10,
  "_last_modified_time": 3,
  "_last_modified_user": "string",
  "id": "string",
  "resource_type": "string",
  "stateful": false,
  "is_default": false,
  "applied_tos": [
    {
      "target_display_name": "string",
      "is_valid": true,
      "target_id": "string",
      "target_type": "string"
    },
    {
      "target_display_name": "string",
      "is_valid": true,
      "target_id": "string",
      "target_type": "string"
    },
    {
      "target_display_name": "string",
      "is_valid": true,
      "target_id": "string",
      "target_type": "string"
    },
    {
      "target_display_name": "string",
      "is_valid": false,
      "target_id": "string",
      "target_type": "string"
    }
  ],
  "rule_count": 4,
  "section_type": "LAYER3",
  "rules": [
    {
      "_self": {
        "action": "string",
        "href": "string",
        "rel": "string"
      },
      "_links": [
        {
          "action": "string",
          "href": "string",
          "rel": "string"
        },
        {
          "action": "string",
          "href": "string",
          "rel": "string"
        },
        {
          "action": "string",
          "href": "string",
          "rel": "string"
        },
        {
          "action": "string",
          "href": "string",
          "rel": "string"
        },
        {
          "action": "string",
          "href": "string",
          "rel": "string"
        }
      ],
      "_schema": "string",
      "_revision": 3,
      "_owner": {
        "action": "string",
        "href": "string",
        "rel": "string"
      },
      "display_name": "string",
      "id": "string",
      "resource_type": "string",
      "description": "string",
      "is_default": false,
      "direction": "IN_OUT",
      "rule_tag": "string",
      "ip_protocol": "IPV4_IPV6",
      "notes": "string",
      "applied_tos": [
        {
          "target_display_name": "string",
          "is_valid": false,
          "target_id": "string",
          "target_type": "string"
        },
        {
          "target_display_name": "string",
          "is_valid": false,
          "target_id": "string",
          "target_type": "string"
        },
        {
          "target_display_name": "string",
          "is_valid": false,
          "target_id": "string",
          "target_type": "string"
        },
        {
          "target_display_name": "string",
          "is_valid": false,
          "target_id": "string",
          "target_type": "string"
        },
        {
          "target_display_name": "string",
          "is_valid": false,
          "target_id": "string",
          "target_type": "string"
        },
        {
          "target_display_name": "string",
          "is_valid": true,
          "target_id": "string",
          "target_type": "string"
        },
        {
          "target_display_name": "string",
          "is_valid": false,
          "target_id": "string",
          "target_type": "string"
        },
        {
          "target_display_name": "string",
          "is_valid": true,
          "target_id": "string",
          "target_type": "string"
        },
        {
          "target_display_name": "string",
          "is_valid": true,
          "target_id": "string",
          "target_type": "string"
        }
      ],
      "logged": false,
      "disabled": true,
      "sources": [
        {
          "target_display_name": "string",
          "is_valid": true,
          "target_id": "string",
          "target_type": "string"
        },
        {
          "target_display_name": "string",
          "is_valid": true,
          "target_id": "string",
          "target_type": "string"
        },
        {
          "target_display_name": "string",
          "is_valid": true,
          "target_id": "string",
          "target_type": "string"
        },
        {
          "target_display_name": "string",
          "is_valid": true,
          "target_id": "string",
          "target_type": "string"
        }
      ],
      "services": [
        {
          "target_display_name": "string",
          "is_valid": true,
          "target_id": "string",
          "target_type": "string",
          "service": {
            "resource_type": "EtherTypeNSService"
          }
        },
        {
          "target_display_name": "string",
          "is_valid": true,
          "target_id": "string",
          "target_type": "string",
          "service": {
            "resource_type": "EtherTypeNSService"
          }
        },
        {
          "target_display_name": "string",
          "is_valid": false,
          "target_id": "string",
          "target_type": "string",
          "service": {
            "resource_type": "IPProtocolNSService"
          }
        },
        {
          "target_display_name": "string",
          "is_valid": true,
          "target_id": "string",
          "target_type": "string",
          "service": {
            "resource_type": "ALGTypeNSService"
          }
        },
        {
          "target_display_name": "string",
          "is_valid": false,
          "target_id": "string",
          "target_type": "string",
          "service": {
            "resource_type": "ICMPTypeNSService"
          }
        }
      ],
      "action": "DROP",
      "sources_excluded": false,
      "destinations_excluded": false,
      "destinations": [
        {
          "target_display_name": "string",
          "is_valid": false,
          "target_id": "string",
          "target_type": "string"
        },
        {
          "target_display_name": "string",
          "is_valid": true,
          "target_id": "string",
          "target_type": "string"
        },
        {
          "target_display_name": "string",
          "is_valid": true,
          "target_id": "string",
          "target_type": "string"
        },
        {
          "target_display_name": "string",
          "is_valid": false,
          "target_id": "string",
          "target_type": "string"
        }
      ]
    },
    {
      "_self": {
        "action": "string",
        "href": "string",
        "rel": "string"
      },
      "_links": [
        {
          "action": "string",
          "href": "string",
          "rel": "string"
        },
        {
          "action": "string",
          "href": "string",
          "rel": "string"
        },
        {
          "action": "string",
          "href": "string",
          "rel": "string"
        },
        {
          "action": "string",
          "href": "string",
          "rel": "string"
        }
      ],
      "_schema": "string",
      "_revision": 10,
      "_owner": {
        "action": "string",
        "href": "string",
        "rel": "string"
      },
      "display_name": "string",
      "id": "string",
      "resource_type": "string",
      "description": "string",
      "is_default": false,
      "direction": "IN_OUT",
      "rule_tag": "string",
      "ip_protocol": "IPV4_IPV6",
      "notes": "string",
      "applied_tos": [
        {
          "target_display_name": "string",
          "is_valid": false,
          "target_id": "string",
          "target_type": "string"
        }
      ],
      "logged": true,
      "disabled": true,
      "sources": [
        {
          "target_display_name": "string",
          "is_valid": true,
          "target_id": "string",
          "target_type": "string"
        },
        {
          "target_display_name": "string",
          "is_valid": true,
          "target_id": "string",
          "target_type": "string"
        },
        {
          "target_display_name": "string",
          "is_valid": false,
          "target_id": "string",
          "target_type": "string"
        },
        {
          "target_display_name": "string",
          "is_valid": false,
          "target_id": "string",
          "target_type": "string"
        },
        {
          "target_display_name": "string",
          "is_valid": true,
          "target_id": "string",
          "target_type": "string"
        },
        {
          "target_display_name": "string",
          "is_valid": false,
          "target_id": "string",
          "target_type": "string"
        },
        {
          "target_display_name": "string",
          "is_valid": false,
          "target_id": "string",
          "target_type": "string"
        },
        {
          "target_display_name": "string",
          "is_valid": true,
          "target_id": "string",
          "target_type": "string"
        },
        {
          "target_display_name": "string",
          "is_valid": true,
          "target_id": "string",
          "target_type": "string"
        }
      ],
      "services": [
        {
          "target_display_name": "string",
          "is_valid": false,
          "target_id": "string",
          "target_type": "string",
          "service": {
            "resource_type": "ICMPTypeNSService"
          }
        },
        {
          "target_display_name": "string",
          "is_valid": true,
          "target_id": "string",
          "target_type": "string",
          "service": {
            "resource_type": "IPProtocolNSService"
          }
        },
        {
          "target_display_name": "string",
          "is_valid": true,
          "target_id": "string",
          "target_type": "string",
          "service": {
            "resource_type": "ALGTypeNSService"
          }
        },
        {
          "target_display_name": "string",
          "is_valid": true,
          "target_id": "string",
          "target_type": "string",
          "service": {
            "resource_type": "IPProtocolNSService"
          }
        }
      ],
      "action": "REJECT",
      "sources_excluded": false,
      "destinations_excluded": true,
      "destinations": [
        {
          "target_display_name": "string",
          "is_valid": false,
          "target_id": "string",
          "target_type": "string"
        },
        {
          "target_display_name": "string",
          "is_valid": false,
          "target_id": "string",
          "target_type": "string"
        },
        {
          "target_display_name": "string",
          "is_valid": true,
          "target_id": "string",
          "target_type": "string"
        },
        {
          "target_display_name": "string",
          "is_valid": true,
          "target_id": "string",
          "target_type": "string"
        },
        {
          "target_display_name": "string",
          "is_valid": false,
          "target_id": "string",
          "target_type": "string"
        }
      ]
    },
    {
      "_self": {
        "action": "string",
        "href": "string",
        "rel": "string"
      },
      "_links": [
        {
          "action": "string",
          "href": "string",
          "rel": "string"
        },
        {
          "action": "string",
          "href": "string",
          "rel": "string"
        },
        {
          "action": "string",
          "href": "string",
          "rel": "string"
        },
        {
          "action": "string",
          "href": "string",
          "rel": "string"
        },
        {
          "action": "string",
          "href": "string",
          "rel": "string"
        },
        {
          "action": "string",
          "href": "string",
          "rel": "string"
        },
        {
          "action": "string",
          "href": "string",
          "rel": "string"
        },
        {
          "action": "string",
          "href": "string",
          "rel": "string"
        },
        {
          "action": "string",
          "href": "string",
          "rel": "string"
        }
      ],
      "_schema": "string",
      "_revision": 7,
      "_owner": {
        "action": "string",
        "href": "string",
        "rel": "string"
      },
      "display_name": "string",
      "id": "string",
      "resource_type": "string",
      "description": "string",
      "is_default": true,
      "direction": "IN_OUT",
      "rule_tag": "string",
      "ip_protocol": "IPV4_IPV6",
      "notes": "string",
      "applied_tos": [
        {
          "target_display_name": "string",
          "is_valid": true,
          "target_id": "string",
          "target_type": "string"
        },
        {
          "target_display_name": "string",
          "is_valid": true,
          "target_id": "string",
          "target_type": "string"
        },
        {
          "target_display_name": "string",
          "is_valid": true,
          "target_id": "string",
          "target_type": "string"
        },
        {
          "target_display_name": "string",
          "is_valid": true,
          "target_id": "string",
          "target_type": "string"
        },
        {
          "target_display_name": "string",
          "is_valid": false,
          "target_id": "string",
          "target_type": "string"
        },
        {
          "target_display_name": "string",
          "is_valid": true,
          "target_id": "string",
          "target_type": "string"
        }
      ],
      "logged": true,
      "disabled": false,
      "sources": [
        {
          "target_display_name": "string",
          "is_valid": true,
          "target_id": "string",
          "target_type": "string"
        },
        {
          "target_display_name": "string",
          "is_valid": true,
          "target_id": "string",
          "target_type": "string"
        },
        {
          "target_display_name": "string",
          "is_valid": false,
          "target_id": "string",
          "target_type": "string"
        },
        {
          "target_display_name": "string",
          "is_valid": false,
          "target_id": "string",
          "target_type": "string"
        },
        {
          "target_display_name": "string",
          "is_valid": false,
          "target_id": "string",
          "target_type": "string"
        }
      ],
      "services": [
        {
          "target_display_name": "string",
          "is_valid": true,
          "target_id": "string",
          "target_type": "string",
          "service": {
            "resource_type": "ICMPTypeNSService"
          }
        },
        {
          "target_display_name": "string",
          "is_valid": true,
          "target_id": "string",
          "target_type": "string",
          "service": {
            "resource_type": "L4PortSetNSService"
          }
        },
        {
          "target_display_name": "string",
          "is_valid": false,
          "target_id": "string",
          "target_type": "string",
          "service": {
            "resource_type": "ALGTypeNSService"
          }
        },
        {
          "target_display_name": "string",
          "is_valid": true,
          "target_id": "string",
          "target_type": "string",
          "service": {
            "resource_type": "EtherTypeNSService"
          }
        },
        {
          "target_display_name": "string",
          "is_valid": true,
          "target_id": "string",
          "target_type": "string",
          "service": {
            "resource_type": "EtherTypeNSService"
          }
        },
        {
          "target_display_name": "string",
          "is_valid": true,
          "target_id": "string",
          "target_type": "string",
          "service": {
            "resource_type": "L4PortSetNSService"
          }
        },
        {
          "target_display_name": "string",
          "is_valid": true,
          "target_id": "string",
          "target_type": "string",
          "service": {
            "resource_type": "EtherTypeNSService"
          }
        },
        {
          "target_display_name": "string",
          "is_valid": true,
          "target_id": "string",
          "target_type": "string",
          "service": {
            "resource_type": "EtherTypeNSService"
          }
        },
        {
          "target_display_name": "string",
          "is_valid": false,
          "target_id": "string",
          "target_type": "string",
          "service": {
            "resource_type": "L4PortSetNSService"
          }
        }
      ],
      "action": "REJECT",
      "sources_excluded": false,
      "destinations_excluded": false,
      "destinations": [
        {
          "target_display_name": "string",
          "is_valid": false,
          "target_id": "string",
          "target_type": "string"
        },
        {
          "target_display_name": "string",
          "is_valid": true,
          "target_id": "string",
          "target_type": "string"
        },
        {
          "target_display_name": "string",
          "is_valid": false,
          "target_id": "string",
          "target_type": "string"
        }
      ]
    },
    {
      "_self": {
        "action": "string",
        "href": "string",
        "rel": "string"
      },
      "_links": [
        {
          "action": "string",
          "href": "string",
          "rel": "string"
        },
        {
          "action": "string",
          "href": "string",
          "rel": "string"
        },
        {
          "action": "string",
          "href": "string",
          "rel": "string"
        },
        {
          "action": "string",
          "href": "string",
          "rel": "string"
        },
        {
          "action": "string",
          "href": "string",
          "rel": "string"
        },
        {
          "action": "string",
          "href": "string",
          "rel": "string"
        },
        {
          "action": "string",
          "href": "string",
          "rel": "string"
        },
        {
          "action": "string",
          "href": "string",
          "rel": "string"
        }
      ],
      "_schema": "string",
      "_revision": 8,
      "_owner": {
        "action": "string",
        "href": "string",
        "rel": "string"
      },
      "display_name": "string",
      "id": "string",
      "resource_type": "string",
      "description": "string",
      "is_default": true,
      "direction": "IN_OUT",
      "rule_tag": "string",
      "ip_protocol": "IPV4_IPV6",
      "notes": "string",
      "applied_tos": [
        {
          "target_display_name": "string",
          "is_valid": false,
          "target_id": "string",
          "target_type": "string"
        },
        {
          "target_display_name": "string",
          "is_valid": false,
          "target_id": "string",
          "target_type": "string"
        },
        {
          "target_display_name": "string",
          "is_valid": false,
          "target_id": "string",
          "target_type": "string"
        },
        {
          "target_display_name": "string",
          "is_valid": false,
          "target_id": "string",
          "target_type": "string"
        },
        {
          "target_display_name": "string",
          "is_valid": true,
          "target_id": "string",
          "target_type": "string"
        },
        {
          "target_display_name": "string",
          "is_valid": true,
          "target_id": "string",
          "target_type": "string"
        }
      ],
      "logged": false,
      "disabled": false,
      "sources": [
        {
          "target_display_name": "string",
          "is_valid": true,
          "target_id": "string",
          "target_type": "string"
        },
        {
          "target_display_name": "string",
          "is_valid": false,
          "target_id": "string",
          "target_type": "string"
        },
        {
          "target_display_name": "string",
          "is_valid": true,
          "target_id": "string",
          "target_type": "string"
        }
      ],
      "services": [
        {
          "target_display_name": "string",
          "is_valid": true,
          "target_id": "string",
          "target_type": "string",
          "service": {
            "resource_type": "IGMPTypeNSService"
          }
        },
        {
          "target_display_name": "string",
          "is_valid": true,
          "target_id": "string",
          "target_type": "string",
          "service": {
            "resource_type": "EtherTypeNSService"
          }
        },
        {
          "target_display_name": "string",
          "is_valid": true,
          "target_id": "string",
          "target_type": "string",
          "service": {
            "resource_type": "EtherTypeNSService"
          }
        },
        {
          "target_display_name": "string",
          "is_valid": true,
          "target_id": "string",
          "target_type": "string",
          "service": {
            "resource_type": "ALGTypeNSService"
          }
        },
        {
          "target_display_name": "string",
          "is_valid": true,
          "target_id": "string",
          "target_type": "string",
          "service": {
            "resource_type": "ICMPTypeNSService"
          }
        }
      ],
      "action": "DROP",
      "sources_excluded": true,
      "destinations_excluded": true,
      "destinations": [
        {
          "target_display_name": "string",
          "is_valid": true,
          "target_id": "string",
          "target_type": "string"
        },
        {
          "target_display_name": "string",
          "is_valid": true,
          "target_id": "string",
          "target_type": "string"
        },
        {
          "target_display_name": "string",
          "is_valid": false,
          "target_id": "string",
          "target_type": "string"
        },
        {
          "target_display_name": "string",
          "is_valid": false,
          "target_id": "string",
          "target_type": "string"
        },
        {
          "target_display_name": "string",
          "is_valid": false,
          "target_id": "string",
          "target_type": "string"
        },
        {
          "target_display_name": "string",
          "is_valid": true,
          "target_id": "string",
          "target_type": "string"
        }
      ]
    },
    {
      "_self": {
        "action": "string",
        "href": "string",
        "rel": "string"
      },
      "_links": [
        {
          "action": "string",
          "href": "string",
          "rel": "string"
        },
        {
          "action": "string",
          "href": "string",
          "rel": "string"
        },
        {
          "action": "string",
          "href": "string",
          "rel": "string"
        },
        {
          "action": "string",
          "href": "string",
          "rel": "string"
        }
      ],
      "_schema": "string",
      "_revision": 8,
      "_owner": {
        "action": "string",
        "href": "string",
        "rel": "string"
      },
      "display_name": "string",
      "id": "string",
      "resource_type": "string",
      "description": "string",
      "is_default": false,
      "direction": "IN_OUT",
      "rule_tag": "string",
      "ip_protocol": "IPV4_IPV6",
      "notes": "string",
      "applied_tos": [
        {
          "target_display_name": "string",
          "is_valid": false,
          "target_id": "string",
          "target_type": "string"
        },
        {
          "target_display_name": "string",
          "is_valid": false,
          "target_id": "string",
          "target_type": "string"
        },
        {
          "target_display_name": "string",
          "is_valid": false,
          "target_id": "string",
          "target_type": "string"
        },
        {
          "target_display_name": "string",
          "is_valid": false,
          "target_id": "string",
          "target_type": "string"
        }
      ],
      "logged": true,
      "disabled": true,
      "sources": [
        {
          "target_display_name": "string",
          "is_valid": true,
          "target_id": "string",
          "target_type": "string"
        }
      ],
      "services": [
        {
          "target_display_name": "string",
          "is_valid": true,
          "target_id": "string",
          "target_type": "string",
          "service": {
            "resource_type": "IPProtocolNSService"
          }
        },
        {
          "target_display_name": "string",
          "is_valid": true,
          "target_id": "string",
          "target_type": "string",
          "service": {
            "resource_type": "ALGTypeNSService"
          }
        }
      ],
      "action": "DROP",
      "sources_excluded": true,
      "destinations_excluded": true,
      "destinations": [
        {
          "target_display_name": "string",
          "is_valid": false,
          "target_id": "string",
          "target_type": "string"
        },
        {
          "target_display_name": "string",
          "is_valid": true,
          "target_id": "string",
          "target_type": "string"
        },
        {
          "target_display_name": "string",
          "is_valid": true,
          "target_id": "string",
          "target_type": "string"
        }
      ]
    },
    {
      "_self": {
        "action": "string",
        "href": "string",
        "rel": "string"
      },
      "_links": [
        {
          "action": "string",
          "href": "string",
          "rel": "string"
        },
        {
          "action": "string",
          "href": "string",
          "rel": "string"
        },
        {
          "action": "string",
          "href": "string",
          "rel": "string"
        },
        {
          "action": "string",
          "href": "string",
          "rel": "string"
        },
        {
          "action": "string",
          "href": "string",
          "rel": "string"
        },
        {
          "action": "string",
          "href": "string",
          "rel": "string"
        },
        {
          "action": "string",
          "href": "string",
          "rel": "string"
        },
        {
          "action": "string",
          "href": "string",
          "rel": "string"
        }
      ],
      "_schema": "string",
      "_revision": 6,
      "_owner": {
        "action": "string",
        "href": "string",
        "rel": "string"
      },
      "display_name": "string",
      "id": "string",
      "resource_type": "string",
      "description": "string",
      "is_default": true,
      "direction": "IN_OUT",
      "rule_tag": "string",
      "ip_protocol": "IPV4_IPV6",
      "notes": "string",
      "applied_tos": [
        {
          "target_display_name": "string",
          "is_valid": false,
          "target_id": "string",
          "target_type": "string"
        },
        {
          "target_display_name": "string",
          "is_valid": false,
          "target_id": "string",
          "target_type": "string"
        },
        {
          "target_display_name": "string",
          "is_valid": false,
          "target_id": "string",
          "target_type": "string"
        },
        {
          "target_display_name": "string",
          "is_valid": false,
          "target_id": "string",
          "target_type": "string"
        },
        {
          "target_display_name": "string",
          "is_valid": true,
          "target_id": "string",
          "target_type": "string"
        },
        {
          "target_display_name": "string",
          "is_valid": true,
          "target_id": "string",
          "target_type": "string"
        },
        {
          "target_display_name": "string",
          "is_valid": false,
          "target_id": "string",
          "target_type": "string"
        },
        {
          "target_display_name": "string",
          "is_valid": false,
          "target_id": "string",
          "target_type": "string"
        }
      ],
      "logged": true,
      "disabled": false,
      "sources": [
        {
          "target_display_name": "string",
          "is_valid": true,
          "target_id": "string",
          "target_type": "string"
        },
        {
          "target_display_name": "string",
          "is_valid": false,
          "target_id": "string",
          "target_type": "string"
        },
        {
          "target_display_name": "string",
          "is_valid": false,
          "target_id": "string",
          "target_type": "string"
        },
        {
          "target_display_name": "string",
          "is_valid": false,
          "target_id": "string",
          "target_type": "string"
        },
        {
          "target_display_name": "string",
          "is_valid": true,
          "target_id": "string",
          "target_type": "string"
        },
        {
          "target_display_name": "string",
          "is_valid": false,
          "target_id": "string",
          "target_type": "string"
        },
        {
          "target_display_name": "string",
          "is_valid": true,
          "target_id": "string",
          "target_type": "string"
        },
        {
          "target_display_name": "string",
          "is_valid": true,
          "target_id": "string",
          "target_type": "string"
        }
      ],
      "services": [
        {
          "target_display_name": "string",
          "is_valid": true,
          "target_id": "string",
          "target_type": "string",
          "service": {
            "resource_type": "ICMPTypeNSService"
          }
        },
        {
          "target_display_name": "string",
          "is_valid": false,
          "target_id": "string",
          "target_type": "string",
          "service": {
            "resource_type": "L4PortSetNSService"
          }
        },
        {
          "target_display_name": "string",
          "is_valid": false,
          "target_id": "string",
          "target_type": "string",
          "service": {
            "resource_type": "L4PortSetNSService"
          }
        },
        {
          "target_display_name": "string",
          "is_valid": false,
          "target_id": "string",
          "target_type": "string",
          "service": {
            "resource_type": "IGMPTypeNSService"
          }
        },
        {
          "target_display_name": "string",
          "is_valid": false,
          "target_id": "string",
          "target_type": "string",
          "service": {
            "resource_type": "EtherTypeNSService"
          }
        },
        {
          "target_display_name": "string",
          "is_valid": true,
          "target_id": "string",
          "target_type": "string",
          "service": {
            "resource_type": "L4PortSetNSService"
          }
        }
      ],
      "action": "ALLOW",
      "sources_excluded": true,
      "destinations_excluded": false,
      "destinations": [
        {
          "target_display_name": "string",
          "is_valid": false,
          "target_id": "string",
          "target_type": "string"
        },
        {
          "target_display_name": "string",
          "is_valid": false,
          "target_id": "string",
          "target_type": "string"
        }
      ]
    }
  ]
}