{
  "_self": {
    "action": "string",
    "href": "string",
    "rel": "string"
  },
  "_links": [
    {
      "action": "string",
      "href": "string",
      "rel": "string"
    }
  ],
  "_schema": "string",
  "_revision": 7,
  "_system_owned": false,
  "display_name": "string",
  "description": "string",
  "tags": [
    {
      "scope": "string",
      "tag": "string"
    },
    {
      "scope": "string",
      "tag": "string"
    },
    {
      "scope": "string",
      "tag": "string"
    },
    {
      "scope": "string",
      "tag": "string"
    },
    {
      "scope": "string",
      "tag": "string"
    }
  ],
  "_create_user": "string",
  "_protection": "string",
  "_create_time": 6,
  "_last_modified_time": 9,
  "_last_modified_user": "string",
  "id": "string",
  "resource_type": "string",
  "host_switch_spec": {
    "resource_type": "StandardHostSwitchSpec"
  },
  "transport_zone_endpoints": [
    {
      "transport_zone_id": "string",
      "transport_zone_profile_ids": [
        {
          "profile_id": "string",
          "resource_type": "BfdHealthMonitoringProfile"
        },
        {
          "profile_id": "string",
          "resource_type": "BfdHealthMonitoringProfile"
        },
        {
          "profile_id": "string",
          "resource_type": "BfdHealthMonitoringProfile"
        },
        {
          "profile_id": "string",
          "resource_type": "BfdHealthMonitoringProfile"
        },
        {
          "profile_id": "string",
          "resource_type": "BfdHealthMonitoringProfile"
        },
        {
          "profile_id": "string",
          "resource_type": "BfdHealthMonitoringProfile"
        },
        {
          "profile_id": "string",
          "resource_type": "BfdHealthMonitoringProfile"
        },
        {
          "profile_id": "string",
          "resource_type": "BfdHealthMonitoringProfile"
        },
        {
          "profile_id": "string",
          "resource_type": "BfdHealthMonitoringProfile"
        }
      ]
    }
  ],
  "compute_collection_ids": [
    "string",
    "string",
    "string",
    "string",
    "string",
    "string"
  ]
}