{
  "role": "string",
  "features": [
    {
      "feature": "string",
      "permission": "crud"
    },
    {
      "feature": "string",
      "permission": "crud"
    },
    {
      "feature": "string",
      "permission": "crud"
    },
    {
      "feature": "string",
      "permission": "none"
    },
    {
      "feature": "string",
      "permission": "none"
    },
    {
      "feature": "string",
      "permission": "none"
    },
    {
      "feature": "string",
      "permission": "crud"
    },
    {
      "feature": "string",
      "permission": "execute"
    },
    {
      "feature": "string",
      "permission": "read"
    }
  ]
}