{
  "_self": {
    "action": "string",
    "href": "string",
    "rel": "string"
  },
  "_links": [
    {
      "action": "string",
      "href": "string",
      "rel": "string"
    },
    {
      "action": "string",
      "href": "string",
      "rel": "string"
    },
    {
      "action": "string",
      "href": "string",
      "rel": "string"
    },
    {
      "action": "string",
      "href": "string",
      "rel": "string"
    },
    {
      "action": "string",
      "href": "string",
      "rel": "string"
    },
    {
      "action": "string",
      "href": "string",
      "rel": "string"
    }
  ],
  "_schema": "string",
  "tx_dropped": 1,
  "rx_packets": 3,
  "tx_carrier": 7,
  "rx_bytes": 9,
  "tx_errors": 4,
  "interface_id": "string",
  "tx_colls": 8,
  "rx_frame": 9,
  "rx_errors": 1,
  "tx_bytes": 9,
  "rx_dropped": 5,
  "tx_packets": 6,
  "source": "realtime"
}