{
  "_self": {
    "action": "string",
    "href": "string",
    "rel": "string"
  },
  "_links": [
    {
      "action": "string",
      "href": "string",
      "rel": "string"
    },
    {
      "action": "string",
      "href": "string",
      "rel": "string"
    },
    {
      "action": "string",
      "href": "string",
      "rel": "string"
    },
    {
      "action": "string",
      "href": "string",
      "rel": "string"
    },
    {
      "action": "string",
      "href": "string",
      "rel": "string"
    },
    {
      "action": "string",
      "href": "string",
      "rel": "string"
    },
    {
      "action": "string",
      "href": "string",
      "rel": "string"
    }
  ],
  "_schema": "string",
  "cursor": "string",
  "sort_ascending": true,
  "sort_by": "string",
  "result_count": 1,
  "results": [
    {
      "_self": {
        "action": "string",
        "href": "string",
        "rel": "string"
      },
      "_links": [
        {
          "action": "string",
          "href": "string",
          "rel": "string"
        },
        {
          "action": "string",
          "href": "string",
          "rel": "string"
        },
        {
          "action": "string",
          "href": "string",
          "rel": "string"
        },
        {
          "action": "string",
          "href": "string",
          "rel": "string"
        },
        {
          "action": "string",
          "href": "string",
          "rel": "string"
        },
        {
          "action": "string",
          "href": "string",
          "rel": "string"
        },
        {
          "action": "string",
          "href": "string",
          "rel": "string"
        },
        {
          "action": "string",
          "href": "string",
          "rel": "string"
        },
        {
          "action": "string",
          "href": "string",
          "rel": "string"
        }
      ],
      "_schema": "string",
      "_revision": 7,
      "_system_owned": false,
      "display_name": "string",
      "description": "string",
      "tags": [
        {
          "scope": "string",
          "tag": "string"
        },
        {
          "scope": "string",
          "tag": "string"
        },
        {
          "scope": "string",
          "tag": "string"
        },
        {
          "scope": "string",
          "tag": "string"
        },
        {
          "scope": "string",
          "tag": "string"
        },
        {
          "scope": "string",
          "tag": "string"
        },
        {
          "scope": "string",
          "tag": "string"
        }
      ],
      "_create_user": "string",
      "_protection": "string",
      "_create_time": 3,
      "_last_modified_time": 8,
      "_last_modified_user": "string",
      "id": "string",
      "resource_type": "string",
      "default_service": true,
      "service_type": "NON_ETHER",
      "members": [
        {
          "target_display_name": "string",
          "is_valid": true,
          "target_id": "string",
          "target_type": "string"
        },
        {
          "target_display_name": "string",
          "is_valid": true,
          "target_id": "string",
          "target_type": "string"
        },
        {
          "target_display_name": "string",
          "is_valid": true,
          "target_id": "string",
          "target_type": "string"
        },
        {
          "target_display_name": "string",
          "is_valid": false,
          "target_id": "string",
          "target_type": "string"
        },
        {
          "target_display_name": "string",
          "is_valid": true,
          "target_id": "string",
          "target_type": "string"
        },
        {
          "target_display_name": "string",
          "is_valid": true,
          "target_id": "string",
          "target_type": "string"
        },
        {
          "target_display_name": "string",
          "is_valid": true,
          "target_id": "string",
          "target_type": "string"
        },
        {
          "target_display_name": "string",
          "is_valid": false,
          "target_id": "string",
          "target_type": "string"
        },
        {
          "target_display_name": "string",
          "is_valid": false,
          "target_id": "string",
          "target_type": "string"
        },
        {
          "target_display_name": "string",
          "is_valid": false,
          "target_id": "string",
          "target_type": "string"
        }
      ]
    },
    {
      "_self": {
        "action": "string",
        "href": "string",
        "rel": "string"
      },
      "_links": [
        {
          "action": "string",
          "href": "string",
          "rel": "string"
        },
        {
          "action": "string",
          "href": "string",
          "rel": "string"
        },
        {
          "action": "string",
          "href": "string",
          "rel": "string"
        },
        {
          "action": "string",
          "href": "string",
          "rel": "string"
        },
        {
          "action": "string",
          "href": "string",
          "rel": "string"
        }
      ],
      "_schema": "string",
      "_revision": 2,
      "_system_owned": true,
      "display_name": "string",
      "description": "string",
      "tags": [
        {
          "scope": "string",
          "tag": "string"
        }
      ],
      "_create_user": "string",
      "_protection": "string",
      "_create_time": 3,
      "_last_modified_time": 3,
      "_last_modified_user": "string",
      "id": "string",
      "resource_type": "string",
      "default_service": true,
      "service_type": "NON_ETHER",
      "members": [
        {
          "target_display_name": "string",
          "is_valid": true,
          "target_id": "string",
          "target_type": "string"
        },
        {
          "target_display_name": "string",
          "is_valid": false,
          "target_id": "string",
          "target_type": "string"
        },
        {
          "target_display_name": "string",
          "is_valid": true,
          "target_id": "string",
          "target_type": "string"
        },
        {
          "target_display_name": "string",
          "is_valid": false,
          "target_id": "string",
          "target_type": "string"
        },
        {
          "target_display_name": "string",
          "is_valid": true,
          "target_id": "string",
          "target_type": "string"
        },
        {
          "target_display_name": "string",
          "is_valid": false,
          "target_id": "string",
          "target_type": "string"
        }
      ]
    }
  ]
}