{
  "_self": {
    "action": "string",
    "href": "string",
    "rel": "string"
  },
  "_links": [
    {
      "action": "string",
      "href": "string",
      "rel": "string"
    },
    {
      "action": "string",
      "href": "string",
      "rel": "string"
    },
    {
      "action": "string",
      "href": "string",
      "rel": "string"
    },
    {
      "action": "string",
      "href": "string",
      "rel": "string"
    },
    {
      "action": "string",
      "href": "string",
      "rel": "string"
    },
    {
      "action": "string",
      "href": "string",
      "rel": "string"
    },
    {
      "action": "string",
      "href": "string",
      "rel": "string"
    }
  ],
  "_schema": "string",
  "_revision": 6,
  "_system_owned": false,
  "display_name": "string",
  "description": "string",
  "tags": [
    {
      "scope": "string",
      "tag": "string"
    },
    {
      "scope": "string",
      "tag": "string"
    }
  ],
  "_create_user": "string",
  "_protection": "string",
  "_create_time": 6,
  "_last_modified_time": 7,
  "_last_modified_user": "string",
  "id": "string",
  "resource_type": "string",
  "member_node_type": "UNKNOWN",
  "cluster_profile_bindings": [
    {
      "profile_id": "string",
      "resource_type": "BridgeHighAvailabilityClusterProfile"
    },
    {
      "profile_id": "string",
      "resource_type": "BridgeHighAvailabilityClusterProfile"
    },
    {
      "profile_id": "string",
      "resource_type": "BridgeHighAvailabilityClusterProfile"
    },
    {
      "profile_id": "string",
      "resource_type": "BridgeHighAvailabilityClusterProfile"
    }
  ],
  "members": [
    {
      "member_index": 7,
      "display_name": "string",
      "description": "string",
      "transport_node_id": "string"
    },
    {
      "member_index": 2,
      "display_name": "string",
      "description": "string",
      "transport_node_id": "string"
    },
    {
      "member_index": 6,
      "display_name": "string",
      "description": "string",
      "transport_node_id": "string"
    },
    {
      "member_index": 4,
      "display_name": "string",
      "description": "string",
      "transport_node_id": "string"
    },
    {
      "member_index": 3,
      "display_name": "string",
      "description": "string",
      "transport_node_id": "string"
    },
    {
      "member_index": 9,
      "display_name": "string",
      "description": "string",
      "transport_node_id": "string"
    },
    {
      "member_index": 7,
      "display_name": "string",
      "description": "string",
      "transport_node_id": "string"
    },
    {
      "member_index": 1,
      "display_name": "string",
      "description": "string",
      "transport_node_id": "string"
    }
  ],
  "deployment_type": "PHYSICAL_MACHINE"
}