{
  "_self": {
    "action": "string",
    "href": "string",
    "rel": "string"
  },
  "_links": [
    {
      "action": "string",
      "href": "string",
      "rel": "string"
    },
    {
      "action": "string",
      "href": "string",
      "rel": "string"
    }
  ],
  "_schema": "string",
  "_revision": 4,
  "_system_owned": false,
  "display_name": "string",
  "description": "string",
  "tags": [
    {
      "scope": "string",
      "tag": "string"
    },
    {
      "scope": "string",
      "tag": "string"
    },
    {
      "scope": "string",
      "tag": "string"
    },
    {
      "scope": "string",
      "tag": "string"
    }
  ],
  "_create_user": "string",
  "_protection": "string",
  "_create_time": 5,
  "_last_modified_time": 4,
  "_last_modified_user": "string",
  "id": "string",
  "resource_type": "string",
  "member_group": {
    "grouping_object": {
      "target_display_name": "string",
      "is_valid": false,
      "target_id": "string",
      "target_type": "string"
    },
    "ip_revision_filter": "IPV4",
    "max_ip_list_size": 5,
    "customized_members": [
      {
        "admin_state": "ENABLED",
        "ip_address": "string",
        "port": "string"
      },
      {
        "admin_state": "ENABLED",
        "ip_address": "string",
        "port": "string"
      },
      {
        "admin_state": "ENABLED",
        "ip_address": "string",
        "port": "string"
      },
      {
        "admin_state": "ENABLED",
        "ip_address": "string",
        "port": "string"
      },
      {
        "admin_state": "ENABLED",
        "ip_address": "string",
        "port": "string"
      },
      {
        "admin_state": "ENABLED",
        "ip_address": "string",
        "port": "string"
      },
      {
        "admin_state": "ENABLED",
        "ip_address": "string",
        "port": "string"
      }
    ]
  },
  "snat_translation": {
    "type": "LbSnatIpPool",
    "port_overload": 1
  },
  "algorithm": "ROUND_ROBIN",
  "members": [
    {
      "max_concurrent_connections": 2,
      "admin_state": "ENABLED",
      "backup_member": true,
      "weight": 1,
      "display_name": "string",
      "ip_address": "string",
      "port": "string"
    },
    {
      "max_concurrent_connections": 5,
      "admin_state": "ENABLED",
      "backup_member": true,
      "weight": 1,
      "display_name": "string",
      "ip_address": "string",
      "port": "string"
    },
    {
      "max_concurrent_connections": 3,
      "admin_state": "ENABLED",
      "backup_member": false,
      "weight": 1,
      "display_name": "string",
      "ip_address": "string",
      "port": "string"
    },
    {
      "max_concurrent_connections": 8,
      "admin_state": "ENABLED",
      "backup_member": true,
      "weight": 1,
      "display_name": "string",
      "ip_address": "string",
      "port": "string"
    },
    {
      "max_concurrent_connections": 9,
      "admin_state": "ENABLED",
      "backup_member": true,
      "weight": 1,
      "display_name": "string",
      "ip_address": "string",
      "port": "string"
    },
    {
      "max_concurrent_connections": 6,
      "admin_state": "ENABLED",
      "backup_member": false,
      "weight": 1,
      "display_name": "string",
      "ip_address": "string",
      "port": "string"
    },
    {
      "max_concurrent_connections": 4,
      "admin_state": "ENABLED",
      "backup_member": true,
      "weight": 1,
      "display_name": "string",
      "ip_address": "string",
      "port": "string"
    },
    {
      "max_concurrent_connections": 10,
      "admin_state": "ENABLED",
      "backup_member": false,
      "weight": 1,
      "display_name": "string",
      "ip_address": "string",
      "port": "string"
    },
    {
      "max_concurrent_connections": 6,
      "admin_state": "ENABLED",
      "backup_member": false,
      "weight": 1,
      "display_name": "string",
      "ip_address": "string",
      "port": "string"
    }
  ],
  "passive_monitor_id": "string",
  "tcp_multiplexing_number": 6,
  "active_monitor_ids": [
    "string",
    "string",
    "string",
    "string"
  ],
  "tcp_multiplexing_enabled": false,
  "min_active_members": 1
}