{
  "_self": {
    "action": "string",
    "href": "string",
    "rel": "string"
  },
  "_links": [
    {
      "action": "string",
      "href": "string",
      "rel": "string"
    },
    {
      "action": "string",
      "href": "string",
      "rel": "string"
    },
    {
      "action": "string",
      "href": "string",
      "rel": "string"
    },
    {
      "action": "string",
      "href": "string",
      "rel": "string"
    },
    {
      "action": "string",
      "href": "string",
      "rel": "string"
    },
    {
      "action": "string",
      "href": "string",
      "rel": "string"
    },
    {
      "action": "string",
      "href": "string",
      "rel": "string"
    },
    {
      "action": "string",
      "href": "string",
      "rel": "string"
    }
  ],
  "_schema": "string",
  "cursor": "string",
  "sort_ascending": false,
  "sort_by": "string",
  "result_count": 3,
  "results": [
    {
      "_self": {
        "action": "string",
        "href": "string",
        "rel": "string"
      },
      "_links": [
        {
          "action": "string",
          "href": "string",
          "rel": "string"
        },
        {
          "action": "string",
          "href": "string",
          "rel": "string"
        },
        {
          "action": "string",
          "href": "string",
          "rel": "string"
        },
        {
          "action": "string",
          "href": "string",
          "rel": "string"
        },
        {
          "action": "string",
          "href": "string",
          "rel": "string"
        },
        {
          "action": "string",
          "href": "string",
          "rel": "string"
        },
        {
          "action": "string",
          "href": "string",
          "rel": "string"
        },
        {
          "action": "string",
          "href": "string",
          "rel": "string"
        },
        {
          "action": "string",
          "href": "string",
          "rel": "string"
        },
        {
          "action": "string",
          "href": "string",
          "rel": "string"
        }
      ],
      "_schema": "string",
      "_revision": 4,
      "_system_owned": false,
      "display_name": "string",
      "description": "string",
      "tags": [
        {
          "scope": "string",
          "tag": "string"
        },
        {
          "scope": "string",
          "tag": "string"
        },
        {
          "scope": "string",
          "tag": "string"
        },
        {
          "scope": "string",
          "tag": "string"
        },
        {
          "scope": "string",
          "tag": "string"
        },
        {
          "scope": "string",
          "tag": "string"
        },
        {
          "scope": "string",
          "tag": "string"
        },
        {
          "scope": "string",
          "tag": "string"
        },
        {
          "scope": "string",
          "tag": "string"
        },
        {
          "scope": "string",
          "tag": "string"
        }
      ],
      "_create_user": "string",
      "_protection": "string",
      "_create_time": 7,
      "_last_modified_time": 4,
      "_last_modified_user": "string",
      "id": "string",
      "resource_type": "string",
      "logical_router_id": "string",
      "sequences": [
        {
          "set_criteria": {
            "as_path_prepend": "string",
            "community": "string",
            "weight": 3,
            "multi_exit_discriminator": 4
          },
          "action": "DENY",
          "match_criteria": {
            "ip_prefix_lists": [
              "string",
              "string",
              "string",
              "string"
            ]
          }
        },
        {
          "set_criteria": {
            "as_path_prepend": "string",
            "community": "string",
            "weight": 8,
            "multi_exit_discriminator": 2
          },
          "action": "PERMIT",
          "match_criteria": {
            "ip_prefix_lists": [
              "string",
              "string",
              "string",
              "string",
              "string"
            ]
          }
        }
      ]
    },
    {
      "_self": {
        "action": "string",
        "href": "string",
        "rel": "string"
      },
      "_links": [
        {
          "action": "string",
          "href": "string",
          "rel": "string"
        },
        {
          "action": "string",
          "href": "string",
          "rel": "string"
        },
        {
          "action": "string",
          "href": "string",
          "rel": "string"
        },
        {
          "action": "string",
          "href": "string",
          "rel": "string"
        },
        {
          "action": "string",
          "href": "string",
          "rel": "string"
        },
        {
          "action": "string",
          "href": "string",
          "rel": "string"
        },
        {
          "action": "string",
          "href": "string",
          "rel": "string"
        },
        {
          "action": "string",
          "href": "string",
          "rel": "string"
        },
        {
          "action": "string",
          "href": "string",
          "rel": "string"
        },
        {
          "action": "string",
          "href": "string",
          "rel": "string"
        }
      ],
      "_schema": "string",
      "_revision": 8,
      "_system_owned": false,
      "display_name": "string",
      "description": "string",
      "tags": [
        {
          "scope": "string",
          "tag": "string"
        },
        {
          "scope": "string",
          "tag": "string"
        },
        {
          "scope": "string",
          "tag": "string"
        },
        {
          "scope": "string",
          "tag": "string"
        },
        {
          "scope": "string",
          "tag": "string"
        },
        {
          "scope": "string",
          "tag": "string"
        },
        {
          "scope": "string",
          "tag": "string"
        }
      ],
      "_create_user": "string",
      "_protection": "string",
      "_create_time": 7,
      "_last_modified_time": 5,
      "_last_modified_user": "string",
      "id": "string",
      "resource_type": "string",
      "logical_router_id": "string",
      "sequences": [
        {
          "set_criteria": {
            "as_path_prepend": "string",
            "community": "string",
            "weight": 8,
            "multi_exit_discriminator": 8
          },
          "action": "DENY",
          "match_criteria": {
            "ip_prefix_lists": [
              "string",
              "string",
              "string",
              "string"
            ]
          }
        },
        {
          "set_criteria": {
            "as_path_prepend": "string",
            "community": "string",
            "weight": 3,
            "multi_exit_discriminator": 3
          },
          "action": "DENY",
          "match_criteria": {
            "ip_prefix_lists": [
              "string",
              "string",
              "string",
              "string",
              "string",
              "string",
              "string",
              "string",
              "string"
            ]
          }
        },
        {
          "set_criteria": {
            "as_path_prepend": "string",
            "community": "string",
            "weight": 7,
            "multi_exit_discriminator": 4
          },
          "action": "PERMIT",
          "match_criteria": {
            "ip_prefix_lists": [
              "string",
              "string",
              "string",
              "string",
              "string",
              "string",
              "string",
              "string"
            ]
          }
        },
        {
          "set_criteria": {
            "as_path_prepend": "string",
            "community": "string",
            "weight": 10,
            "multi_exit_discriminator": 3
          },
          "action": "DENY",
          "match_criteria": {
            "ip_prefix_lists": [
              "string",
              "string",
              "string",
              "string",
              "string",
              "string",
              "string"
            ]
          }
        }
      ]
    },
    {
      "_self": {
        "action": "string",
        "href": "string",
        "rel": "string"
      },
      "_links": [
        {
          "action": "string",
          "href": "string",
          "rel": "string"
        },
        {
          "action": "string",
          "href": "string",
          "rel": "string"
        },
        {
          "action": "string",
          "href": "string",
          "rel": "string"
        },
        {
          "action": "string",
          "href": "string",
          "rel": "string"
        },
        {
          "action": "string",
          "href": "string",
          "rel": "string"
        },
        {
          "action": "string",
          "href": "string",
          "rel": "string"
        },
        {
          "action": "string",
          "href": "string",
          "rel": "string"
        },
        {
          "action": "string",
          "href": "string",
          "rel": "string"
        },
        {
          "action": "string",
          "href": "string",
          "rel": "string"
        }
      ],
      "_schema": "string",
      "_revision": 1,
      "_system_owned": true,
      "display_name": "string",
      "description": "string",
      "tags": [
        {
          "scope": "string",
          "tag": "string"
        }
      ],
      "_create_user": "string",
      "_protection": "string",
      "_create_time": 6,
      "_last_modified_time": 7,
      "_last_modified_user": "string",
      "id": "string",
      "resource_type": "string",
      "logical_router_id": "string",
      "sequences": [
        {
          "set_criteria": {
            "as_path_prepend": "string",
            "community": "string",
            "weight": 4,
            "multi_exit_discriminator": 5
          },
          "action": "DENY",
          "match_criteria": {
            "ip_prefix_lists": [
              "string",
              "string",
              "string",
              "string",
              "string",
              "string",
              "string",
              "string",
              "string"
            ]
          }
        },
        {
          "set_criteria": {
            "as_path_prepend": "string",
            "community": "string",
            "weight": 9,
            "multi_exit_discriminator": 10
          },
          "action": "DENY",
          "match_criteria": {
            "ip_prefix_lists": [
              "string",
              "string",
              "string",
              "string",
              "string",
              "string",
              "string",
              "string",
              "string"
            ]
          }
        }
      ]
    }
  ]
}