{
  "actions": [
    {
      "name": "getFabricnodesnodeIdmodules",
      "protocol": "REST",
      "method": "GET",
      "entitypath": "{base_path}/{version}/fabric/nodes/{pathv1}/modules?{query}",
      "requestSchema": "schema.json",
      "responseSchema": "schema.json",
      "timeout": 0,
      "sendEmpty": false,
      "sendGetBody": false,
      "requestDatatype": "JSON",
      "responseDatatype": "JSON",
      "headers": {},
      "responseObjects": [
        {
          "type": "default",
          "key": "",
          "mockFile": "mockdatafiles/getFabricnodesnodeIdmodules-default.json"
        }
      ]
    },
    {
      "name": "postFabricvirtualMachinesactionupdateTags",
      "protocol": "REST",
      "method": "POST",
      "entitypath": "{base_path}/{version}/fabric/virtual-machines?{query}",
      "requestSchema": "schema.json",
      "responseSchema": "schema.json",
      "timeout": 0,
      "sendEmpty": false,
      "sendGetBody": false,
      "requestDatatype": "JSON",
      "responseDatatype": "JSON",
      "headers": {},
      "responseObjects": [
        {
          "type": "default",
          "key": "",
          "mockFile": ""
        }
      ]
    },
    {
      "name": "getFabriccomputeManagerscomputeManagerIdstatus",
      "protocol": "REST",
      "method": "GET",
      "entitypath": "{base_path}/{version}/fabric/compute-managers/{pathv1}/status?{query}",
      "requestSchema": "schema.json",
      "responseSchema": "schema.json",
      "timeout": 0,
      "sendEmpty": false,
      "sendGetBody": false,
      "requestDatatype": "JSON",
      "responseDatatype": "JSON",
      "headers": {},
      "responseObjects": [
        {
          "type": "default",
          "key": "",
          "mockFile": "mockdatafiles/getFabriccomputeManagerscomputeManagerIdstatus-default.json"
        }
      ]
    },
    {
      "name": "getFabricnodesstatus",
      "protocol": "REST",
      "method": "GET",
      "entitypath": "{base_path}/{version}/fabric/nodes/status?{query}",
      "requestSchema": "schema.json",
      "responseSchema": "schema.json",
      "timeout": 0,
      "sendEmpty": false,
      "sendGetBody": false,
      "requestDatatype": "JSON",
      "responseDatatype": "JSON",
      "headers": {},
      "responseObjects": [
        {
          "type": "default",
          "key": "",
          "mockFile": "mockdatafiles/getFabricnodesstatus-default.json"
        }
      ]
    },
    {
      "name": "getFabriccomputeCollections",
      "protocol": "REST",
      "method": "GET",
      "entitypath": "{base_path}/{version}/fabric/compute-collections?{query}",
      "requestSchema": "schema.json",
      "responseSchema": "schema.json",
      "timeout": 0,
      "sendEmpty": false,
      "sendGetBody": false,
      "requestDatatype": "JSON",
      "responseDatatype": "JSON",
      "headers": {},
      "responseObjects": [
        {
          "type": "default",
          "key": "",
          "mockFile": "mockdatafiles/getFabriccomputeCollections-default.json"
        }
      ]
    },
    {
      "name": "postFabricnodesnodeIdactionrestartInventorySync",
      "protocol": "REST",
      "method": "POST",
      "entitypath": "{base_path}/{version}/fabric/nodes/{pathv1}?{query}",
      "requestSchema": "schema.json",
      "responseSchema": "schema.json",
      "timeout": 0,
      "sendEmpty": false,
      "sendGetBody": false,
      "requestDatatype": "JSON",
      "responseDatatype": "JSON",
      "headers": {},
      "responseObjects": [
        {
          "type": "default",
          "key": "",
          "mockFile": ""
        }
      ]
    },
    {
      "name": "postFabriccomputeCollectionFabricTemplates",
      "protocol": "REST",
      "method": "POST",
      "entitypath": "{base_path}/{version}/fabric/compute-collection-fabric-templates?{query}",
      "requestSchema": "schema.json",
      "responseSchema": "schema.json",
      "timeout": 0,
      "sendEmpty": false,
      "sendGetBody": false,
      "requestDatatype": "JSON",
      "responseDatatype": "JSON",
      "headers": {},
      "responseObjects": [
        {
          "type": "default",
          "key": "",
          "mockFile": "mockdatafiles/postFabriccomputeCollectionFabricTemplates-default.json"
        }
      ]
    },
    {
      "name": "getFabriccomputeCollectionFabricTemplates",
      "protocol": "REST",
      "method": "GET",
      "entitypath": "{base_path}/{version}/fabric/compute-collection-fabric-templates?{query}",
      "requestSchema": "schema.json",
      "responseSchema": "schema.json",
      "timeout": 0,
      "sendEmpty": false,
      "sendGetBody": false,
      "requestDatatype": "JSON",
      "responseDatatype": "JSON",
      "headers": {},
      "responseObjects": [
        {
          "type": "default",
          "key": "",
          "mockFile": "mockdatafiles/getFabriccomputeCollectionFabricTemplates-default.json"
        }
      ]
    },
    {
      "name": "getFabricvifs",
      "protocol": "REST",
      "method": "GET",
      "entitypath": "{base_path}/{version}/fabric/vifs?{query}",
      "requestSchema": "schema.json",
      "responseSchema": "schema.json",
      "timeout": 0,
      "sendEmpty": false,
      "sendGetBody": false,
      "requestDatatype": "JSON",
      "responseDatatype": "JSON",
      "headers": {},
      "responseObjects": [
        {
          "type": "default",
          "key": "",
          "mockFile": "mockdatafiles/getFabricvifs-default.json"
        }
      ]
    },
    {
      "name": "getFabricnodesnodeIdnetworkinterfacesinterfaceId",
      "protocol": "REST",
      "method": "GET",
      "entitypath": "{base_path}/{version}/fabric/nodes/{pathv1}/network/interfaces/{pathv2}?{query}",
      "requestSchema": "schema.json",
      "responseSchema": "schema.json",
      "timeout": 0,
      "sendEmpty": false,
      "sendGetBody": false,
      "requestDatatype": "JSON",
      "responseDatatype": "JSON",
      "headers": {},
      "responseObjects": [
        {
          "type": "default",
          "key": "",
          "mockFile": "mockdatafiles/getFabricnodesnodeIdnetworkinterfacesinterfaceId-default.json"
        }
      ]
    },
    {
      "name": "getFabricdiscoveredNodesnodeExtId",
      "protocol": "REST",
      "method": "GET",
      "entitypath": "{base_path}/{version}/fabric/discovered-nodes/{pathv1}?{query}",
      "requestSchema": "schema.json",
      "responseSchema": "schema.json",
      "timeout": 0,
      "sendEmpty": false,
      "sendGetBody": false,
      "requestDatatype": "JSON",
      "responseDatatype": "JSON",
      "headers": {},
      "responseObjects": [
        {
          "type": "default",
          "key": "",
          "mockFile": "mockdatafiles/getFabricdiscoveredNodesnodeExtId-default.json"
        }
      ]
    },
    {
      "name": "getFabricdiscoveredNodes",
      "protocol": "REST",
      "method": "GET",
      "entitypath": "{base_path}/{version}/fabric/discovered-nodes?{query}",
      "requestSchema": "schema.json",
      "responseSchema": "schema.json",
      "timeout": 0,
      "sendEmpty": false,
      "sendGetBody": false,
      "requestDatatype": "JSON",
      "responseDatatype": "JSON",
      "headers": {},
      "responseObjects": [
        {
          "type": "default",
          "key": "",
          "mockFile": "mockdatafiles/getFabricdiscoveredNodes-default.json"
        }
      ]
    },
    {
      "name": "getFabriccomputeCollectionsccExtId",
      "protocol": "REST",
      "method": "GET",
      "entitypath": "{base_path}/{version}/fabric/compute-collections/{pathv1}?{query}",
      "requestSchema": "schema.json",
      "responseSchema": "schema.json",
      "timeout": 0,
      "sendEmpty": false,
      "sendGetBody": false,
      "requestDatatype": "JSON",
      "responseDatatype": "JSON",
      "headers": {},
      "responseObjects": [
        {
          "type": "default",
          "key": "",
          "mockFile": "mockdatafiles/getFabriccomputeCollectionsccExtId-default.json"
        }
      ]
    },
    {
      "name": "getFabricvirtualMachines",
      "protocol": "REST",
      "method": "GET",
      "entitypath": "{base_path}/{version}/fabric/virtual-machines?{query}",
      "requestSchema": "schema.json",
      "responseSchema": "schema.json",
      "timeout": 0,
      "sendEmpty": false,
      "sendGetBody": false,
      "requestDatatype": "JSON",
      "responseDatatype": "JSON",
      "headers": {},
      "responseObjects": [
        {
          "type": "default",
          "key": "",
          "mockFile": "mockdatafiles/getFabricvirtualMachines-default.json"
        }
      ]
    },
    {
      "name": "getFabricnodesnodeIdnetworkinterfaces",
      "protocol": "REST",
      "method": "GET",
      "entitypath": "{base_path}/{version}/fabric/nodes/{pathv1}/network/interfaces?{query}",
      "requestSchema": "schema.json",
      "responseSchema": "schema.json",
      "timeout": 0,
      "sendEmpty": false,
      "sendGetBody": false,
      "requestDatatype": "JSON",
      "responseDatatype": "JSON",
      "headers": {},
      "responseObjects": [
        {
          "type": "default",
          "key": "",
          "mockFile": "mockdatafiles/getFabricnodesnodeIdnetworkinterfaces-default.json"
        }
      ]
    },
    {
      "name": "postFabricnodesnodeIdactionupgradeInfra",
      "protocol": "REST",
      "method": "POST",
      "entitypath": "{base_path}/{version}/fabric/nodes/{pathv1}?{query}",
      "requestSchema": "schema.json",
      "responseSchema": "schema.json",
      "timeout": 0,
      "sendEmpty": false,
      "sendGetBody": false,
      "requestDatatype": "JSON",
      "responseDatatype": "JSON",
      "headers": {},
      "responseObjects": [
        {
          "type": "default",
          "key": "",
          "mockFile": "mockdatafiles/postFabricnodesnodeIdactionupgradeInfra-default.json"
        }
      ]
    },
    {
      "name": "postFabriccomputeManagers",
      "protocol": "REST",
      "method": "POST",
      "entitypath": "{base_path}/{version}/fabric/compute-managers?{query}",
      "requestSchema": "schema.json",
      "responseSchema": "schema.json",
      "timeout": 0,
      "sendEmpty": false,
      "sendGetBody": false,
      "requestDatatype": "JSON",
      "responseDatatype": "JSON",
      "headers": {},
      "responseObjects": [
        {
          "type": "default",
          "key": "",
          "mockFile": "mockdatafiles/postFabriccomputeManagers-default.json"
        }
      ]
    },
    {
      "name": "getFabriccomputeManagers",
      "protocol": "REST",
      "method": "GET",
      "entitypath": "{base_path}/{version}/fabric/compute-managers?{query}",
      "requestSchema": "schema.json",
      "responseSchema": "schema.json",
      "timeout": 0,
      "sendEmpty": false,
      "sendGetBody": false,
      "requestDatatype": "JSON",
      "responseDatatype": "JSON",
      "headers": {},
      "responseObjects": [
        {
          "type": "default",
          "key": "",
          "mockFile": "mockdatafiles/getFabriccomputeManagers-default.json"
        }
      ]
    },
    {
      "name": "getFabricnodesnodeIdstate",
      "protocol": "REST",
      "method": "GET",
      "entitypath": "{base_path}/{version}/fabric/nodes/{pathv1}/state?{query}",
      "requestSchema": "schema.json",
      "responseSchema": "schema.json",
      "timeout": 0,
      "sendEmpty": false,
      "sendGetBody": false,
      "requestDatatype": "JSON",
      "responseDatatype": "JSON",
      "headers": {},
      "responseObjects": [
        {
          "type": "default",
          "key": "",
          "mockFile": "mockdatafiles/getFabricnodesnodeIdstate-default.json"
        }
      ]
    },
    {
      "name": "postFabricdiscoveredNodesnodeExtIdactionhostprep",
      "protocol": "REST",
      "method": "POST",
      "entitypath": "{base_path}/{version}/fabric/discovered-nodes/{pathv1}?{query}",
      "requestSchema": "schema.json",
      "responseSchema": "schema.json",
      "timeout": 0,
      "sendEmpty": false,
      "sendGetBody": false,
      "requestDatatype": "JSON",
      "responseDatatype": "JSON",
      "headers": {},
      "responseObjects": [
        {
          "type": "default",
          "key": "",
          "mockFile": "mockdatafiles/postFabricdiscoveredNodesnodeExtIdactionhostprep-default.json"
        }
      ]
    },
    {
      "name": "getFabriccomputeManagerscomputeManagerIdstate",
      "protocol": "REST",
      "method": "GET",
      "entitypath": "{base_path}/{version}/fabric/compute-managers/{pathv1}/state?{query}",
      "requestSchema": "schema.json",
      "responseSchema": "schema.json",
      "timeout": 0,
      "sendEmpty": false,
      "sendGetBody": false,
      "requestDatatype": "JSON",
      "responseDatatype": "JSON",
      "headers": {},
      "responseObjects": [
        {
          "type": "default",
          "key": "",
          "mockFile": "mockdatafiles/getFabriccomputeManagerscomputeManagerIdstate-default.json"
        }
      ]
    },
    {
      "name": "getFabricnodesnodeIdcapabilities",
      "protocol": "REST",
      "method": "GET",
      "entitypath": "{base_path}/{version}/fabric/nodes/{pathv1}/capabilities?{query}",
      "requestSchema": "schema.json",
      "responseSchema": "schema.json",
      "timeout": 0,
      "sendEmpty": false,
      "sendGetBody": false,
      "requestDatatype": "JSON",
      "responseDatatype": "JSON",
      "headers": {},
      "responseObjects": [
        {
          "type": "default",
          "key": "",
          "mockFile": "mockdatafiles/getFabricnodesnodeIdcapabilities-default.json"
        }
      ]
    },
    {
      "name": "postFabricnodes",
      "protocol": "REST",
      "method": "POST",
      "entitypath": "{base_path}/{version}/fabric/nodes?{query}",
      "requestSchema": "schema.json",
      "responseSchema": "schema.json",
      "timeout": 0,
      "sendEmpty": false,
      "sendGetBody": false,
      "requestDatatype": "JSON",
      "responseDatatype": "JSON",
      "headers": {},
      "responseObjects": [
        {
          "type": "default",
          "key": "",
          "mockFile": "mockdatafiles/postFabricnodes-default.json"
        }
      ]
    },
    {
      "name": "getFabricnodes",
      "protocol": "REST",
      "method": "GET",
      "entitypath": "{base_path}/{version}/fabric/nodes?{query}",
      "requestSchema": "schema.json",
      "responseSchema": "schema.json",
      "timeout": 0,
      "sendEmpty": false,
      "sendGetBody": false,
      "requestDatatype": "JSON",
      "responseDatatype": "JSON",
      "headers": {},
      "responseObjects": [
        {
          "type": "default",
          "key": "",
          "mockFile": "mockdatafiles/getFabricnodes-default.json"
        }
      ]
    },
    {
      "name": "getFabricnodesnodeIdstatus",
      "protocol": "REST",
      "method": "GET",
      "entitypath": "{base_path}/{version}/fabric/nodes/{pathv1}/status?{query}",
      "requestSchema": "schema.json",
      "responseSchema": "schema.json",
      "timeout": 0,
      "sendEmpty": false,
      "sendGetBody": false,
      "requestDatatype": "JSON",
      "responseDatatype": "JSON",
      "headers": {},
      "responseObjects": [
        {
          "type": "default",
          "key": "",
          "mockFile": "mockdatafiles/getFabricnodesnodeIdstatus-default.json"
        }
      ]
    },
    {
      "name": "putFabriccomputeCollectionFabricTemplatesfabricTemplateId",
      "protocol": "REST",
      "method": "PUT",
      "entitypath": "{base_path}/{version}/fabric/compute-collection-fabric-templates/{pathv1}?{query}",
      "requestSchema": "schema.json",
      "responseSchema": "schema.json",
      "timeout": 0,
      "sendEmpty": false,
      "sendGetBody": false,
      "requestDatatype": "JSON",
      "responseDatatype": "JSON",
      "headers": {},
      "responseObjects": [
        {
          "type": "default",
          "key": "",
          "mockFile": "mockdatafiles/putFabriccomputeCollectionFabricTemplatesfabricTemplateId-default.json"
        }
      ]
    },
    {
      "name": "getFabriccomputeCollectionFabricTemplatesfabricTemplateId",
      "protocol": "REST",
      "method": "GET",
      "entitypath": "{base_path}/{version}/fabric/compute-collection-fabric-templates/{pathv1}?{query}",
      "requestSchema": "schema.json",
      "responseSchema": "schema.json",
      "timeout": 0,
      "sendEmpty": false,
      "sendGetBody": false,
      "requestDatatype": "JSON",
      "responseDatatype": "JSON",
      "headers": {},
      "responseObjects": [
        {
          "type": "default",
          "key": "",
          "mockFile": "mockdatafiles/getFabriccomputeCollectionFabricTemplatesfabricTemplateId-default.json"
        }
      ]
    },
    {
      "name": "deleteFabriccomputeCollectionFabricTemplatesfabricTemplateId",
      "protocol": "REST",
      "method": "DELETE",
      "entitypath": "{base_path}/{version}/fabric/compute-collection-fabric-templates/{pathv1}?{query}",
      "requestSchema": "schema.json",
      "responseSchema": "schema.json",
      "timeout": 0,
      "sendEmpty": false,
      "sendGetBody": false,
      "requestDatatype": "JSON",
      "responseDatatype": "JSON",
      "headers": {},
      "responseObjects": [
        {
          "type": "default",
          "key": "",
          "mockFile": ""
        }
      ]
    },
    {
      "name": "putFabriccomputeManagerscomputeManagerId",
      "protocol": "REST",
      "method": "PUT",
      "entitypath": "{base_path}/{version}/fabric/compute-managers/{pathv1}?{query}",
      "requestSchema": "schema.json",
      "responseSchema": "schema.json",
      "timeout": 0,
      "sendEmpty": false,
      "sendGetBody": false,
      "requestDatatype": "JSON",
      "responseDatatype": "JSON",
      "headers": {},
      "responseObjects": [
        {
          "type": "default",
          "key": "",
          "mockFile": "mockdatafiles/putFabriccomputeManagerscomputeManagerId-default.json"
        }
      ]
    },
    {
      "name": "deleteFabriccomputeManagerscomputeManagerId",
      "protocol": "REST",
      "method": "DELETE",
      "entitypath": "{base_path}/{version}/fabric/compute-managers/{pathv1}?{query}",
      "requestSchema": "schema.json",
      "responseSchema": "schema.json",
      "timeout": 0,
      "sendEmpty": false,
      "sendGetBody": false,
      "requestDatatype": "JSON",
      "responseDatatype": "JSON",
      "headers": {},
      "responseObjects": [
        {
          "type": "default",
          "key": "",
          "mockFile": ""
        }
      ]
    },
    {
      "name": "getFabriccomputeManagerscomputeManagerId",
      "protocol": "REST",
      "method": "GET",
      "entitypath": "{base_path}/{version}/fabric/compute-managers/{pathv1}?{query}",
      "requestSchema": "schema.json",
      "responseSchema": "schema.json",
      "timeout": 0,
      "sendEmpty": false,
      "sendGetBody": false,
      "requestDatatype": "JSON",
      "responseDatatype": "JSON",
      "headers": {},
      "responseObjects": [
        {
          "type": "default",
          "key": "",
          "mockFile": "mockdatafiles/getFabriccomputeManagerscomputeManagerId-default.json"
        }
      ]
    },
    {
      "name": "putFabricnodesnodeId",
      "protocol": "REST",
      "method": "PUT",
      "entitypath": "{base_path}/{version}/fabric/nodes/{pathv1}?{query}",
      "requestSchema": "schema.json",
      "responseSchema": "schema.json",
      "timeout": 0,
      "sendEmpty": false,
      "sendGetBody": false,
      "requestDatatype": "JSON",
      "responseDatatype": "JSON",
      "headers": {},
      "responseObjects": [
        {
          "type": "default",
          "key": "",
          "mockFile": "mockdatafiles/putFabricnodesnodeId-default.json"
        }
      ]
    },
    {
      "name": "postFabricnodesnodeId",
      "protocol": "REST",
      "method": "POST",
      "entitypath": "{base_path}/{version}/fabric/nodes/{pathv1}?{query}",
      "requestSchema": "schema.json",
      "responseSchema": "schema.json",
      "timeout": 0,
      "sendEmpty": false,
      "sendGetBody": false,
      "requestDatatype": "JSON",
      "responseDatatype": "JSON",
      "headers": {},
      "responseObjects": [
        {
          "type": "default",
          "key": "",
          "mockFile": "mockdatafiles/postFabricnodesnodeId-default.json"
        }
      ]
    },
    {
      "name": "getFabricnodesnodeId",
      "protocol": "REST",
      "method": "GET",
      "entitypath": "{base_path}/{version}/fabric/nodes/{pathv1}?{query}",
      "requestSchema": "schema.json",
      "responseSchema": "schema.json",
      "timeout": 0,
      "sendEmpty": false,
      "sendGetBody": false,
      "requestDatatype": "JSON",
      "responseDatatype": "JSON",
      "headers": {},
      "responseObjects": [
        {
          "type": "default",
          "key": "",
          "mockFile": "mockdatafiles/getFabricnodesnodeId-default.json"
        }
      ]
    },
    {
      "name": "deleteFabricnodesnodeId",
      "protocol": "REST",
      "method": "DELETE",
      "entitypath": "{base_path}/{version}/fabric/nodes/{pathv1}?{query}",
      "requestSchema": "schema.json",
      "responseSchema": "schema.json",
      "timeout": 0,
      "sendEmpty": false,
      "sendGetBody": false,
      "requestDatatype": "JSON",
      "responseDatatype": "JSON",
      "headers": {},
      "responseObjects": [
        {
          "type": "default",
          "key": "",
          "mockFile": ""
        }
      ]
    },
    {
      "name": "getFabricnodesnodeIdnetworkinterfacesinterfaceIdstats",
      "protocol": "REST",
      "method": "GET",
      "entitypath": "{base_path}/{version}/fabric/nodes/{pathv1}/network/interfaces/{pathv2}/stats?{query}",
      "requestSchema": "schema.json",
      "responseSchema": "schema.json",
      "timeout": 0,
      "sendEmpty": false,
      "sendGetBody": false,
      "requestDatatype": "JSON",
      "responseDatatype": "JSON",
      "headers": {},
      "responseObjects": [
        {
          "type": "default",
          "key": "",
          "mockFile": "mockdatafiles/getFabricnodesnodeIdnetworkinterfacesinterfaceIdstats-default.json"
        }
      ]
    }
  ]
}