{
  "_self": {
    "action": "string",
    "href": "string",
    "rel": "string"
  },
  "_links": [
    {
      "action": "string",
      "href": "string",
      "rel": "string"
    },
    {
      "action": "string",
      "href": "string",
      "rel": "string"
    },
    {
      "action": "string",
      "href": "string",
      "rel": "string"
    },
    {
      "action": "string",
      "href": "string",
      "rel": "string"
    },
    {
      "action": "string",
      "href": "string",
      "rel": "string"
    },
    {
      "action": "string",
      "href": "string",
      "rel": "string"
    }
  ],
  "_schema": "string",
  "cursor": "string",
  "sort_ascending": true,
  "sort_by": "string",
  "result_count": 2,
  "logical_router_name": "string",
  "last_update_timestamp": 4,
  "logical_router_id": "string",
  "results": [
    {
      "transport_node": {
        "target_display_name": "string",
        "is_valid": true,
        "target_id": "string",
        "target_type": "string"
      },
      "connection_state": "INVALID",
      "neighbor_address": "string",
      "messages_sent": 4,
      "connection_drop_count": 6,
      "remote_port": 7,
      "source_address": "string",
      "total_in_prefix_count": 1,
      "messages_received": 7,
      "neighbor_router_id": "string",
      "total_out_prefix_count": 5,
      "lr_component_id": "string",
      "graceful_restart": true,
      "remote_as_number": "string",
      "announced_capabilities": [
        "string",
        "string"
      ],
      "local_port": 5,
      "keep_alive_interval": 8,
      "time_since_established": 9,
      "hold_time": 3,
      "negotiated_capability": [
        "string"
      ],
      "established_connection_count": 2
    },
    {
      "transport_node": {
        "target_display_name": "string",
        "is_valid": false,
        "target_id": "string",
        "target_type": "string"
      },
      "connection_state": "INVALID",
      "neighbor_address": "string",
      "messages_sent": 2,
      "connection_drop_count": 2,
      "remote_port": 7,
      "source_address": "string",
      "total_in_prefix_count": 10,
      "messages_received": 10,
      "neighbor_router_id": "string",
      "total_out_prefix_count": 1,
      "lr_component_id": "string",
      "graceful_restart": true,
      "remote_as_number": "string",
      "announced_capabilities": [
        "string",
        "string",
        "string",
        "string",
        "string",
        "string",
        "string",
        "string",
        "string",
        "string"
      ],
      "local_port": 3,
      "keep_alive_interval": 6,
      "time_since_established": 2,
      "hold_time": 4,
      "negotiated_capability": [
        "string",
        "string",
        "string",
        "string",
        "string",
        "string",
        "string"
      ],
      "established_connection_count": 4
    },
    {
      "transport_node": {
        "target_display_name": "string",
        "is_valid": false,
        "target_id": "string",
        "target_type": "string"
      },
      "connection_state": "OPEN_SENT",
      "neighbor_address": "string",
      "messages_sent": 7,
      "connection_drop_count": 3,
      "remote_port": 3,
      "source_address": "string",
      "total_in_prefix_count": 7,
      "messages_received": 7,
      "neighbor_router_id": "string",
      "total_out_prefix_count": 6,
      "lr_component_id": "string",
      "graceful_restart": true,
      "remote_as_number": "string",
      "announced_capabilities": [
        "string",
        "string",
        "string"
      ],
      "local_port": 3,
      "keep_alive_interval": 6,
      "time_since_established": 3,
      "hold_time": 1,
      "negotiated_capability": [
        "string",
        "string",
        "string",
        "string",
        "string",
        "string",
        "string",
        "string",
        "string",
        "string"
      ],
      "established_connection_count": 9
    },
    {
      "transport_node": {
        "target_display_name": "string",
        "is_valid": true,
        "target_id": "string",
        "target_type": "string"
      },
      "connection_state": "IDLE",
      "neighbor_address": "string",
      "messages_sent": 4,
      "connection_drop_count": 5,
      "remote_port": 10,
      "source_address": "string",
      "total_in_prefix_count": 9,
      "messages_received": 7,
      "neighbor_router_id": "string",
      "total_out_prefix_count": 10,
      "lr_component_id": "string",
      "graceful_restart": false,
      "remote_as_number": "string",
      "announced_capabilities": [
        "string",
        "string",
        "string",
        "string",
        "string",
        "string",
        "string",
        "string",
        "string"
      ],
      "local_port": 4,
      "keep_alive_interval": 8,
      "time_since_established": 6,
      "hold_time": 10,
      "negotiated_capability": [
        "string",
        "string",
        "string",
        "string",
        "string"
      ],
      "established_connection_count": 9
    },
    {
      "transport_node": {
        "target_display_name": "string",
        "is_valid": false,
        "target_id": "string",
        "target_type": "string"
      },
      "connection_state": "ACTIVE",
      "neighbor_address": "string",
      "messages_sent": 3,
      "connection_drop_count": 1,
      "remote_port": 8,
      "source_address": "string",
      "total_in_prefix_count": 4,
      "messages_received": 10,
      "neighbor_router_id": "string",
      "total_out_prefix_count": 9,
      "lr_component_id": "string",
      "graceful_restart": true,
      "remote_as_number": "string",
      "announced_capabilities": [
        "string",
        "string",
        "string",
        "string",
        "string",
        "string",
        "string",
        "string",
        "string"
      ],
      "local_port": 1,
      "keep_alive_interval": 5,
      "time_since_established": 4,
      "hold_time": 10,
      "negotiated_capability": [
        "string",
        "string",
        "string",
        "string",
        "string",
        "string",
        "string",
        "string"
      ],
      "established_connection_count": 7
    },
    {
      "transport_node": {
        "target_display_name": "string",
        "is_valid": false,
        "target_id": "string",
        "target_type": "string"
      },
      "connection_state": "ACTIVE",
      "neighbor_address": "string",
      "messages_sent": 6,
      "connection_drop_count": 10,
      "remote_port": 7,
      "source_address": "string",
      "total_in_prefix_count": 8,
      "messages_received": 3,
      "neighbor_router_id": "string",
      "total_out_prefix_count": 5,
      "lr_component_id": "string",
      "graceful_restart": false,
      "remote_as_number": "string",
      "announced_capabilities": [
        "string",
        "string",
        "string"
      ],
      "local_port": 8,
      "keep_alive_interval": 8,
      "time_since_established": 9,
      "hold_time": 8,
      "negotiated_capability": [
        "string",
        "string",
        "string",
        "string",
        "string",
        "string",
        "string"
      ],
      "established_connection_count": 3
    },
    {
      "transport_node": {
        "target_display_name": "string",
        "is_valid": true,
        "target_id": "string",
        "target_type": "string"
      },
      "connection_state": "OPEN_CONFIRM",
      "neighbor_address": "string",
      "messages_sent": 10,
      "connection_drop_count": 7,
      "remote_port": 7,
      "source_address": "string",
      "total_in_prefix_count": 7,
      "messages_received": 1,
      "neighbor_router_id": "string",
      "total_out_prefix_count": 9,
      "lr_component_id": "string",
      "graceful_restart": false,
      "remote_as_number": "string",
      "announced_capabilities": [
        "string",
        "string",
        "string",
        "string",
        "string",
        "string",
        "string",
        "string",
        "string"
      ],
      "local_port": 1,
      "keep_alive_interval": 3,
      "time_since_established": 6,
      "hold_time": 5,
      "negotiated_capability": [
        "string",
        "string",
        "string",
        "string",
        "string",
        "string",
        "string",
        "string"
      ],
      "established_connection_count": 6
    },
    {
      "transport_node": {
        "target_display_name": "string",
        "is_valid": false,
        "target_id": "string",
        "target_type": "string"
      },
      "connection_state": "OPEN_CONFIRM",
      "neighbor_address": "string",
      "messages_sent": 4,
      "connection_drop_count": 9,
      "remote_port": 3,
      "source_address": "string",
      "total_in_prefix_count": 4,
      "messages_received": 6,
      "neighbor_router_id": "string",
      "total_out_prefix_count": 1,
      "lr_component_id": "string",
      "graceful_restart": false,
      "remote_as_number": "string",
      "announced_capabilities": [
        "string",
        "string",
        "string",
        "string"
      ],
      "local_port": 6,
      "keep_alive_interval": 4,
      "time_since_established": 7,
      "hold_time": 8,
      "negotiated_capability": [
        "string",
        "string",
        "string",
        "string",
        "string",
        "string",
        "string",
        "string"
      ],
      "established_connection_count": 4
    },
    {
      "transport_node": {
        "target_display_name": "string",
        "is_valid": true,
        "target_id": "string",
        "target_type": "string"
      },
      "connection_state": "ESTABLISHED",
      "neighbor_address": "string",
      "messages_sent": 3,
      "connection_drop_count": 7,
      "remote_port": 1,
      "source_address": "string",
      "total_in_prefix_count": 3,
      "messages_received": 10,
      "neighbor_router_id": "string",
      "total_out_prefix_count": 3,
      "lr_component_id": "string",
      "graceful_restart": true,
      "remote_as_number": "string",
      "announced_capabilities": [
        "string"
      ],
      "local_port": 8,
      "keep_alive_interval": 3,
      "time_since_established": 9,
      "hold_time": 9,
      "negotiated_capability": [
        "string",
        "string",
        "string",
        "string",
        "string",
        "string",
        "string"
      ],
      "established_connection_count": 3
    },
    {
      "transport_node": {
        "target_display_name": "string",
        "is_valid": false,
        "target_id": "string",
        "target_type": "string"
      },
      "connection_state": "INVALID",
      "neighbor_address": "string",
      "messages_sent": 6,
      "connection_drop_count": 3,
      "remote_port": 4,
      "source_address": "string",
      "total_in_prefix_count": 5,
      "messages_received": 9,
      "neighbor_router_id": "string",
      "total_out_prefix_count": 8,
      "lr_component_id": "string",
      "graceful_restart": true,
      "remote_as_number": "string",
      "announced_capabilities": [
        "string",
        "string",
        "string",
        "string",
        "string",
        "string",
        "string",
        "string"
      ],
      "local_port": 8,
      "keep_alive_interval": 4,
      "time_since_established": 1,
      "hold_time": 8,
      "negotiated_capability": [
        "string",
        "string",
        "string",
        "string",
        "string",
        "string",
        "string",
        "string",
        "string",
        "string"
      ],
      "established_connection_count": 1
    }
  ]
}