{
  "_self": {
    "action": "string",
    "href": "string",
    "rel": "string"
  },
  "_links": [
    {
      "action": "string",
      "href": "string",
      "rel": "string"
    },
    {
      "action": "string",
      "href": "string",
      "rel": "string"
    },
    {
      "action": "string",
      "href": "string",
      "rel": "string"
    },
    {
      "action": "string",
      "href": "string",
      "rel": "string"
    }
  ],
  "_schema": "string",
  "cursor": "string",
  "sort_ascending": true,
  "sort_by": "string",
  "result_count": 5,
  "results": [
    {
      "_self": {
        "action": "string",
        "href": "string",
        "rel": "string"
      },
      "_links": [
        {
          "action": "string",
          "href": "string",
          "rel": "string"
        },
        {
          "action": "string",
          "href": "string",
          "rel": "string"
        },
        {
          "action": "string",
          "href": "string",
          "rel": "string"
        },
        {
          "action": "string",
          "href": "string",
          "rel": "string"
        }
      ],
      "_schema": "string",
      "_revision": 1,
      "_system_owned": true,
      "display_name": "string",
      "description": "string",
      "tags": [
        {
          "scope": "string",
          "tag": "string"
        },
        {
          "scope": "string",
          "tag": "string"
        },
        {
          "scope": "string",
          "tag": "string"
        },
        {
          "scope": "string",
          "tag": "string"
        },
        {
          "scope": "string",
          "tag": "string"
        },
        {
          "scope": "string",
          "tag": "string"
        },
        {
          "scope": "string",
          "tag": "string"
        },
        {
          "scope": "string",
          "tag": "string"
        },
        {
          "scope": "string",
          "tag": "string"
        },
        {
          "scope": "string",
          "tag": "string"
        }
      ],
      "_create_user": "string",
      "_protection": "string",
      "_create_time": 5,
      "_last_modified_time": 9,
      "_last_modified_user": "string",
      "id": "string",
      "resource_type": "string",
      "lease_time": 86400,
      "gateway_ip": "string",
      "options": {
        "option121": {
          "static_routes": [
            {
              "next_hop": "string",
              "network": "string"
            },
            {
              "next_hop": "string",
              "network": "string"
            },
            {
              "next_hop": "string",
              "network": "string"
            },
            {
              "next_hop": "string",
              "network": "string"
            },
            {
              "next_hop": "string",
              "network": "string"
            },
            {
              "next_hop": "string",
              "network": "string"
            }
          ]
        },
        "others": [
          {
            "code": 4,
            "values": [
              "string"
            ]
          },
          {
            "code": 4,
            "values": [
              "string",
              "string",
              "string",
              "string",
              "string",
              "string",
              "string",
              "string",
              "string",
              "string"
            ]
          },
          {
            "code": 6,
            "values": [
              "string",
              "string"
            ]
          },
          {
            "code": 3,
            "values": [
              "string",
              "string"
            ]
          }
        ]
      },
      "ip_address": "string",
      "host_name": "string",
      "mac_address": "string"
    },
    {
      "_self": {
        "action": "string",
        "href": "string",
        "rel": "string"
      },
      "_links": [
        {
          "action": "string",
          "href": "string",
          "rel": "string"
        },
        {
          "action": "string",
          "href": "string",
          "rel": "string"
        },
        {
          "action": "string",
          "href": "string",
          "rel": "string"
        },
        {
          "action": "string",
          "href": "string",
          "rel": "string"
        },
        {
          "action": "string",
          "href": "string",
          "rel": "string"
        },
        {
          "action": "string",
          "href": "string",
          "rel": "string"
        }
      ],
      "_schema": "string",
      "_revision": 3,
      "_system_owned": false,
      "display_name": "string",
      "description": "string",
      "tags": [
        {
          "scope": "string",
          "tag": "string"
        },
        {
          "scope": "string",
          "tag": "string"
        },
        {
          "scope": "string",
          "tag": "string"
        }
      ],
      "_create_user": "string",
      "_protection": "string",
      "_create_time": 3,
      "_last_modified_time": 9,
      "_last_modified_user": "string",
      "id": "string",
      "resource_type": "string",
      "lease_time": 86400,
      "gateway_ip": "string",
      "options": {
        "option121": {
          "static_routes": [
            {
              "next_hop": "string",
              "network": "string"
            },
            {
              "next_hop": "string",
              "network": "string"
            },
            {
              "next_hop": "string",
              "network": "string"
            },
            {
              "next_hop": "string",
              "network": "string"
            },
            {
              "next_hop": "string",
              "network": "string"
            },
            {
              "next_hop": "string",
              "network": "string"
            },
            {
              "next_hop": "string",
              "network": "string"
            },
            {
              "next_hop": "string",
              "network": "string"
            }
          ]
        },
        "others": [
          {
            "code": 2,
            "values": [
              "string",
              "string",
              "string",
              "string",
              "string",
              "string",
              "string",
              "string",
              "string",
              "string"
            ]
          },
          {
            "code": 6,
            "values": [
              "string",
              "string",
              "string",
              "string",
              "string",
              "string",
              "string",
              "string"
            ]
          },
          {
            "code": 10,
            "values": [
              "string",
              "string"
            ]
          },
          {
            "code": 7,
            "values": [
              "string",
              "string",
              "string",
              "string",
              "string",
              "string",
              "string",
              "string"
            ]
          },
          {
            "code": 1,
            "values": [
              "string",
              "string"
            ]
          },
          {
            "code": 5,
            "values": [
              "string",
              "string",
              "string",
              "string"
            ]
          },
          {
            "code": 7,
            "values": [
              "string"
            ]
          },
          {
            "code": 9,
            "values": [
              "string",
              "string",
              "string"
            ]
          },
          {
            "code": 1,
            "values": [
              "string",
              "string",
              "string",
              "string"
            ]
          },
          {
            "code": 8,
            "values": [
              "string",
              "string",
              "string"
            ]
          }
        ]
      },
      "ip_address": "string",
      "host_name": "string",
      "mac_address": "string"
    },
    {
      "_self": {
        "action": "string",
        "href": "string",
        "rel": "string"
      },
      "_links": [
        {
          "action": "string",
          "href": "string",
          "rel": "string"
        },
        {
          "action": "string",
          "href": "string",
          "rel": "string"
        },
        {
          "action": "string",
          "href": "string",
          "rel": "string"
        },
        {
          "action": "string",
          "href": "string",
          "rel": "string"
        }
      ],
      "_schema": "string",
      "_revision": 10,
      "_system_owned": false,
      "display_name": "string",
      "description": "string",
      "tags": [
        {
          "scope": "string",
          "tag": "string"
        },
        {
          "scope": "string",
          "tag": "string"
        },
        {
          "scope": "string",
          "tag": "string"
        },
        {
          "scope": "string",
          "tag": "string"
        },
        {
          "scope": "string",
          "tag": "string"
        }
      ],
      "_create_user": "string",
      "_protection": "string",
      "_create_time": 9,
      "_last_modified_time": 9,
      "_last_modified_user": "string",
      "id": "string",
      "resource_type": "string",
      "lease_time": 86400,
      "gateway_ip": "string",
      "options": {
        "option121": {
          "static_routes": [
            {
              "next_hop": "string",
              "network": "string"
            }
          ]
        },
        "others": [
          {
            "code": 1,
            "values": [
              "string",
              "string",
              "string",
              "string",
              "string",
              "string",
              "string",
              "string",
              "string"
            ]
          },
          {
            "code": 1,
            "values": [
              "string",
              "string",
              "string",
              "string"
            ]
          }
        ]
      },
      "ip_address": "string",
      "host_name": "string",
      "mac_address": "string"
    },
    {
      "_self": {
        "action": "string",
        "href": "string",
        "rel": "string"
      },
      "_links": [
        {
          "action": "string",
          "href": "string",
          "rel": "string"
        },
        {
          "action": "string",
          "href": "string",
          "rel": "string"
        }
      ],
      "_schema": "string",
      "_revision": 5,
      "_system_owned": false,
      "display_name": "string",
      "description": "string",
      "tags": [
        {
          "scope": "string",
          "tag": "string"
        },
        {
          "scope": "string",
          "tag": "string"
        },
        {
          "scope": "string",
          "tag": "string"
        },
        {
          "scope": "string",
          "tag": "string"
        },
        {
          "scope": "string",
          "tag": "string"
        },
        {
          "scope": "string",
          "tag": "string"
        },
        {
          "scope": "string",
          "tag": "string"
        },
        {
          "scope": "string",
          "tag": "string"
        }
      ],
      "_create_user": "string",
      "_protection": "string",
      "_create_time": 6,
      "_last_modified_time": 4,
      "_last_modified_user": "string",
      "id": "string",
      "resource_type": "string",
      "lease_time": 86400,
      "gateway_ip": "string",
      "options": {
        "option121": {
          "static_routes": [
            {
              "next_hop": "string",
              "network": "string"
            },
            {
              "next_hop": "string",
              "network": "string"
            },
            {
              "next_hop": "string",
              "network": "string"
            },
            {
              "next_hop": "string",
              "network": "string"
            },
            {
              "next_hop": "string",
              "network": "string"
            },
            {
              "next_hop": "string",
              "network": "string"
            },
            {
              "next_hop": "string",
              "network": "string"
            },
            {
              "next_hop": "string",
              "network": "string"
            },
            {
              "next_hop": "string",
              "network": "string"
            }
          ]
        },
        "others": [
          {
            "code": 7,
            "values": [
              "string",
              "string",
              "string",
              "string",
              "string",
              "string"
            ]
          },
          {
            "code": 4,
            "values": [
              "string",
              "string"
            ]
          },
          {
            "code": 9,
            "values": [
              "string"
            ]
          },
          {
            "code": 10,
            "values": [
              "string",
              "string"
            ]
          },
          {
            "code": 8,
            "values": [
              "string",
              "string",
              "string",
              "string",
              "string",
              "string",
              "string",
              "string",
              "string"
            ]
          },
          {
            "code": 10,
            "values": [
              "string",
              "string",
              "string",
              "string",
              "string",
              "string",
              "string",
              "string"
            ]
          },
          {
            "code": 3,
            "values": [
              "string",
              "string",
              "string",
              "string",
              "string",
              "string",
              "string",
              "string",
              "string"
            ]
          },
          {
            "code": 10,
            "values": [
              "string",
              "string",
              "string",
              "string",
              "string",
              "string",
              "string",
              "string",
              "string",
              "string"
            ]
          },
          {
            "code": 7,
            "values": [
              "string",
              "string",
              "string"
            ]
          }
        ]
      },
      "ip_address": "string",
      "host_name": "string",
      "mac_address": "string"
    }
  ]
}