{
  "_self": {
    "action": "string",
    "href": "string",
    "rel": "string"
  },
  "_links": [
    {
      "action": "string",
      "href": "string",
      "rel": "string"
    }
  ],
  "_schema": "string",
  "physical_address": "string",
  "broadcast_address": "string",
  "link_status": "up",
  "default_gateway": "string",
  "bond_primary": "string",
  "bond_slaves": [
    "string",
    "string",
    "string",
    "string",
    "string",
    "string",
    "string",
    "string",
    "string"
  ],
  "ip_addresses": [
    {
      "netmask": "string",
      "ip_address": "string"
    },
    {
      "netmask": "string",
      "ip_address": "string"
    },
    {
      "netmask": "string",
      "ip_address": "string"
    },
    {
      "netmask": "string",
      "ip_address": "string"
    },
    {
      "netmask": "string",
      "ip_address": "string"
    },
    {
      "netmask": "string",
      "ip_address": "string"
    },
    {
      "netmask": "string",
      "ip_address": "string"
    },
    {
      "netmask": "string",
      "ip_address": "string"
    }
  ],
  "admin_status": "down",
  "interface_id": "string",
  "bond_mode": "ACTIVE_BACKUP",
  "plane": "debug",
  "ip_configuration": "dhcp",
  "mtu": 10
}