{
  "state": "failed",
  "details": [
    {
      "sub_system_address": "string",
      "state": "in_progress",
      "sub_system_type": "string",
      "failure_message": "string",
      "failure_code": 3,
      "sub_system_id": "string"
    },
    {
      "sub_system_address": "string",
      "state": "partial_success",
      "sub_system_type": "string",
      "failure_message": "string",
      "failure_code": 10,
      "sub_system_id": "string"
    },
    {
      "sub_system_address": "string",
      "state": "failed",
      "sub_system_type": "string",
      "failure_message": "string",
      "failure_code": 7,
      "sub_system_id": "string"
    },
    {
      "sub_system_address": "string",
      "state": "failed",
      "sub_system_type": "string",
      "failure_message": "string",
      "failure_code": 3,
      "sub_system_id": "string"
    },
    {
      "sub_system_address": "string",
      "state": "success",
      "sub_system_type": "string",
      "failure_message": "string",
      "failure_code": 6,
      "sub_system_id": "string"
    },
    {
      "sub_system_address": "string",
      "state": "in_progress",
      "sub_system_type": "string",
      "failure_message": "string",
      "failure_code": 7,
      "sub_system_id": "string"
    },
    {
      "sub_system_address": "string",
      "state": "success",
      "sub_system_type": "string",
      "failure_message": "string",
      "failure_code": 2,
      "sub_system_id": "string"
    },
    {
      "sub_system_address": "string",
      "state": "in_progress",
      "sub_system_type": "string",
      "failure_message": "string",
      "failure_code": 10,
      "sub_system_id": "string"
    }
  ],
  "failure_code": 1,
  "failure_message": "string"
}