{
  "_self": {
    "action": "string",
    "href": "string",
    "rel": "string"
  },
  "_links": [
    {
      "action": "string",
      "href": "string",
      "rel": "string"
    },
    {
      "action": "string",
      "href": "string",
      "rel": "string"
    },
    {
      "action": "string",
      "href": "string",
      "rel": "string"
    },
    {
      "action": "string",
      "href": "string",
      "rel": "string"
    },
    {
      "action": "string",
      "href": "string",
      "rel": "string"
    }
  ],
  "_schema": "string",
  "_revision": 10,
  "_system_owned": false,
  "display_name": "string",
  "description": "string",
  "tags": [
    {
      "scope": "string",
      "tag": "string"
    },
    {
      "scope": "string",
      "tag": "string"
    },
    {
      "scope": "string",
      "tag": "string"
    },
    {
      "scope": "string",
      "tag": "string"
    }
  ],
  "_create_user": "string",
  "_protection": "string",
  "_create_time": 6,
  "_last_modified_time": 5,
  "_last_modified_user": "string",
  "id": "string",
  "resource_type": "string",
  "failover_mode": "NON_PREEMPTIVE",
  "firewall_sections": [
    {
      "target_display_name": "string",
      "is_valid": true,
      "target_id": "string",
      "target_type": "string"
    },
    {
      "target_display_name": "string",
      "is_valid": false,
      "target_id": "string",
      "target_type": "string"
    },
    {
      "target_display_name": "string",
      "is_valid": true,
      "target_id": "string",
      "target_type": "string"
    },
    {
      "target_display_name": "string",
      "is_valid": true,
      "target_id": "string",
      "target_type": "string"
    },
    {
      "target_display_name": "string",
      "is_valid": false,
      "target_id": "string",
      "target_type": "string"
    },
    {
      "target_display_name": "string",
      "is_valid": false,
      "target_id": "string",
      "target_type": "string"
    },
    {
      "target_display_name": "string",
      "is_valid": true,
      "target_id": "string",
      "target_type": "string"
    },
    {
      "target_display_name": "string",
      "is_valid": true,
      "target_id": "string",
      "target_type": "string"
    },
    {
      "target_display_name": "string",
      "is_valid": true,
      "target_id": "string",
      "target_type": "string"
    }
  ],
  "advanced_config": {
    "internal_transit_network": "string",
    "ha_vip_configs": [
      {
        "ha_vip_subnets": [
          {
            "prefix_length": 8,
            "active_vip_addresses": [
              "string",
              "string"
            ]
          }
        ],
        "redundant_uplink_port_ids": [
          "string",
          "string",
          "string",
          "string",
          "string",
          "string",
          "string",
          "string"
        ],
        "enabled": true
      },
      {
        "ha_vip_subnets": [
          {
            "prefix_length": 2,
            "active_vip_addresses": [
              "string",
              "string"
            ]
          },
          {
            "prefix_length": 9,
            "active_vip_addresses": [
              "string",
              "string",
              "string",
              "string",
              "string"
            ]
          }
        ],
        "redundant_uplink_port_ids": [
          "string",
          "string",
          "string",
          "string",
          "string",
          "string",
          "string",
          "string",
          "string",
          "string"
        ],
        "enabled": true
      },
      {
        "ha_vip_subnets": [
          {
            "prefix_length": 2,
            "active_vip_addresses": [
              "string",
              "string",
              "string",
              "string",
              "string",
              "string"
            ]
          },
          {
            "prefix_length": 7,
            "active_vip_addresses": [
              "string"
            ]
          },
          {
            "prefix_length": 8,
            "active_vip_addresses": [
              "string",
              "string",
              "string",
              "string"
            ]
          },
          {
            "prefix_length": 1,
            "active_vip_addresses": [
              "string",
              "string",
              "string",
              "string"
            ]
          },
          {
            "prefix_length": 9,
            "active_vip_addresses": [
              "string",
              "string",
              "string"
            ]
          },
          {
            "prefix_length": 5,
            "active_vip_addresses": [
              "string"
            ]
          },
          {
            "prefix_length": 7,
            "active_vip_addresses": [
              "string",
              "string",
              "string",
              "string",
              "string",
              "string"
            ]
          },
          {
            "prefix_length": 5,
            "active_vip_addresses": [
              "string",
              "string",
              "string",
              "string"
            ]
          }
        ],
        "redundant_uplink_port_ids": [
          "string",
          "string",
          "string",
          "string",
          "string",
          "string",
          "string",
          "string",
          "string"
        ],
        "enabled": true
      },
      {
        "ha_vip_subnets": [
          {
            "prefix_length": 7,
            "active_vip_addresses": [
              "string",
              "string",
              "string",
              "string",
              "string",
              "string",
              "string"
            ]
          },
          {
            "prefix_length": 1,
            "active_vip_addresses": [
              "string",
              "string",
              "string"
            ]
          },
          {
            "prefix_length": 2,
            "active_vip_addresses": [
              "string",
              "string"
            ]
          },
          {
            "prefix_length": 2,
            "active_vip_addresses": [
              "string",
              "string",
              "string",
              "string",
              "string",
              "string",
              "string"
            ]
          },
          {
            "prefix_length": 1,
            "active_vip_addresses": [
              "string",
              "string",
              "string",
              "string"
            ]
          },
          {
            "prefix_length": 10,
            "active_vip_addresses": [
              "string",
              "string",
              "string",
              "string"
            ]
          },
          {
            "prefix_length": 4,
            "active_vip_addresses": [
              "string",
              "string",
              "string",
              "string",
              "string",
              "string",
              "string",
              "string",
              "string"
            ]
          },
          {
            "prefix_length": 7,
            "active_vip_addresses": [
              "string",
              "string"
            ]
          }
        ],
        "redundant_uplink_port_ids": [
          "string"
        ],
        "enabled": true
      },
      {
        "ha_vip_subnets": [
          {
            "prefix_length": 4,
            "active_vip_addresses": [
              "string",
              "string",
              "string",
              "string",
              "string",
              "string",
              "string",
              "string",
              "string"
            ]
          },
          {
            "prefix_length": 5,
            "active_vip_addresses": [
              "string",
              "string",
              "string",
              "string",
              "string",
              "string",
              "string",
              "string",
              "string"
            ]
          },
          {
            "prefix_length": 4,
            "active_vip_addresses": [
              "string",
              "string",
              "string",
              "string"
            ]
          },
          {
            "prefix_length": 10,
            "active_vip_addresses": [
              "string",
              "string"
            ]
          },
          {
            "prefix_length": 5,
            "active_vip_addresses": [
              "string",
              "string",
              "string"
            ]
          },
          {
            "prefix_length": 9,
            "active_vip_addresses": [
              "string",
              "string",
              "string",
              "string",
              "string",
              "string",
              "string",
              "string",
              "string",
              "string"
            ]
          },
          {
            "prefix_length": 3,
            "active_vip_addresses": [
              "string",
              "string",
              "string",
              "string",
              "string",
              "string"
            ]
          }
        ],
        "redundant_uplink_port_ids": [
          "string"
        ],
        "enabled": true
      },
      {
        "ha_vip_subnets": [
          {
            "prefix_length": 7,
            "active_vip_addresses": [
              "string",
              "string"
            ]
          },
          {
            "prefix_length": 8,
            "active_vip_addresses": [
              "string",
              "string"
            ]
          },
          {
            "prefix_length": 1,
            "active_vip_addresses": [
              "string"
            ]
          },
          {
            "prefix_length": 10,
            "active_vip_addresses": [
              "string",
              "string",
              "string"
            ]
          },
          {
            "prefix_length": 7,
            "active_vip_addresses": [
              "string",
              "string",
              "string",
              "string",
              "string"
            ]
          },
          {
            "prefix_length": 6,
            "active_vip_addresses": [
              "string",
              "string",
              "string",
              "string",
              "string",
              "string",
              "string"
            ]
          }
        ],
        "redundant_uplink_port_ids": [
          "string",
          "string",
          "string",
          "string",
          "string",
          "string",
          "string"
        ],
        "enabled": true
      },
      {
        "ha_vip_subnets": [
          {
            "prefix_length": 6,
            "active_vip_addresses": [
              "string",
              "string",
              "string",
              "string",
              "string"
            ]
          },
          {
            "prefix_length": 1,
            "active_vip_addresses": [
              "string",
              "string",
              "string",
              "string",
              "string",
              "string",
              "string",
              "string",
              "string",
              "string"
            ]
          },
          {
            "prefix_length": 3,
            "active_vip_addresses": [
              "string",
              "string",
              "string"
            ]
          },
          {
            "prefix_length": 5,
            "active_vip_addresses": [
              "string",
              "string",
              "string",
              "string",
              "string",
              "string",
              "string",
              "string",
              "string",
              "string"
            ]
          },
          {
            "prefix_length": 7,
            "active_vip_addresses": [
              "string",
              "string"
            ]
          }
        ],
        "redundant_uplink_port_ids": [
          "string",
          "string",
          "string",
          "string",
          "string",
          "string",
          "string",
          "string",
          "string"
        ],
        "enabled": true
      },
      {
        "ha_vip_subnets": [
          {
            "prefix_length": 10,
            "active_vip_addresses": [
              "string",
              "string",
              "string",
              "string",
              "string",
              "string",
              "string",
              "string"
            ]
          },
          {
            "prefix_length": 7,
            "active_vip_addresses": [
              "string",
              "string",
              "string",
              "string",
              "string",
              "string"
            ]
          },
          {
            "prefix_length": 9,
            "active_vip_addresses": [
              "string",
              "string",
              "string",
              "string",
              "string",
              "string"
            ]
          },
          {
            "prefix_length": 6,
            "active_vip_addresses": [
              "string",
              "string",
              "string"
            ]
          },
          {
            "prefix_length": 9,
            "active_vip_addresses": [
              "string"
            ]
          },
          {
            "prefix_length": 1,
            "active_vip_addresses": [
              "string",
              "string",
              "string",
              "string",
              "string",
              "string",
              "string"
            ]
          },
          {
            "prefix_length": 1,
            "active_vip_addresses": [
              "string",
              "string"
            ]
          },
          {
            "prefix_length": 1,
            "active_vip_addresses": [
              "string",
              "string",
              "string",
              "string"
            ]
          },
          {
            "prefix_length": 1,
            "active_vip_addresses": [
              "string",
              "string",
              "string",
              "string",
              "string",
              "string"
            ]
          }
        ],
        "redundant_uplink_port_ids": [
          "string",
          "string",
          "string",
          "string",
          "string",
          "string",
          "string",
          "string",
          "string"
        ],
        "enabled": true
      }
    ],
    "external_transit_networks": [
      "string",
      "string",
      "string",
      "string",
      "string",
      "string",
      "string",
      "string",
      "string"
    ]
  },
  "router_type": "TIER0",
  "preferred_edge_cluster_member_index": 8,
  "high_availability_mode": "ACTIVE_ACTIVE",
  "edge_cluster_id": "string"
}