{
  "_self": {
    "action": "string",
    "href": "string",
    "rel": "string"
  },
  "_links": [
    {
      "action": "string",
      "href": "string",
      "rel": "string"
    }
  ],
  "_schema": "string",
  "pids": [
    9,
    9,
    4,
    6,
    4
  ],
  "runtime_state": "stopped",
  "monitor_runtime_state": "stopped",
  "monitor_pid": 9
}