{
  "appliances": [
    {
      "Hardware": {
        "cpuCores": 4,
        "cpuCount": 8,
        "cpuLoad": 4,
        "cpuModel": "Not Specified",
        "description": "Row 4 Rack 2",
        "diskSize": "80G",
        "fanless": true,
        "firmwareVersion": "10.1",
        "freeDisk": "55G",
        "freeMemory": "1.3GB",
        "hardWareSerialNo": "HW984933",
        "id": "string",
        "intelQuickAssistAcceleration": true,
        "interfaceCount": 9,
        "interfaces": [
          "string",
          "string",
          "string",
          "string",
          "string",
          "string",
          "string",
          "string",
          "string"
        ],
        "lpm": true,
        "manufacturer": "QEMU",
        "memory": "7.8GB",
        "model": "Standard PC (i440FX + PIIX, 1996)",
        "name": "string",
        "packageName": "versa-flexvnf-20200222-110958-6999a21-16.1R2S1",
        "processorType": "Intel",
        "serialNo": "V4773958",
        "sku": "2489748",
        "ssd": true
      },
      "OssPack": {
        "name": "string",
        "osspackVersion": "string",
        "updateType": "string"
      },
      "SPack": {
        "apiVersion": "string",
        "flavor": "string",
        "name": "string",
        "releaseDate": "string",
        "spackVersion": "string",
        "updateType": "string"
      },
      "alarmSummary": {
        "columnNames": [
          "string",
          "string",
          "string",
          "string",
          "string",
          "string",
          "string",
          "string"
        ],
        "id": "string",
        "monitorType": "string",
        "rows": [
          {
            "columnValues": [
              1,
              3,
              4,
              8,
              8,
              9,
              9,
              4,
              7,
              9
            ],
            "firstColumnValue": "string",
            "id": "string"
          },
          {
            "columnValues": [
              9,
              9,
              9,
              6,
              1,
              7,
              1
            ],
            "firstColumnValue": "string",
            "id": "string"
          },
          {
            "columnValues": [
              9,
              5,
              6,
              4
            ],
            "firstColumnValue": "string",
            "id": "string"
          },
          {
            "columnValues": [
              1,
              3,
              7,
              10,
              4,
              3,
              10
            ],
            "firstColumnValue": "string",
            "id": "string"
          },
          {
            "columnValues": [
              10
            ],
            "firstColumnValue": "string",
            "id": "string"
          },
          {
            "columnValues": [
              5,
              9,
              5,
              3,
              7
            ],
            "firstColumnValue": "string",
            "id": "string"
          },
          {
            "columnValues": [
              5,
              5,
              9,
              4,
              8
            ],
            "firstColumnValue": "string",
            "id": "string"
          },
          {
            "columnValues": [
              6,
              6
            ],
            "firstColumnValue": "string",
            "id": "string"
          },
          {
            "columnValues": [
              4,
              5
            ],
            "firstColumnValue": "string",
            "id": "string"
          },
          {
            "columnValues": [
              2,
              2,
              10,
              6,
              6,
              6,
              8,
              10,
              6
            ],
            "firstColumnValue": "string",
            "id": "string"
          }
        ],
        "tableId": "string",
        "tableName": "string"
      },
      "applianceCapabilities": {
        "capabilities": [
          "string",
          "string",
          "string",
          "string",
          "string",
          "string",
          "string"
        ],
        "id": "string"
      },
      "applianceHAPairedStatus": {
        "haPairedApplianceName": "string",
        "haPairedApplianceUUID": "string"
      },
      "applianceLocation": {
        "applianceIp": "10.48.9.2",
        "applianceName": "Branch-1",
        "applianceUuid": "Branch-1",
        "id": "string",
        "latitude": "17.05",
        "locationId": "6020 Merriwether Way, Santa Clara CA 95055",
        "longitude": "103.45",
        "type": "string"
      },
      "applianceTags": [
        "string",
        "string",
        "string",
        "string",
        "string",
        "string",
        "string",
        "string",
        "string"
      ],
      "applicationStats": {
        "columnNames": [
          "string",
          "string",
          "string",
          "string",
          "string",
          "string",
          "string"
        ],
        "id": "string",
        "monitorType": "string",
        "rows": [
          {
            "columnValues": [
              7,
              9,
              9,
              1,
              2,
              7
            ],
            "firstColumnValue": "string",
            "id": "string"
          },
          {
            "columnValues": [
              4,
              3,
              3,
              2
            ],
            "firstColumnValue": "string",
            "id": "string"
          },
          {
            "columnValues": [
              1,
              3,
              1,
              2,
              5,
              1,
              2,
              6,
              7,
              10
            ],
            "firstColumnValue": "string",
            "id": "string"
          },
          {
            "columnValues": [
              7,
              2,
              1,
              6,
              5,
              4,
              4,
              1,
              6
            ],
            "firstColumnValue": "string",
            "id": "string"
          },
          {
            "columnValues": [
              1,
              4,
              7,
              10,
              3,
              1,
              3
            ],
            "firstColumnValue": "string",
            "id": "string"
          },
          {
            "columnValues": [
              1,
              4,
              5,
              2
            ],
            "firstColumnValue": "string",
            "id": "string"
          },
          {
            "columnValues": [
              9,
              10,
              4
            ],
            "firstColumnValue": "string",
            "id": "string"
          },
          {
            "columnValues": [
              9,
              7
            ],
            "firstColumnValue": "string",
            "id": "string"
          },
          {
            "columnValues": [
              3,
              5,
              2,
              2,
              2
            ],
            "firstColumnValue": "string",
            "id": "string"
          }
        ],
        "tableId": "string",
        "tableName": "string"
      },
      "branch-maintenance-mode": false,
      "branch-maintenance-mode-ip": "string",
      "branchId": "string",
      "branchInMaintenanceMode": true,
      "cmsOrg": "string",
      "connector": "string",
      "connectorType": "string",
      "controll-status": "string",
      "controllers": [
        "string",
        "string",
        "string",
        "string"
      ],
      "cpeHealth": {
        "columnNames": [
          "string",
          "string",
          "string",
          "string",
          "string",
          "string",
          "string",
          "string"
        ],
        "id": "string",
        "monitorType": "string",
        "rows": [
          {
            "columnValues": [
              5,
              9,
              7,
              4,
              8,
              10,
              3,
              6,
              7
            ],
            "firstColumnValue": "string",
            "id": "string"
          },
          {
            "columnValues": [
              9,
              8
            ],
            "firstColumnValue": "string",
            "id": "string"
          },
          {
            "columnValues": [
              9,
              1,
              4
            ],
            "firstColumnValue": "string",
            "id": "string"
          },
          {
            "columnValues": [
              1,
              2,
              7,
              1,
              9,
              10,
              1
            ],
            "firstColumnValue": "string",
            "id": "string"
          },
          {
            "columnValues": [
              5,
              4,
              7,
              4,
              5,
              10,
              10
            ],
            "firstColumnValue": "string",
            "id": "string"
          },
          {
            "columnValues": [
              4,
              9,
              3,
              5
            ],
            "firstColumnValue": "string",
            "id": "string"
          },
          {
            "columnValues": [
              8,
              4,
              1,
              7,
              6,
              8,
              2,
              6,
              8
            ],
            "firstColumnValue": "string",
            "id": "string"
          }
        ],
        "tableId": "string",
        "tableName": "string"
      },
      "createdAt": "string",
      "currentUpgradeStatus": "string",
      "deploymentType": "string",
      "id": "string",
      "inter-chassis-ha-status": {
        "control-nodes": [
          {
            "appliance-instance": "string",
            "id": "string",
            "ip ": "string",
            "red-role": "string",
            "vcn-instance": "string",
            "vcn-slot": "string"
          },
          {
            "appliance-instance": "string",
            "id": "string",
            "ip ": "string",
            "red-role": "string",
            "vcn-instance": "string",
            "vcn-slot": "string"
          },
          {
            "appliance-instance": "string",
            "id": "string",
            "ip ": "string",
            "red-role": "string",
            "vcn-instance": "string",
            "vcn-slot": "string"
          },
          {
            "appliance-instance": "string",
            "id": "string",
            "ip ": "string",
            "red-role": "string",
            "vcn-instance": "string",
            "vcn-slot": "string"
          }
        ],
        "ha-configured": true,
        "id": "string",
        "local-ctrl-ip": "string",
        "local-ip": "string",
        "remote-ctrl-ip": "string",
        "remote-ip": "string"
      },
      "intra-chassis-ha-status": {
        "ha-configured": false,
        "id": "string",
        "vcsn-nodes": [
          {
            "role": "ACTIVE",
            "slot-number": 7,
            "vm-name": "string"
          },
          {
            "role": "ACTIVE",
            "slot-number": 4,
            "vm-name": "string"
          },
          {
            "role": "STANDBY",
            "slot-number": 7,
            "vm-name": "string"
          },
          {
            "role": "UNKNOWN",
            "slot-number": 3,
            "vm-name": "string"
          }
        ]
      },
      "ipAddress": "string",
      "last-updated-time": "string",
      "lastUpgradeStatus": "string",
      "location": "string",
      "lockDetails": {
        "lockType": "string",
        "user": "string"
      },
      "name": "string",
      "nodes": {
        "nodeStatusList": [
          {
            "cpu-load": 6,
            "host-ip": "string",
            "load-factor": 8,
            "memory-load": 8,
            "node-type": "string",
            "slot-id": 1,
            "vm-name": "string",
            "vm-status": "string"
          },
          {
            "cpu-load": 7,
            "host-ip": "string",
            "load-factor": 8,
            "memory-load": 9,
            "node-type": "string",
            "slot-id": 3,
            "vm-name": "string",
            "vm-status": "string"
          },
          {
            "cpu-load": 2,
            "host-ip": "string",
            "load-factor": 10,
            "memory-load": 7,
            "node-type": "string",
            "slot-id": 10,
            "vm-name": "string",
            "vm-status": "string"
          },
          {
            "cpu-load": 9,
            "host-ip": "string",
            "load-factor": 10,
            "memory-load": 8,
            "node-type": "string",
            "slot-id": 1,
            "vm-name": "string",
            "vm-status": "string"
          },
          {
            "cpu-load": 3,
            "host-ip": "string",
            "load-factor": 2,
            "memory-load": 1,
            "node-type": "string",
            "slot-id": 4,
            "vm-name": "string",
            "vm-status": "string"
          },
          {
            "cpu-load": 9,
            "host-ip": "string",
            "load-factor": 9,
            "memory-load": 6,
            "node-type": "string",
            "slot-id": 6,
            "vm-name": "string",
            "vm-status": "string"
          },
          {
            "cpu-load": 6,
            "host-ip": "string",
            "load-factor": 1,
            "memory-load": 6,
            "node-type": "string",
            "slot-id": 8,
            "vm-name": "string",
            "vm-status": "string"
          }
        ]
      },
      "orgs": [
        "string",
        "string",
        "string",
        "string",
        "string",
        "string"
      ],
      "overall-status": "string",
      "ownerOrg": "string",
      "ownerOrgUuid": "string",
      "packageInfo": {
        "branch": "20.2.2",
        "name": "versa-director-20180223-124241-886fad6-16.1R2S1",
        "packageDate": "20200330",
        "packageId": "886fad6",
        "uiPackageId": "77d4a34",
        "version": "20.2.2"
      },
      "path-status": "string",
      "ping-status": "string",
      "policyViolation": {
        "columnNames": [
          "string",
          "string",
          "string",
          "string",
          "string",
          "string",
          "string",
          "string"
        ],
        "id": "string",
        "monitorType": "string",
        "rows": [
          {
            "columnValues": [
              6
            ],
            "firstColumnValue": "string",
            "id": "string"
          },
          {
            "columnValues": [
              1,
              4,
              4,
              3,
              7,
              8,
              3,
              3
            ],
            "firstColumnValue": "string",
            "id": "string"
          },
          {
            "columnValues": [
              7,
              1,
              5,
              9,
              3,
              6,
              8,
              6,
              4,
              4
            ],
            "firstColumnValue": "string",
            "id": "string"
          }
        ],
        "tableId": "string",
        "tableName": "string"
      },
      "refreshCycleCount": 9,
      "services": [
        "string",
        "string",
        "string",
        "string",
        "string",
        "string"
      ],
      "services-status": "string",
      "sngCount": 3,
      "softwareVersion": "string",
      "startTime": "string",
      "subType": "string",
      "sync-status": "string",
      "trialInfoMode": "string",
      "trialInfoOpterr": "string",
      "trialInfoState": "string",
      "type": "string",
      "ucpe-nodes": {
        "ucpeNodeStatusList": [
          {
            "cpuLoad": "string",
            "diskLoad": "string",
            "managementIP": "string",
            "memoryLoad": "string",
            "name": "string",
            "status": "string",
            "uptime": "string",
            "uuid": "string",
            "vncPort": 2
          }
        ]
      },
      "unreachable": true,
      "uuid": "string",
      "yang-compatibility-status": "string"
    },
    {
      "Hardware": {
        "cpuCores": 4,
        "cpuCount": 8,
        "cpuLoad": 4,
        "cpuModel": "Not Specified",
        "description": "Row 4 Rack 2",
        "diskSize": "80G",
        "fanless": false,
        "firmwareVersion": "10.1",
        "freeDisk": "55G",
        "freeMemory": "1.3GB",
        "hardWareSerialNo": "HW984933",
        "id": "string",
        "intelQuickAssistAcceleration": true,
        "interfaceCount": 10,
        "interfaces": [
          "string",
          "string",
          "string",
          "string"
        ],
        "lpm": true,
        "manufacturer": "QEMU",
        "memory": "7.8GB",
        "model": "Standard PC (i440FX + PIIX, 1996)",
        "name": "string",
        "packageName": "versa-flexvnf-20200222-110958-6999a21-16.1R2S1",
        "processorType": "Intel",
        "serialNo": "V4773958",
        "sku": "2489748",
        "ssd": false
      },
      "OssPack": {
        "name": "string",
        "osspackVersion": "string",
        "updateType": "string"
      },
      "SPack": {
        "apiVersion": "string",
        "flavor": "string",
        "name": "string",
        "releaseDate": "string",
        "spackVersion": "string",
        "updateType": "string"
      },
      "alarmSummary": {
        "columnNames": [
          "string",
          "string",
          "string",
          "string",
          "string",
          "string",
          "string"
        ],
        "id": "string",
        "monitorType": "string",
        "rows": [
          {
            "columnValues": [
              5,
              3,
              7,
              3,
              3,
              10,
              2,
              8,
              7,
              10
            ],
            "firstColumnValue": "string",
            "id": "string"
          },
          {
            "columnValues": [
              3,
              2,
              10,
              3
            ],
            "firstColumnValue": "string",
            "id": "string"
          },
          {
            "columnValues": [
              5,
              1,
              5,
              9
            ],
            "firstColumnValue": "string",
            "id": "string"
          },
          {
            "columnValues": [
              7
            ],
            "firstColumnValue": "string",
            "id": "string"
          },
          {
            "columnValues": [
              5,
              1,
              3,
              1,
              4,
              2,
              8
            ],
            "firstColumnValue": "string",
            "id": "string"
          }
        ],
        "tableId": "string",
        "tableName": "string"
      },
      "applianceCapabilities": {
        "capabilities": [
          "string",
          "string",
          "string"
        ],
        "id": "string"
      },
      "applianceHAPairedStatus": {
        "haPairedApplianceName": "string",
        "haPairedApplianceUUID": "string"
      },
      "applianceLocation": {
        "applianceIp": "10.48.9.2",
        "applianceName": "Branch-1",
        "applianceUuid": "Branch-1",
        "id": "string",
        "latitude": "17.05",
        "locationId": "6020 Merriwether Way, Santa Clara CA 95055",
        "longitude": "103.45",
        "type": "string"
      },
      "applianceTags": [
        "string",
        "string",
        "string",
        "string",
        "string",
        "string"
      ],
      "applicationStats": {
        "columnNames": [
          "string"
        ],
        "id": "string",
        "monitorType": "string",
        "rows": [
          {
            "columnValues": [
              6,
              10,
              1,
              2,
              3,
              6,
              10,
              4,
              3
            ],
            "firstColumnValue": "string",
            "id": "string"
          },
          {
            "columnValues": [
              9,
              10,
              9,
              2,
              2
            ],
            "firstColumnValue": "string",
            "id": "string"
          },
          {
            "columnValues": [
              6,
              2,
              8,
              9,
              7,
              9,
              9
            ],
            "firstColumnValue": "string",
            "id": "string"
          },
          {
            "columnValues": [
              9,
              6,
              9,
              7,
              1,
              4,
              4,
              5,
              1
            ],
            "firstColumnValue": "string",
            "id": "string"
          },
          {
            "columnValues": [
              4,
              1,
              6,
              9,
              5,
              10,
              1,
              7
            ],
            "firstColumnValue": "string",
            "id": "string"
          },
          {
            "columnValues": [
              9,
              3,
              3,
              4,
              10
            ],
            "firstColumnValue": "string",
            "id": "string"
          },
          {
            "columnValues": [
              5,
              3,
              4,
              7,
              9
            ],
            "firstColumnValue": "string",
            "id": "string"
          },
          {
            "columnValues": [
              10,
              4,
              4,
              7,
              6,
              2,
              3,
              6,
              5
            ],
            "firstColumnValue": "string",
            "id": "string"
          },
          {
            "columnValues": [
              8,
              1,
              10,
              3
            ],
            "firstColumnValue": "string",
            "id": "string"
          },
          {
            "columnValues": [
              7,
              7
            ],
            "firstColumnValue": "string",
            "id": "string"
          }
        ],
        "tableId": "string",
        "tableName": "string"
      },
      "branch-maintenance-mode": true,
      "branch-maintenance-mode-ip": "string",
      "branchId": "string",
      "branchInMaintenanceMode": false,
      "cmsOrg": "string",
      "connector": "string",
      "connectorType": "string",
      "controll-status": "string",
      "controllers": [
        "string",
        "string"
      ],
      "cpeHealth": {
        "columnNames": [
          "string",
          "string",
          "string",
          "string"
        ],
        "id": "string",
        "monitorType": "string",
        "rows": [
          {
            "columnValues": [
              9,
              5,
              8,
              1,
              5
            ],
            "firstColumnValue": "string",
            "id": "string"
          },
          {
            "columnValues": [
              7,
              4,
              2,
              3,
              7,
              3,
              8,
              7,
              10
            ],
            "firstColumnValue": "string",
            "id": "string"
          },
          {
            "columnValues": [
              4,
              3,
              8,
              2
            ],
            "firstColumnValue": "string",
            "id": "string"
          }
        ],
        "tableId": "string",
        "tableName": "string"
      },
      "createdAt": "string",
      "currentUpgradeStatus": "string",
      "deploymentType": "string",
      "id": "string",
      "inter-chassis-ha-status": {
        "control-nodes": [
          {
            "appliance-instance": "string",
            "id": "string",
            "ip ": "string",
            "red-role": "string",
            "vcn-instance": "string",
            "vcn-slot": "string"
          },
          {
            "appliance-instance": "string",
            "id": "string",
            "ip ": "string",
            "red-role": "string",
            "vcn-instance": "string",
            "vcn-slot": "string"
          },
          {
            "appliance-instance": "string",
            "id": "string",
            "ip ": "string",
            "red-role": "string",
            "vcn-instance": "string",
            "vcn-slot": "string"
          },
          {
            "appliance-instance": "string",
            "id": "string",
            "ip ": "string",
            "red-role": "string",
            "vcn-instance": "string",
            "vcn-slot": "string"
          },
          {
            "appliance-instance": "string",
            "id": "string",
            "ip ": "string",
            "red-role": "string",
            "vcn-instance": "string",
            "vcn-slot": "string"
          },
          {
            "appliance-instance": "string",
            "id": "string",
            "ip ": "string",
            "red-role": "string",
            "vcn-instance": "string",
            "vcn-slot": "string"
          },
          {
            "appliance-instance": "string",
            "id": "string",
            "ip ": "string",
            "red-role": "string",
            "vcn-instance": "string",
            "vcn-slot": "string"
          },
          {
            "appliance-instance": "string",
            "id": "string",
            "ip ": "string",
            "red-role": "string",
            "vcn-instance": "string",
            "vcn-slot": "string"
          },
          {
            "appliance-instance": "string",
            "id": "string",
            "ip ": "string",
            "red-role": "string",
            "vcn-instance": "string",
            "vcn-slot": "string"
          }
        ],
        "ha-configured": true,
        "id": "string",
        "local-ctrl-ip": "string",
        "local-ip": "string",
        "remote-ctrl-ip": "string",
        "remote-ip": "string"
      },
      "intra-chassis-ha-status": {
        "ha-configured": true,
        "id": "string",
        "vcsn-nodes": [
          {
            "role": "STANDBY",
            "slot-number": 9,
            "vm-name": "string"
          },
          {
            "role": "UNKNOWN",
            "slot-number": 9,
            "vm-name": "string"
          },
          {
            "role": "STANDBY",
            "slot-number": 5,
            "vm-name": "string"
          },
          {
            "role": "UNKNOWN",
            "slot-number": 8,
            "vm-name": "string"
          },
          {
            "role": "UNKNOWN",
            "slot-number": 6,
            "vm-name": "string"
          },
          {
            "role": "STANDBY",
            "slot-number": 6,
            "vm-name": "string"
          },
          {
            "role": "UNKNOWN",
            "slot-number": 3,
            "vm-name": "string"
          },
          {
            "role": "STANDBY",
            "slot-number": 6,
            "vm-name": "string"
          },
          {
            "role": "ACTIVE",
            "slot-number": 9,
            "vm-name": "string"
          }
        ]
      },
      "ipAddress": "string",
      "last-updated-time": "string",
      "lastUpgradeStatus": "string",
      "location": "string",
      "lockDetails": {
        "lockType": "string",
        "user": "string"
      },
      "name": "string",
      "nodes": {
        "nodeStatusList": [
          {
            "cpu-load": 4,
            "host-ip": "string",
            "load-factor": 9,
            "memory-load": 3,
            "node-type": "string",
            "slot-id": 9,
            "vm-name": "string",
            "vm-status": "string"
          },
          {
            "cpu-load": 2,
            "host-ip": "string",
            "load-factor": 3,
            "memory-load": 8,
            "node-type": "string",
            "slot-id": 1,
            "vm-name": "string",
            "vm-status": "string"
          },
          {
            "cpu-load": 9,
            "host-ip": "string",
            "load-factor": 7,
            "memory-load": 7,
            "node-type": "string",
            "slot-id": 4,
            "vm-name": "string",
            "vm-status": "string"
          },
          {
            "cpu-load": 2,
            "host-ip": "string",
            "load-factor": 4,
            "memory-load": 2,
            "node-type": "string",
            "slot-id": 2,
            "vm-name": "string",
            "vm-status": "string"
          },
          {
            "cpu-load": 2,
            "host-ip": "string",
            "load-factor": 3,
            "memory-load": 4,
            "node-type": "string",
            "slot-id": 8,
            "vm-name": "string",
            "vm-status": "string"
          }
        ]
      },
      "orgs": [
        "string",
        "string",
        "string"
      ],
      "overall-status": "string",
      "ownerOrg": "string",
      "ownerOrgUuid": "string",
      "packageInfo": {
        "branch": "20.2.2",
        "name": "versa-director-20180223-124241-886fad6-16.1R2S1",
        "packageDate": "20200330",
        "packageId": "886fad6",
        "uiPackageId": "77d4a34",
        "version": "20.2.2"
      },
      "path-status": "string",
      "ping-status": "string",
      "policyViolation": {
        "columnNames": [
          "string",
          "string",
          "string",
          "string"
        ],
        "id": "string",
        "monitorType": "string",
        "rows": [
          {
            "columnValues": [
              5,
              4
            ],
            "firstColumnValue": "string",
            "id": "string"
          },
          {
            "columnValues": [
              10,
              9,
              2,
              5
            ],
            "firstColumnValue": "string",
            "id": "string"
          },
          {
            "columnValues": [
              9,
              10,
              3,
              7,
              9,
              1,
              1,
              9,
              8
            ],
            "firstColumnValue": "string",
            "id": "string"
          },
          {
            "columnValues": [
              10,
              6,
              2,
              7,
              2,
              9,
              9
            ],
            "firstColumnValue": "string",
            "id": "string"
          },
          {
            "columnValues": [
              9,
              4,
              8,
              9,
              3,
              10,
              3,
              5,
              2,
              2
            ],
            "firstColumnValue": "string",
            "id": "string"
          },
          {
            "columnValues": [
              7,
              4,
              5,
              10,
              7,
              2,
              6,
              3,
              1
            ],
            "firstColumnValue": "string",
            "id": "string"
          },
          {
            "columnValues": [
              2,
              7,
              6,
              8,
              1,
              6,
              5,
              2,
              6
            ],
            "firstColumnValue": "string",
            "id": "string"
          }
        ],
        "tableId": "string",
        "tableName": "string"
      },
      "refreshCycleCount": 4,
      "services": [
        "string",
        "string",
        "string",
        "string"
      ],
      "services-status": "string",
      "sngCount": 8,
      "softwareVersion": "string",
      "startTime": "string",
      "subType": "string",
      "sync-status": "string",
      "trialInfoMode": "string",
      "trialInfoOpterr": "string",
      "trialInfoState": "string",
      "type": "string",
      "ucpe-nodes": {
        "ucpeNodeStatusList": [
          {
            "cpuLoad": "string",
            "diskLoad": "string",
            "managementIP": "string",
            "memoryLoad": "string",
            "name": "string",
            "status": "string",
            "uptime": "string",
            "uuid": "string",
            "vncPort": 8
          },
          {
            "cpuLoad": "string",
            "diskLoad": "string",
            "managementIP": "string",
            "memoryLoad": "string",
            "name": "string",
            "status": "string",
            "uptime": "string",
            "uuid": "string",
            "vncPort": 2
          }
        ]
      },
      "unreachable": false,
      "uuid": "string",
      "yang-compatibility-status": "string"
    },
    {
      "Hardware": {
        "cpuCores": 4,
        "cpuCount": 8,
        "cpuLoad": 4,
        "cpuModel": "Not Specified",
        "description": "Row 4 Rack 2",
        "diskSize": "80G",
        "fanless": true,
        "firmwareVersion": "10.1",
        "freeDisk": "55G",
        "freeMemory": "1.3GB",
        "hardWareSerialNo": "HW984933",
        "id": "string",
        "intelQuickAssistAcceleration": true,
        "interfaceCount": 8,
        "interfaces": [
          "string",
          "string",
          "string",
          "string",
          "string",
          "string",
          "string",
          "string",
          "string"
        ],
        "lpm": true,
        "manufacturer": "QEMU",
        "memory": "7.8GB",
        "model": "Standard PC (i440FX + PIIX, 1996)",
        "name": "string",
        "packageName": "versa-flexvnf-20200222-110958-6999a21-16.1R2S1",
        "processorType": "Intel",
        "serialNo": "V4773958",
        "sku": "2489748",
        "ssd": true
      },
      "OssPack": {
        "name": "string",
        "osspackVersion": "string",
        "updateType": "string"
      },
      "SPack": {
        "apiVersion": "string",
        "flavor": "string",
        "name": "string",
        "releaseDate": "string",
        "spackVersion": "string",
        "updateType": "string"
      },
      "alarmSummary": {
        "columnNames": [
          "string",
          "string"
        ],
        "id": "string",
        "monitorType": "string",
        "rows": [
          {
            "columnValues": [
              2,
              4,
              4,
              4,
              2
            ],
            "firstColumnValue": "string",
            "id": "string"
          },
          {
            "columnValues": [
              4
            ],
            "firstColumnValue": "string",
            "id": "string"
          },
          {
            "columnValues": [
              4,
              8,
              2,
              2
            ],
            "firstColumnValue": "string",
            "id": "string"
          }
        ],
        "tableId": "string",
        "tableName": "string"
      },
      "applianceCapabilities": {
        "capabilities": [
          "string",
          "string",
          "string",
          "string",
          "string",
          "string",
          "string",
          "string"
        ],
        "id": "string"
      },
      "applianceHAPairedStatus": {
        "haPairedApplianceName": "string",
        "haPairedApplianceUUID": "string"
      },
      "applianceLocation": {
        "applianceIp": "10.48.9.2",
        "applianceName": "Branch-1",
        "applianceUuid": "Branch-1",
        "id": "string",
        "latitude": "17.05",
        "locationId": "6020 Merriwether Way, Santa Clara CA 95055",
        "longitude": "103.45",
        "type": "string"
      },
      "applianceTags": [
        "string",
        "string",
        "string",
        "string",
        "string",
        "string",
        "string",
        "string",
        "string"
      ],
      "applicationStats": {
        "columnNames": [
          "string",
          "string",
          "string",
          "string",
          "string",
          "string",
          "string",
          "string",
          "string"
        ],
        "id": "string",
        "monitorType": "string",
        "rows": [
          {
            "columnValues": [
              9,
              8,
              6,
              10,
              9,
              5,
              10,
              2
            ],
            "firstColumnValue": "string",
            "id": "string"
          },
          {
            "columnValues": [
              5,
              7,
              10,
              4
            ],
            "firstColumnValue": "string",
            "id": "string"
          },
          {
            "columnValues": [
              8,
              7,
              6,
              7,
              4,
              1
            ],
            "firstColumnValue": "string",
            "id": "string"
          }
        ],
        "tableId": "string",
        "tableName": "string"
      },
      "branch-maintenance-mode": false,
      "branch-maintenance-mode-ip": "string",
      "branchId": "string",
      "branchInMaintenanceMode": false,
      "cmsOrg": "string",
      "connector": "string",
      "connectorType": "string",
      "controll-status": "string",
      "controllers": [
        "string",
        "string",
        "string",
        "string",
        "string",
        "string",
        "string",
        "string"
      ],
      "cpeHealth": {
        "columnNames": [
          "string",
          "string",
          "string"
        ],
        "id": "string",
        "monitorType": "string",
        "rows": [
          {
            "columnValues": [
              7
            ],
            "firstColumnValue": "string",
            "id": "string"
          },
          {
            "columnValues": [
              10,
              2,
              6,
              7,
              7,
              3,
              5,
              6,
              5,
              6
            ],
            "firstColumnValue": "string",
            "id": "string"
          },
          {
            "columnValues": [
              2,
              8,
              6
            ],
            "firstColumnValue": "string",
            "id": "string"
          },
          {
            "columnValues": [
              4,
              9,
              2,
              8
            ],
            "firstColumnValue": "string",
            "id": "string"
          },
          {
            "columnValues": [
              7
            ],
            "firstColumnValue": "string",
            "id": "string"
          },
          {
            "columnValues": [
              5,
              5,
              1
            ],
            "firstColumnValue": "string",
            "id": "string"
          },
          {
            "columnValues": [
              7,
              10,
              10,
              4,
              6,
              8
            ],
            "firstColumnValue": "string",
            "id": "string"
          },
          {
            "columnValues": [
              7,
              2,
              8,
              8,
              10,
              4,
              6
            ],
            "firstColumnValue": "string",
            "id": "string"
          }
        ],
        "tableId": "string",
        "tableName": "string"
      },
      "createdAt": "string",
      "currentUpgradeStatus": "string",
      "deploymentType": "string",
      "id": "string",
      "inter-chassis-ha-status": {
        "control-nodes": [
          {
            "appliance-instance": "string",
            "id": "string",
            "ip ": "string",
            "red-role": "string",
            "vcn-instance": "string",
            "vcn-slot": "string"
          },
          {
            "appliance-instance": "string",
            "id": "string",
            "ip ": "string",
            "red-role": "string",
            "vcn-instance": "string",
            "vcn-slot": "string"
          },
          {
            "appliance-instance": "string",
            "id": "string",
            "ip ": "string",
            "red-role": "string",
            "vcn-instance": "string",
            "vcn-slot": "string"
          },
          {
            "appliance-instance": "string",
            "id": "string",
            "ip ": "string",
            "red-role": "string",
            "vcn-instance": "string",
            "vcn-slot": "string"
          },
          {
            "appliance-instance": "string",
            "id": "string",
            "ip ": "string",
            "red-role": "string",
            "vcn-instance": "string",
            "vcn-slot": "string"
          },
          {
            "appliance-instance": "string",
            "id": "string",
            "ip ": "string",
            "red-role": "string",
            "vcn-instance": "string",
            "vcn-slot": "string"
          }
        ],
        "ha-configured": true,
        "id": "string",
        "local-ctrl-ip": "string",
        "local-ip": "string",
        "remote-ctrl-ip": "string",
        "remote-ip": "string"
      },
      "intra-chassis-ha-status": {
        "ha-configured": false,
        "id": "string",
        "vcsn-nodes": [
          {
            "role": "ACTIVE",
            "slot-number": 3,
            "vm-name": "string"
          },
          {
            "role": "UNKNOWN",
            "slot-number": 9,
            "vm-name": "string"
          }
        ]
      },
      "ipAddress": "string",
      "last-updated-time": "string",
      "lastUpgradeStatus": "string",
      "location": "string",
      "lockDetails": {
        "lockType": "string",
        "user": "string"
      },
      "name": "string",
      "nodes": {
        "nodeStatusList": [
          {
            "cpu-load": 2,
            "host-ip": "string",
            "load-factor": 9,
            "memory-load": 9,
            "node-type": "string",
            "slot-id": 7,
            "vm-name": "string",
            "vm-status": "string"
          },
          {
            "cpu-load": 5,
            "host-ip": "string",
            "load-factor": 8,
            "memory-load": 9,
            "node-type": "string",
            "slot-id": 2,
            "vm-name": "string",
            "vm-status": "string"
          },
          {
            "cpu-load": 4,
            "host-ip": "string",
            "load-factor": 3,
            "memory-load": 4,
            "node-type": "string",
            "slot-id": 4,
            "vm-name": "string",
            "vm-status": "string"
          },
          {
            "cpu-load": 8,
            "host-ip": "string",
            "load-factor": 8,
            "memory-load": 8,
            "node-type": "string",
            "slot-id": 3,
            "vm-name": "string",
            "vm-status": "string"
          },
          {
            "cpu-load": 7,
            "host-ip": "string",
            "load-factor": 10,
            "memory-load": 5,
            "node-type": "string",
            "slot-id": 10,
            "vm-name": "string",
            "vm-status": "string"
          },
          {
            "cpu-load": 1,
            "host-ip": "string",
            "load-factor": 2,
            "memory-load": 10,
            "node-type": "string",
            "slot-id": 7,
            "vm-name": "string",
            "vm-status": "string"
          },
          {
            "cpu-load": 9,
            "host-ip": "string",
            "load-factor": 2,
            "memory-load": 8,
            "node-type": "string",
            "slot-id": 9,
            "vm-name": "string",
            "vm-status": "string"
          },
          {
            "cpu-load": 1,
            "host-ip": "string",
            "load-factor": 2,
            "memory-load": 2,
            "node-type": "string",
            "slot-id": 4,
            "vm-name": "string",
            "vm-status": "string"
          },
          {
            "cpu-load": 6,
            "host-ip": "string",
            "load-factor": 3,
            "memory-load": 2,
            "node-type": "string",
            "slot-id": 2,
            "vm-name": "string",
            "vm-status": "string"
          },
          {
            "cpu-load": 3,
            "host-ip": "string",
            "load-factor": 3,
            "memory-load": 1,
            "node-type": "string",
            "slot-id": 7,
            "vm-name": "string",
            "vm-status": "string"
          }
        ]
      },
      "orgs": [
        "string",
        "string",
        "string"
      ],
      "overall-status": "string",
      "ownerOrg": "string",
      "ownerOrgUuid": "string",
      "packageInfo": {
        "branch": "20.2.2",
        "name": "versa-director-20180223-124241-886fad6-16.1R2S1",
        "packageDate": "20200330",
        "packageId": "886fad6",
        "uiPackageId": "77d4a34",
        "version": "20.2.2"
      },
      "path-status": "string",
      "ping-status": "string",
      "policyViolation": {
        "columnNames": [
          "string",
          "string",
          "string",
          "string",
          "string",
          "string"
        ],
        "id": "string",
        "monitorType": "string",
        "rows": [
          {
            "columnValues": [
              4,
              3,
              4,
              2,
              4,
              4,
              10,
              4
            ],
            "firstColumnValue": "string",
            "id": "string"
          },
          {
            "columnValues": [
              3,
              10
            ],
            "firstColumnValue": "string",
            "id": "string"
          },
          {
            "columnValues": [
              4
            ],
            "firstColumnValue": "string",
            "id": "string"
          },
          {
            "columnValues": [
              1,
              3,
              4,
              7,
              6,
              5,
              8,
              9,
              1,
              4
            ],
            "firstColumnValue": "string",
            "id": "string"
          },
          {
            "columnValues": [
              3,
              6,
              9,
              3,
              5,
              5,
              4
            ],
            "firstColumnValue": "string",
            "id": "string"
          },
          {
            "columnValues": [
              2,
              8,
              9
            ],
            "firstColumnValue": "string",
            "id": "string"
          },
          {
            "columnValues": [
              1
            ],
            "firstColumnValue": "string",
            "id": "string"
          }
        ],
        "tableId": "string",
        "tableName": "string"
      },
      "refreshCycleCount": 1,
      "services": [
        "string",
        "string",
        "string",
        "string",
        "string",
        "string",
        "string",
        "string",
        "string"
      ],
      "services-status": "string",
      "sngCount": 7,
      "softwareVersion": "string",
      "startTime": "string",
      "subType": "string",
      "sync-status": "string",
      "trialInfoMode": "string",
      "trialInfoOpterr": "string",
      "trialInfoState": "string",
      "type": "string",
      "ucpe-nodes": {
        "ucpeNodeStatusList": [
          {
            "cpuLoad": "string",
            "diskLoad": "string",
            "managementIP": "string",
            "memoryLoad": "string",
            "name": "string",
            "status": "string",
            "uptime": "string",
            "uuid": "string",
            "vncPort": 9
          },
          {
            "cpuLoad": "string",
            "diskLoad": "string",
            "managementIP": "string",
            "memoryLoad": "string",
            "name": "string",
            "status": "string",
            "uptime": "string",
            "uuid": "string",
            "vncPort": 6
          },
          {
            "cpuLoad": "string",
            "diskLoad": "string",
            "managementIP": "string",
            "memoryLoad": "string",
            "name": "string",
            "status": "string",
            "uptime": "string",
            "uuid": "string",
            "vncPort": 1
          },
          {
            "cpuLoad": "string",
            "diskLoad": "string",
            "managementIP": "string",
            "memoryLoad": "string",
            "name": "string",
            "status": "string",
            "uptime": "string",
            "uuid": "string",
            "vncPort": 2
          },
          {
            "cpuLoad": "string",
            "diskLoad": "string",
            "managementIP": "string",
            "memoryLoad": "string",
            "name": "string",
            "status": "string",
            "uptime": "string",
            "uuid": "string",
            "vncPort": 6
          },
          {
            "cpuLoad": "string",
            "diskLoad": "string",
            "managementIP": "string",
            "memoryLoad": "string",
            "name": "string",
            "status": "string",
            "uptime": "string",
            "uuid": "string",
            "vncPort": 2
          },
          {
            "cpuLoad": "string",
            "diskLoad": "string",
            "managementIP": "string",
            "memoryLoad": "string",
            "name": "string",
            "status": "string",
            "uptime": "string",
            "uuid": "string",
            "vncPort": 8
          },
          {
            "cpuLoad": "string",
            "diskLoad": "string",
            "managementIP": "string",
            "memoryLoad": "string",
            "name": "string",
            "status": "string",
            "uptime": "string",
            "uuid": "string",
            "vncPort": 2
          }
        ]
      },
      "unreachable": true,
      "uuid": "string",
      "yang-compatibility-status": "string"
    },
    {
      "Hardware": {
        "cpuCores": 4,
        "cpuCount": 8,
        "cpuLoad": 4,
        "cpuModel": "Not Specified",
        "description": "Row 4 Rack 2",
        "diskSize": "80G",
        "fanless": false,
        "firmwareVersion": "10.1",
        "freeDisk": "55G",
        "freeMemory": "1.3GB",
        "hardWareSerialNo": "HW984933",
        "id": "string",
        "intelQuickAssistAcceleration": true,
        "interfaceCount": 10,
        "interfaces": [
          "string",
          "string",
          "string"
        ],
        "lpm": false,
        "manufacturer": "QEMU",
        "memory": "7.8GB",
        "model": "Standard PC (i440FX + PIIX, 1996)",
        "name": "string",
        "packageName": "versa-flexvnf-20200222-110958-6999a21-16.1R2S1",
        "processorType": "Intel",
        "serialNo": "V4773958",
        "sku": "2489748",
        "ssd": false
      },
      "OssPack": {
        "name": "string",
        "osspackVersion": "string",
        "updateType": "string"
      },
      "SPack": {
        "apiVersion": "string",
        "flavor": "string",
        "name": "string",
        "releaseDate": "string",
        "spackVersion": "string",
        "updateType": "string"
      },
      "alarmSummary": {
        "columnNames": [
          "string",
          "string",
          "string"
        ],
        "id": "string",
        "monitorType": "string",
        "rows": [
          {
            "columnValues": [
              5,
              5,
              8,
              7,
              9,
              7,
              4,
              2,
              1
            ],
            "firstColumnValue": "string",
            "id": "string"
          },
          {
            "columnValues": [
              8,
              5,
              8,
              8,
              1,
              5
            ],
            "firstColumnValue": "string",
            "id": "string"
          },
          {
            "columnValues": [
              6
            ],
            "firstColumnValue": "string",
            "id": "string"
          },
          {
            "columnValues": [
              4,
              7,
              7,
              1,
              3,
              1,
              8
            ],
            "firstColumnValue": "string",
            "id": "string"
          },
          {
            "columnValues": [
              8,
              7,
              3,
              7,
              8,
              4,
              6,
              9,
              6,
              6
            ],
            "firstColumnValue": "string",
            "id": "string"
          },
          {
            "columnValues": [
              5,
              6,
              7,
              8
            ],
            "firstColumnValue": "string",
            "id": "string"
          },
          {
            "columnValues": [
              8,
              6,
              4,
              9,
              1,
              4,
              6,
              10,
              9,
              3
            ],
            "firstColumnValue": "string",
            "id": "string"
          },
          {
            "columnValues": [
              1,
              5,
              7,
              6,
              2,
              5
            ],
            "firstColumnValue": "string",
            "id": "string"
          },
          {
            "columnValues": [
              5,
              8,
              5,
              8,
              8,
              10,
              5,
              9
            ],
            "firstColumnValue": "string",
            "id": "string"
          }
        ],
        "tableId": "string",
        "tableName": "string"
      },
      "applianceCapabilities": {
        "capabilities": [
          "string",
          "string",
          "string",
          "string",
          "string",
          "string",
          "string"
        ],
        "id": "string"
      },
      "applianceHAPairedStatus": {
        "haPairedApplianceName": "string",
        "haPairedApplianceUUID": "string"
      },
      "applianceLocation": {
        "applianceIp": "10.48.9.2",
        "applianceName": "Branch-1",
        "applianceUuid": "Branch-1",
        "id": "string",
        "latitude": "17.05",
        "locationId": "6020 Merriwether Way, Santa Clara CA 95055",
        "longitude": "103.45",
        "type": "string"
      },
      "applianceTags": [
        "string",
        "string",
        "string",
        "string"
      ],
      "applicationStats": {
        "columnNames": [
          "string",
          "string",
          "string",
          "string",
          "string",
          "string",
          "string",
          "string",
          "string",
          "string"
        ],
        "id": "string",
        "monitorType": "string",
        "rows": [
          {
            "columnValues": [
              1
            ],
            "firstColumnValue": "string",
            "id": "string"
          },
          {
            "columnValues": [
              8,
              7,
              5,
              1,
              1,
              10,
              4
            ],
            "firstColumnValue": "string",
            "id": "string"
          },
          {
            "columnValues": [
              7,
              8,
              4,
              3,
              3,
              10,
              5,
              9,
              2,
              10
            ],
            "firstColumnValue": "string",
            "id": "string"
          }
        ],
        "tableId": "string",
        "tableName": "string"
      },
      "branch-maintenance-mode": false,
      "branch-maintenance-mode-ip": "string",
      "branchId": "string",
      "branchInMaintenanceMode": true,
      "cmsOrg": "string",
      "connector": "string",
      "connectorType": "string",
      "controll-status": "string",
      "controllers": [
        "string",
        "string",
        "string",
        "string",
        "string",
        "string",
        "string"
      ],
      "cpeHealth": {
        "columnNames": [
          "string",
          "string",
          "string",
          "string",
          "string",
          "string",
          "string"
        ],
        "id": "string",
        "monitorType": "string",
        "rows": [
          {
            "columnValues": [
              10,
              2,
              3,
              8,
              7,
              10,
              9,
              10,
              6,
              8
            ],
            "firstColumnValue": "string",
            "id": "string"
          },
          {
            "columnValues": [
              3
            ],
            "firstColumnValue": "string",
            "id": "string"
          },
          {
            "columnValues": [
              1
            ],
            "firstColumnValue": "string",
            "id": "string"
          },
          {
            "columnValues": [
              7
            ],
            "firstColumnValue": "string",
            "id": "string"
          },
          {
            "columnValues": [
              9,
              9,
              5,
              8,
              10,
              8,
              6
            ],
            "firstColumnValue": "string",
            "id": "string"
          },
          {
            "columnValues": [
              2,
              3
            ],
            "firstColumnValue": "string",
            "id": "string"
          }
        ],
        "tableId": "string",
        "tableName": "string"
      },
      "createdAt": "string",
      "currentUpgradeStatus": "string",
      "deploymentType": "string",
      "id": "string",
      "inter-chassis-ha-status": {
        "control-nodes": [
          {
            "appliance-instance": "string",
            "id": "string",
            "ip ": "string",
            "red-role": "string",
            "vcn-instance": "string",
            "vcn-slot": "string"
          },
          {
            "appliance-instance": "string",
            "id": "string",
            "ip ": "string",
            "red-role": "string",
            "vcn-instance": "string",
            "vcn-slot": "string"
          },
          {
            "appliance-instance": "string",
            "id": "string",
            "ip ": "string",
            "red-role": "string",
            "vcn-instance": "string",
            "vcn-slot": "string"
          },
          {
            "appliance-instance": "string",
            "id": "string",
            "ip ": "string",
            "red-role": "string",
            "vcn-instance": "string",
            "vcn-slot": "string"
          },
          {
            "appliance-instance": "string",
            "id": "string",
            "ip ": "string",
            "red-role": "string",
            "vcn-instance": "string",
            "vcn-slot": "string"
          },
          {
            "appliance-instance": "string",
            "id": "string",
            "ip ": "string",
            "red-role": "string",
            "vcn-instance": "string",
            "vcn-slot": "string"
          },
          {
            "appliance-instance": "string",
            "id": "string",
            "ip ": "string",
            "red-role": "string",
            "vcn-instance": "string",
            "vcn-slot": "string"
          },
          {
            "appliance-instance": "string",
            "id": "string",
            "ip ": "string",
            "red-role": "string",
            "vcn-instance": "string",
            "vcn-slot": "string"
          },
          {
            "appliance-instance": "string",
            "id": "string",
            "ip ": "string",
            "red-role": "string",
            "vcn-instance": "string",
            "vcn-slot": "string"
          },
          {
            "appliance-instance": "string",
            "id": "string",
            "ip ": "string",
            "red-role": "string",
            "vcn-instance": "string",
            "vcn-slot": "string"
          }
        ],
        "ha-configured": false,
        "id": "string",
        "local-ctrl-ip": "string",
        "local-ip": "string",
        "remote-ctrl-ip": "string",
        "remote-ip": "string"
      },
      "intra-chassis-ha-status": {
        "ha-configured": false,
        "id": "string",
        "vcsn-nodes": [
          {
            "role": "ACTIVE",
            "slot-number": 10,
            "vm-name": "string"
          },
          {
            "role": "ACTIVE",
            "slot-number": 2,
            "vm-name": "string"
          },
          {
            "role": "STANDBY",
            "slot-number": 5,
            "vm-name": "string"
          },
          {
            "role": "UNKNOWN",
            "slot-number": 1,
            "vm-name": "string"
          },
          {
            "role": "ACTIVE",
            "slot-number": 5,
            "vm-name": "string"
          }
        ]
      },
      "ipAddress": "string",
      "last-updated-time": "string",
      "lastUpgradeStatus": "string",
      "location": "string",
      "lockDetails": {
        "lockType": "string",
        "user": "string"
      },
      "name": "string",
      "nodes": {
        "nodeStatusList": [
          {
            "cpu-load": 3,
            "host-ip": "string",
            "load-factor": 9,
            "memory-load": 6,
            "node-type": "string",
            "slot-id": 9,
            "vm-name": "string",
            "vm-status": "string"
          }
        ]
      },
      "orgs": [
        "string",
        "string"
      ],
      "overall-status": "string",
      "ownerOrg": "string",
      "ownerOrgUuid": "string",
      "packageInfo": {
        "branch": "20.2.2",
        "name": "versa-director-20180223-124241-886fad6-16.1R2S1",
        "packageDate": "20200330",
        "packageId": "886fad6",
        "uiPackageId": "77d4a34",
        "version": "20.2.2"
      },
      "path-status": "string",
      "ping-status": "string",
      "policyViolation": {
        "columnNames": [
          "string",
          "string",
          "string",
          "string",
          "string",
          "string",
          "string",
          "string"
        ],
        "id": "string",
        "monitorType": "string",
        "rows": [
          {
            "columnValues": [
              5,
              3,
              5,
              7,
              8,
              8,
              4,
              10
            ],
            "firstColumnValue": "string",
            "id": "string"
          },
          {
            "columnValues": [
              6,
              5,
              2,
              9,
              10,
              2
            ],
            "firstColumnValue": "string",
            "id": "string"
          },
          {
            "columnValues": [
              7,
              8,
              5,
              6,
              9,
              2,
              3,
              2,
              3
            ],
            "firstColumnValue": "string",
            "id": "string"
          },
          {
            "columnValues": [
              5,
              2,
              9,
              6,
              10
            ],
            "firstColumnValue": "string",
            "id": "string"
          },
          {
            "columnValues": [
              8
            ],
            "firstColumnValue": "string",
            "id": "string"
          },
          {
            "columnValues": [
              10,
              7,
              4,
              10,
              1,
              8,
              5,
              3,
              7
            ],
            "firstColumnValue": "string",
            "id": "string"
          }
        ],
        "tableId": "string",
        "tableName": "string"
      },
      "refreshCycleCount": 4,
      "services": [
        "string",
        "string",
        "string",
        "string"
      ],
      "services-status": "string",
      "sngCount": 2,
      "softwareVersion": "string",
      "startTime": "string",
      "subType": "string",
      "sync-status": "string",
      "trialInfoMode": "string",
      "trialInfoOpterr": "string",
      "trialInfoState": "string",
      "type": "string",
      "ucpe-nodes": {
        "ucpeNodeStatusList": [
          {
            "cpuLoad": "string",
            "diskLoad": "string",
            "managementIP": "string",
            "memoryLoad": "string",
            "name": "string",
            "status": "string",
            "uptime": "string",
            "uuid": "string",
            "vncPort": 5
          },
          {
            "cpuLoad": "string",
            "diskLoad": "string",
            "managementIP": "string",
            "memoryLoad": "string",
            "name": "string",
            "status": "string",
            "uptime": "string",
            "uuid": "string",
            "vncPort": 1
          },
          {
            "cpuLoad": "string",
            "diskLoad": "string",
            "managementIP": "string",
            "memoryLoad": "string",
            "name": "string",
            "status": "string",
            "uptime": "string",
            "uuid": "string",
            "vncPort": 8
          },
          {
            "cpuLoad": "string",
            "diskLoad": "string",
            "managementIP": "string",
            "memoryLoad": "string",
            "name": "string",
            "status": "string",
            "uptime": "string",
            "uuid": "string",
            "vncPort": 9
          },
          {
            "cpuLoad": "string",
            "diskLoad": "string",
            "managementIP": "string",
            "memoryLoad": "string",
            "name": "string",
            "status": "string",
            "uptime": "string",
            "uuid": "string",
            "vncPort": 7
          },
          {
            "cpuLoad": "string",
            "diskLoad": "string",
            "managementIP": "string",
            "memoryLoad": "string",
            "name": "string",
            "status": "string",
            "uptime": "string",
            "uuid": "string",
            "vncPort": 10
          },
          {
            "cpuLoad": "string",
            "diskLoad": "string",
            "managementIP": "string",
            "memoryLoad": "string",
            "name": "string",
            "status": "string",
            "uptime": "string",
            "uuid": "string",
            "vncPort": 6
          },
          {
            "cpuLoad": "string",
            "diskLoad": "string",
            "managementIP": "string",
            "memoryLoad": "string",
            "name": "string",
            "status": "string",
            "uptime": "string",
            "uuid": "string",
            "vncPort": 9
          },
          {
            "cpuLoad": "string",
            "diskLoad": "string",
            "managementIP": "string",
            "memoryLoad": "string",
            "name": "string",
            "status": "string",
            "uptime": "string",
            "uuid": "string",
            "vncPort": 6
          }
        ]
      },
      "unreachable": false,
      "uuid": "string",
      "yang-compatibility-status": "string"
    }
  ],
  "id": "string",
  "totalCount": 3
}