{
  "actions": [
    {
      "name": "createBindData",
      "protocol": "REST",
      "method": "POST",
      "entitypath": "{base_path}/{version}/nextgen/binddata/?{query}",
      "requestSchema": "schema.json",
      "responseSchema": "schema.json",
      "timeout": 0,
      "sendEmpty": false,
      "requestDatatype": "JSON",
      "responseDatatype": "JSON",
      "headers": {},
      "responseObjects": [
        {
          "type": "default",
          "key": "",
          "mockFile": ""
        }
      ]
    },
    {
      "name": "getBinddataHeaderAndCount",
      "protocol": "REST",
      "method": "GET",
      "entitypath": "{base_path}/{version}/nextgen/binddata/header/template/{pathv1}/devicegroup/{pathv2}?{query}",
      "requestSchema": "schema.json",
      "responseSchema": "schema.json",
      "timeout": 0,
      "sendEmpty": false,
      "sendGetBody": false,
      "requestDatatype": "JSON",
      "responseDatatype": "JSON",
      "headers": {},
      "responseObjects": [
        {
          "type": "default",
          "key": "",
          "mockFile": "mockdatafiles/getBinddataHeaderAndCount-default.json"
        }
      ]
    },
    {
      "name": "getBinddataForTemplate",
      "protocol": "REST",
      "method": "GET",
      "entitypath": "{base_path}/{version}/nextgen/binddata/template/{pathv1}?{query}",
      "requestSchema": "schema.json",
      "responseSchema": "schema.json",
      "timeout": 0,
      "sendEmpty": false,
      "sendGetBody": false,
      "requestDatatype": "JSON",
      "responseDatatype": "JSON",
      "headers": {},
      "responseObjects": [
        {
          "type": "default",
          "key": "",
          "mockFile": "mockdatafiles/getBinddataForTemplate-default.json"
        }
      ]
    },
    {
      "name": "getTemplateBindata",
      "protocol": "REST",
      "method": "GET",
      "entitypath": "{base_path}/{version}/nextgen/binddata/templateData/template/{pathv1}/devicegroup/{pathv2}?{query}",
      "requestSchema": "schema.json",
      "responseSchema": "schema.json",
      "timeout": 0,
      "sendEmpty": false,
      "sendGetBody": false,
      "requestDatatype": "JSON",
      "responseDatatype": "JSON",
      "headers": {},
      "responseObjects": [
        {
          "type": "default",
          "key": "",
          "mockFile": "mockdatafiles/getTemplateBindata-default.json"
        }
      ]
    },
    {
      "name": "saveTemplateBindata",
      "protocol": "REST",
      "method": "PUT",
      "entitypath": "{base_path}/{version}/nextgen/binddata/templateData/template/{pathv1}/devicegroup/{pathv2}?{query}",
      "requestSchema": "schema.json",
      "responseSchema": "schema.json",
      "timeout": 0,
      "sendEmpty": false,
      "requestDatatype": "JSON",
      "responseDatatype": "JSON",
      "headers": {},
      "responseObjects": [
        {
          "type": "default",
          "key": "",
          "mockFile": ""
        }
      ]
    },
    {
      "name": "deleteTemplateBindata",
      "protocol": "REST",
      "method": "DELETE",
      "entitypath": "{base_path}/{version}/nextgen/binddata/templateData/template/{pathv1}/devicegroup/{pathv2}/delete?{query}",
      "requestSchema": "schema.json",
      "responseSchema": "schema.json",
      "timeout": 0,
      "sendEmpty": false,
      "requestDatatype": "JSON",
      "responseDatatype": "JSON",
      "headers": {},
      "responseObjects": [
        {
          "type": "default",
          "key": "",
          "mockFile": ""
        }
      ]
    },
    {
      "name": "getBindDataById",
      "protocol": "REST",
      "method": "GET",
      "entitypath": "{base_path}/{version}/nextgen/binddata/{pathv1}?{query}",
      "requestSchema": "schema.json",
      "responseSchema": "schema.json",
      "timeout": 0,
      "sendEmpty": false,
      "sendGetBody": false,
      "requestDatatype": "JSON",
      "responseDatatype": "JSON",
      "headers": {},
      "responseObjects": [
        {
          "type": "default",
          "key": "",
          "mockFile": "mockdatafiles/getBindDataById-default.json"
        }
      ]
    }
  ]
}