{
  "hubType": "hub",
  "name": "SpokeGroup1",
  "org": "Tenant1",
  "region": "west",
  "status": "CREATED",
  "vrfs": [
    {
      "communityRef": 5,
      "groupType": "HubAndSpoke",
      "hubs": [
        {
          "name": "hub34",
          "priority": 3
        },
        {
          "name": "hub34",
          "priority": 3
        },
        {
          "name": "hub34",
          "priority": 3
        }
      ],
      "name": "provider-org-vr"
    },
    {
      "communityRef": 5,
      "groupType": "HubAndSpoke",
      "hubs": [
        {
          "name": "hub34",
          "priority": 3
        },
        {
          "name": "hub34",
          "priority": 3
        },
        {
          "name": "hub34",
          "priority": 3
        }
      ],
      "name": "provider-org-vr"
    },
    {
      "communityRef": 5,
      "groupType": "HubAndSpoke",
      "hubs": [
        {
          "name": "hub34",
          "priority": 3
        },
        {
          "name": "hub34",
          "priority": 3
        }
      ],
      "name": "provider-org-vr"
    },
    {
      "communityRef": 5,
      "groupType": "HubAndSpoke",
      "hubs": [
        {
          "name": "hub34",
          "priority": 3
        },
        {
          "name": "hub34",
          "priority": 3
        },
        {
          "name": "hub34",
          "priority": 3
        },
        {
          "name": "hub34",
          "priority": 3
        },
        {
          "name": "hub34",
          "priority": 3
        },
        {
          "name": "hub34",
          "priority": 3
        },
        {
          "name": "hub34",
          "priority": 3
        },
        {
          "name": "hub34",
          "priority": 3
        },
        {
          "name": "hub34",
          "priority": 3
        },
        {
          "name": "hub34",
          "priority": 3
        }
      ],
      "name": "provider-org-vr"
    }
  ]
}