{
  "actions": [
    {
      "name": "getAllApplicationServiceTemplates",
      "protocol": "REST",
      "method": "GET",
      "entitypath": "{base_path}/{version}/nextgen/applicationServiceTemplate?{query}",
      "requestSchema": "schema.json",
      "responseSchema": "schema.json",
      "timeout": 0,
      "sendEmpty": false,
      "sendGetBody": false,
      "requestDatatype": "JSON",
      "responseDatatype": "JSON",
      "headers": {},
      "responseObjects": [
        {
          "type": "default",
          "key": "",
          "mockFile": "mockdatafiles/getAllApplicationServiceTemplates-default.json"
        }
      ]
    },
    {
      "name": "createApplicationServiceTemplate",
      "protocol": "REST",
      "method": "POST",
      "entitypath": "{base_path}/{version}/nextgen/applicationServiceTemplate?{query}",
      "requestSchema": "schema.json",
      "responseSchema": "schema.json",
      "timeout": 0,
      "sendEmpty": false,
      "requestDatatype": "JSON",
      "responseDatatype": "JSON",
      "headers": {},
      "responseObjects": [
        {
          "type": "default",
          "key": "",
          "mockFile": ""
        }
      ]
    },
    {
      "name": "getAllApplicationServiceTemplateSamples",
      "protocol": "REST",
      "method": "GET",
      "entitypath": "{base_path}/{version}/nextgen/applicationServiceTemplate/allSamples?{query}",
      "requestSchema": "schema.json",
      "responseSchema": "schema.json",
      "timeout": 0,
      "sendEmpty": false,
      "sendGetBody": false,
      "requestDatatype": "JSON",
      "responseDatatype": "JSON",
      "headers": {},
      "responseObjects": [
        {
          "type": "default",
          "key": "",
          "mockFile": "mockdatafiles/getAllApplicationServiceTemplateSamples-default.json"
        }
      ]
    },
    {
      "name": "cloneApplicationServiceTemplate",
      "protocol": "REST",
      "method": "POST",
      "entitypath": "{base_path}/{version}/nextgen/applicationServiceTemplate/clone/{pathv1}?{query}",
      "requestSchema": "schema.json",
      "responseSchema": "schema.json",
      "timeout": 0,
      "sendEmpty": false,
      "requestDatatype": "JSON",
      "responseDatatype": "JSON",
      "headers": {},
      "responseObjects": [
        {
          "type": "default",
          "key": "",
          "mockFile": ""
        }
      ]
    },
    {
      "name": "deployApplicationServiceTemplate",
      "protocol": "REST",
      "method": "POST",
      "entitypath": "{base_path}/{version}/nextgen/applicationServiceTemplate/deploy/{pathv1}?{query}",
      "requestSchema": "schema.json",
      "responseSchema": "schema.json",
      "timeout": 0,
      "sendEmpty": false,
      "requestDatatype": "JSON",
      "responseDatatype": "JSON",
      "headers": {},
      "responseObjects": [
        {
          "type": "default",
          "key": "",
          "mockFile": ""
        }
      ]
    },
    {
      "name": "updateApplicationServiceTemplate",
      "protocol": "REST",
      "method": "PUT",
      "entitypath": "{base_path}/{version}/nextgen/applicationServiceTemplate/{pathv1}?{query}",
      "requestSchema": "schema.json",
      "responseSchema": "schema.json",
      "timeout": 0,
      "sendEmpty": false,
      "requestDatatype": "JSON",
      "responseDatatype": "JSON",
      "headers": {},
      "responseObjects": [
        {
          "type": "default",
          "key": "",
          "mockFile": ""
        }
      ]
    },
    {
      "name": "deleteApplicationServiceTemplate",
      "protocol": "REST",
      "method": "DELETE",
      "entitypath": "{base_path}/{version}/nextgen/applicationServiceTemplate/{pathv1}?{query}",
      "requestSchema": "schema.json",
      "responseSchema": "schema.json",
      "timeout": 0,
      "sendEmpty": false,
      "requestDatatype": "JSON",
      "responseDatatype": "JSON",
      "headers": {},
      "responseObjects": [
        {
          "type": "default",
          "key": "",
          "mockFile": ""
        }
      ]
    },
    {
      "name": "getApplicationServiceTemplateById",
      "protocol": "REST",
      "method": "GET",
      "entitypath": "{base_path}/{version}/nextgen/applicationServiceTemplate/{pathv1}?{query}",
      "requestSchema": "schema.json",
      "responseSchema": "schema.json",
      "timeout": 0,
      "sendEmpty": false,
      "sendGetBody": false,
      "requestDatatype": "JSON",
      "responseDatatype": "JSON",
      "headers": {},
      "responseObjects": [
        {
          "type": "default",
          "key": "",
          "mockFile": ""
        }
      ]
    }
  ]
}