{
  "defaultLandingPages": [
    "string",
    "string",
    "string",
    "string"
  ],
  "definitionInProgress": true,
  "description": "string",
  "help": "string",
  "label": "string",
  "permitAllAtEnd": true,
  "privileges": [
    {
      "actions": [
        "string",
        "string",
        "string",
        "string",
        "string"
      ],
      "contextActions": [
        {
          "action": "string",
          "contextList": [
            "APPLIANCE_OWNER"
          ]
        },
        {
          "action": "string",
          "contextList": [
            "APPLIANCE_OWNER",
            "TEMPLATE_OWNER",
            "TEMPLATE_OWNER",
            "TEMPLATE_OWNER"
          ]
        },
        {
          "action": "string",
          "contextList": [
            "APPLIANCE_OWNER",
            "APPLIANCE_OWNER",
            "APPLIANCE_OWNER",
            "TEMPLATE_OWNER",
            "APPLIANCE_OWNER",
            "APPLIANCE_OWNER",
            "APPLIANCE_OWNER",
            "TEMPLATE_OWNER"
          ]
        },
        {
          "action": "string",
          "contextList": [
            "TEMPLATE_OWNER",
            "TEMPLATE_OWNER",
            "TEMPLATE_OWNER",
            "TEMPLATE_OWNER",
            "APPLIANCE_OWNER",
            "TEMPLATE_OWNER",
            "APPLIANCE_OWNER",
            "TEMPLATE_OWNER",
            "APPLIANCE_OWNER"
          ]
        },
        {
          "action": "string",
          "contextList": [
            "TEMPLATE_OWNER",
            "TEMPLATE_OWNER"
          ]
        },
        {
          "action": "string",
          "contextList": [
            "APPLIANCE_OWNER",
            "APPLIANCE_OWNER"
          ]
        },
        {
          "action": "string",
          "contextList": [
            "APPLIANCE_OWNER",
            "TEMPLATE_OWNER",
            "APPLIANCE_OWNER",
            "APPLIANCE_OWNER",
            "TEMPLATE_OWNER",
            "TEMPLATE_OWNER",
            "TEMPLATE_OWNER"
          ]
        },
        {
          "action": "string",
          "contextList": [
            "APPLIANCE_OWNER",
            "APPLIANCE_OWNER",
            "APPLIANCE_OWNER",
            "TEMPLATE_OWNER",
            "APPLIANCE_OWNER",
            "APPLIANCE_OWNER",
            "APPLIANCE_OWNER",
            "APPLIANCE_OWNER",
            "APPLIANCE_OWNER"
          ]
        }
      ],
      "customRules": [
        {
          "actions": [
            "string",
            "string",
            "string",
            "string",
            "string",
            "string",
            "string",
            "string",
            "string",
            "string"
          ],
          "criterias": [
            {
              "key": "string",
              "values": [
                "string",
                "string"
              ]
            },
            {
              "key": "string",
              "values": [
                "string",
                "string",
                "string",
                "string",
                "string",
                "string",
                "string",
                "string"
              ]
            },
            {
              "key": "string",
              "values": [
                "string",
                "string",
                "string",
                "string",
                "string",
                "string",
                "string",
                "string",
                "string",
                "string"
              ]
            },
            {
              "key": "string",
              "values": [
                "string",
                "string",
                "string",
                "string",
                "string",
                "string"
              ]
            },
            {
              "key": "string",
              "values": [
                "string",
                "string",
                "string",
                "string",
                "string",
                "string"
              ]
            },
            {
              "key": "string",
              "values": [
                "string"
              ]
            }
          ],
          "ruleName": "string"
        },
        {
          "actions": [
            "string",
            "string",
            "string",
            "string"
          ],
          "criterias": [
            {
              "key": "string",
              "values": [
                "string",
                "string",
                "string",
                "string"
              ]
            },
            {
              "key": "string",
              "values": [
                "string",
                "string",
                "string",
                "string",
                "string",
                "string"
              ]
            }
          ],
          "ruleName": "string"
        },
        {
          "actions": [
            "string",
            "string",
            "string",
            "string",
            "string",
            "string"
          ],
          "criterias": [
            {
              "key": "string",
              "values": [
                "string",
                "string",
                "string",
                "string",
                "string",
                "string",
                "string",
                "string",
                "string",
                "string"
              ]
            },
            {
              "key": "string",
              "values": [
                "string",
                "string",
                "string",
                "string",
                "string",
                "string",
                "string",
                "string",
                "string"
              ]
            },
            {
              "key": "string",
              "values": [
                "string",
                "string",
                "string",
                "string",
                "string",
                "string",
                "string"
              ]
            },
            {
              "key": "string",
              "values": [
                "string",
                "string"
              ]
            },
            {
              "key": "string",
              "values": [
                "string",
                "string",
                "string",
                "string",
                "string",
                "string",
                "string"
              ]
            },
            {
              "key": "string",
              "values": [
                "string",
                "string",
                "string",
                "string",
                "string",
                "string",
                "string",
                "string",
                "string"
              ]
            },
            {
              "key": "string",
              "values": [
                "string",
                "string",
                "string",
                "string",
                "string",
                "string",
                "string"
              ]
            }
          ],
          "ruleName": "string"
        },
        {
          "actions": [
            "string",
            "string"
          ],
          "criterias": [
            {
              "key": "string",
              "values": [
                "string",
                "string",
                "string",
                "string",
                "string",
                "string",
                "string",
                "string",
                "string",
                "string"
              ]
            },
            {
              "key": "string",
              "values": [
                "string",
                "string",
                "string"
              ]
            },
            {
              "key": "string",
              "values": [
                "string",
                "string"
              ]
            },
            {
              "key": "string",
              "values": [
                "string",
                "string",
                "string",
                "string",
                "string",
                "string",
                "string"
              ]
            },
            {
              "key": "string",
              "values": [
                "string",
                "string"
              ]
            },
            {
              "key": "string",
              "values": [
                "string",
                "string"
              ]
            }
          ],
          "ruleName": "string"
        },
        {
          "actions": [
            "string",
            "string",
            "string",
            "string",
            "string",
            "string",
            "string"
          ],
          "criterias": [
            {
              "key": "string",
              "values": [
                "string",
                "string"
              ]
            },
            {
              "key": "string",
              "values": [
                "string",
                "string"
              ]
            },
            {
              "key": "string",
              "values": [
                "string",
                "string",
                "string",
                "string",
                "string",
                "string"
              ]
            },
            {
              "key": "string",
              "values": [
                "string",
                "string",
                "string",
                "string",
                "string",
                "string",
                "string",
                "string",
                "string",
                "string"
              ]
            },
            {
              "key": "string",
              "values": [
                "string",
                "string",
                "string",
                "string",
                "string",
                "string"
              ]
            },
            {
              "key": "string",
              "values": [
                "string",
                "string",
                "string",
                "string",
                "string",
                "string",
                "string"
              ]
            },
            {
              "key": "string",
              "values": [
                "string"
              ]
            },
            {
              "key": "string",
              "values": [
                "string"
              ]
            }
          ],
          "ruleName": "string"
        },
        {
          "actions": [
            "string",
            "string",
            "string",
            "string"
          ],
          "criterias": [
            {
              "key": "string",
              "values": [
                "string"
              ]
            },
            {
              "key": "string",
              "values": [
                "string",
                "string",
                "string",
                "string",
                "string",
                "string",
                "string",
                "string",
                "string",
                "string"
              ]
            },
            {
              "key": "string",
              "values": [
                "string",
                "string",
                "string",
                "string",
                "string",
                "string",
                "string",
                "string",
                "string"
              ]
            },
            {
              "key": "string",
              "values": [
                "string",
                "string",
                "string",
                "string",
                "string",
                "string",
                "string",
                "string",
                "string",
                "string"
              ]
            },
            {
              "key": "string",
              "values": [
                "string"
              ]
            },
            {
              "key": "string",
              "values": [
                "string",
                "string",
                "string",
                "string",
                "string",
                "string",
                "string",
                "string",
                "string",
                "string"
              ]
            },
            {
              "key": "string",
              "values": [
                "string",
                "string",
                "string",
                "string",
                "string",
                "string",
                "string",
                "string",
                "string"
              ]
            },
            {
              "key": "string",
              "values": [
                "string",
                "string",
                "string",
                "string",
                "string",
                "string",
                "string"
              ]
            },
            {
              "key": "string",
              "values": [
                "string",
                "string",
                "string",
                "string",
                "string",
                "string",
                "string"
              ]
            },
            {
              "key": "string",
              "values": [
                "string",
                "string",
                "string",
                "string",
                "string"
              ]
            }
          ],
          "ruleName": "string"
        },
        {
          "actions": [
            "string",
            "string",
            "string",
            "string",
            "string",
            "string"
          ],
          "criterias": [
            {
              "key": "string",
              "values": [
                "string",
                "string",
                "string"
              ]
            },
            {
              "key": "string",
              "values": [
                "string",
                "string",
                "string",
                "string",
                "string",
                "string",
                "string"
              ]
            },
            {
              "key": "string",
              "values": [
                "string",
                "string",
                "string",
                "string",
                "string",
                "string"
              ]
            },
            {
              "key": "string",
              "values": [
                "string",
                "string",
                "string",
                "string",
                "string",
                "string",
                "string"
              ]
            },
            {
              "key": "string",
              "values": [
                "string",
                "string",
                "string",
                "string",
                "string",
                "string",
                "string",
                "string",
                "string",
                "string"
              ]
            }
          ],
          "ruleName": "string"
        },
        {
          "actions": [
            "string",
            "string",
            "string"
          ],
          "criterias": [
            {
              "key": "string",
              "values": [
                "string",
                "string",
                "string",
                "string",
                "string"
              ]
            },
            {
              "key": "string",
              "values": [
                "string",
                "string"
              ]
            },
            {
              "key": "string",
              "values": [
                "string",
                "string",
                "string",
                "string",
                "string",
                "string",
                "string",
                "string"
              ]
            },
            {
              "key": "string",
              "values": [
                "string",
                "string",
                "string",
                "string",
                "string",
                "string",
                "string"
              ]
            }
          ],
          "ruleName": "string"
        },
        {
          "actions": [
            "string",
            "string",
            "string",
            "string",
            "string",
            "string",
            "string",
            "string",
            "string",
            "string"
          ],
          "criterias": [
            {
              "key": "string",
              "values": [
                "string",
                "string"
              ]
            },
            {
              "key": "string",
              "values": [
                "string"
              ]
            }
          ],
          "ruleName": "string"
        }
      ],
      "name": "string"
    },
    {
      "actions": [
        "string",
        "string",
        "string",
        "string",
        "string",
        "string",
        "string"
      ],
      "contextActions": [
        {
          "action": "string",
          "contextList": [
            "APPLIANCE_OWNER",
            "APPLIANCE_OWNER"
          ]
        },
        {
          "action": "string",
          "contextList": [
            "APPLIANCE_OWNER",
            "APPLIANCE_OWNER",
            "TEMPLATE_OWNER",
            "TEMPLATE_OWNER",
            "TEMPLATE_OWNER",
            "TEMPLATE_OWNER"
          ]
        },
        {
          "action": "string",
          "contextList": [
            "TEMPLATE_OWNER",
            "APPLIANCE_OWNER",
            "APPLIANCE_OWNER",
            "APPLIANCE_OWNER",
            "TEMPLATE_OWNER"
          ]
        },
        {
          "action": "string",
          "contextList": [
            "APPLIANCE_OWNER",
            "TEMPLATE_OWNER",
            "APPLIANCE_OWNER",
            "TEMPLATE_OWNER",
            "TEMPLATE_OWNER",
            "TEMPLATE_OWNER",
            "APPLIANCE_OWNER"
          ]
        },
        {
          "action": "string",
          "contextList": [
            "TEMPLATE_OWNER",
            "TEMPLATE_OWNER",
            "APPLIANCE_OWNER",
            "APPLIANCE_OWNER",
            "TEMPLATE_OWNER"
          ]
        },
        {
          "action": "string",
          "contextList": [
            "TEMPLATE_OWNER",
            "TEMPLATE_OWNER",
            "APPLIANCE_OWNER",
            "TEMPLATE_OWNER",
            "TEMPLATE_OWNER",
            "APPLIANCE_OWNER",
            "TEMPLATE_OWNER"
          ]
        },
        {
          "action": "string",
          "contextList": [
            "TEMPLATE_OWNER",
            "TEMPLATE_OWNER"
          ]
        },
        {
          "action": "string",
          "contextList": [
            "APPLIANCE_OWNER",
            "TEMPLATE_OWNER",
            "TEMPLATE_OWNER",
            "TEMPLATE_OWNER",
            "TEMPLATE_OWNER"
          ]
        }
      ],
      "customRules": [
        {
          "actions": [
            "string"
          ],
          "criterias": [
            {
              "key": "string",
              "values": [
                "string",
                "string",
                "string",
                "string",
                "string",
                "string"
              ]
            }
          ],
          "ruleName": "string"
        },
        {
          "actions": [
            "string",
            "string",
            "string",
            "string",
            "string",
            "string"
          ],
          "criterias": [
            {
              "key": "string",
              "values": [
                "string"
              ]
            },
            {
              "key": "string",
              "values": [
                "string",
                "string",
                "string",
                "string",
                "string",
                "string",
                "string",
                "string",
                "string"
              ]
            },
            {
              "key": "string",
              "values": [
                "string"
              ]
            },
            {
              "key": "string",
              "values": [
                "string",
                "string",
                "string"
              ]
            },
            {
              "key": "string",
              "values": [
                "string",
                "string",
                "string",
                "string",
                "string",
                "string",
                "string",
                "string",
                "string",
                "string"
              ]
            },
            {
              "key": "string",
              "values": [
                "string",
                "string",
                "string",
                "string",
                "string"
              ]
            },
            {
              "key": "string",
              "values": [
                "string",
                "string",
                "string",
                "string"
              ]
            },
            {
              "key": "string",
              "values": [
                "string",
                "string",
                "string",
                "string",
                "string",
                "string",
                "string",
                "string"
              ]
            },
            {
              "key": "string",
              "values": [
                "string",
                "string"
              ]
            },
            {
              "key": "string",
              "values": [
                "string",
                "string"
              ]
            }
          ],
          "ruleName": "string"
        },
        {
          "actions": [
            "string",
            "string",
            "string",
            "string",
            "string"
          ],
          "criterias": [
            {
              "key": "string",
              "values": [
                "string",
                "string",
                "string",
                "string",
                "string",
                "string",
                "string"
              ]
            },
            {
              "key": "string",
              "values": [
                "string",
                "string",
                "string"
              ]
            }
          ],
          "ruleName": "string"
        },
        {
          "actions": [
            "string",
            "string",
            "string",
            "string",
            "string",
            "string",
            "string",
            "string",
            "string"
          ],
          "criterias": [
            {
              "key": "string",
              "values": [
                "string",
                "string",
                "string",
                "string",
                "string",
                "string",
                "string",
                "string",
                "string"
              ]
            },
            {
              "key": "string",
              "values": [
                "string",
                "string",
                "string"
              ]
            },
            {
              "key": "string",
              "values": [
                "string",
                "string"
              ]
            },
            {
              "key": "string",
              "values": [
                "string"
              ]
            },
            {
              "key": "string",
              "values": [
                "string",
                "string",
                "string",
                "string",
                "string"
              ]
            },
            {
              "key": "string",
              "values": [
                "string"
              ]
            },
            {
              "key": "string",
              "values": [
                "string",
                "string",
                "string"
              ]
            },
            {
              "key": "string",
              "values": [
                "string",
                "string",
                "string"
              ]
            },
            {
              "key": "string",
              "values": [
                "string",
                "string",
                "string",
                "string",
                "string"
              ]
            }
          ],
          "ruleName": "string"
        },
        {
          "actions": [
            "string",
            "string",
            "string",
            "string",
            "string",
            "string",
            "string",
            "string",
            "string"
          ],
          "criterias": [
            {
              "key": "string",
              "values": [
                "string",
                "string",
                "string"
              ]
            },
            {
              "key": "string",
              "values": [
                "string",
                "string",
                "string",
                "string",
                "string",
                "string",
                "string",
                "string",
                "string"
              ]
            },
            {
              "key": "string",
              "values": [
                "string",
                "string",
                "string",
                "string",
                "string",
                "string",
                "string",
                "string"
              ]
            }
          ],
          "ruleName": "string"
        },
        {
          "actions": [
            "string",
            "string",
            "string"
          ],
          "criterias": [
            {
              "key": "string",
              "values": [
                "string",
                "string",
                "string"
              ]
            },
            {
              "key": "string",
              "values": [
                "string",
                "string",
                "string",
                "string",
                "string",
                "string",
                "string",
                "string",
                "string"
              ]
            },
            {
              "key": "string",
              "values": [
                "string",
                "string"
              ]
            },
            {
              "key": "string",
              "values": [
                "string",
                "string",
                "string",
                "string",
                "string"
              ]
            },
            {
              "key": "string",
              "values": [
                "string",
                "string",
                "string",
                "string",
                "string",
                "string",
                "string"
              ]
            }
          ],
          "ruleName": "string"
        },
        {
          "actions": [
            "string"
          ],
          "criterias": [
            {
              "key": "string",
              "values": [
                "string",
                "string",
                "string"
              ]
            },
            {
              "key": "string",
              "values": [
                "string",
                "string",
                "string",
                "string",
                "string"
              ]
            },
            {
              "key": "string",
              "values": [
                "string",
                "string",
                "string",
                "string",
                "string",
                "string",
                "string",
                "string"
              ]
            },
            {
              "key": "string",
              "values": [
                "string",
                "string",
                "string",
                "string",
                "string",
                "string",
                "string",
                "string",
                "string",
                "string"
              ]
            }
          ],
          "ruleName": "string"
        },
        {
          "actions": [
            "string",
            "string",
            "string"
          ],
          "criterias": [
            {
              "key": "string",
              "values": [
                "string",
                "string"
              ]
            },
            {
              "key": "string",
              "values": [
                "string",
                "string",
                "string",
                "string",
                "string"
              ]
            },
            {
              "key": "string",
              "values": [
                "string",
                "string",
                "string",
                "string"
              ]
            },
            {
              "key": "string",
              "values": [
                "string",
                "string"
              ]
            },
            {
              "key": "string",
              "values": [
                "string",
                "string",
                "string",
                "string",
                "string",
                "string",
                "string",
                "string",
                "string",
                "string"
              ]
            },
            {
              "key": "string",
              "values": [
                "string",
                "string",
                "string",
                "string",
                "string",
                "string"
              ]
            },
            {
              "key": "string",
              "values": [
                "string",
                "string",
                "string",
                "string",
                "string",
                "string",
                "string",
                "string",
                "string"
              ]
            },
            {
              "key": "string",
              "values": [
                "string"
              ]
            },
            {
              "key": "string",
              "values": [
                "string",
                "string",
                "string",
                "string",
                "string",
                "string",
                "string",
                "string",
                "string"
              ]
            },
            {
              "key": "string",
              "values": [
                "string",
                "string",
                "string",
                "string",
                "string"
              ]
            }
          ],
          "ruleName": "string"
        },
        {
          "actions": [
            "string",
            "string",
            "string",
            "string",
            "string",
            "string",
            "string",
            "string",
            "string",
            "string"
          ],
          "criterias": [
            {
              "key": "string",
              "values": [
                "string",
                "string",
                "string",
                "string",
                "string",
                "string",
                "string",
                "string",
                "string",
                "string"
              ]
            },
            {
              "key": "string",
              "values": [
                "string",
                "string",
                "string",
                "string",
                "string",
                "string",
                "string",
                "string",
                "string"
              ]
            },
            {
              "key": "string",
              "values": [
                "string",
                "string"
              ]
            },
            {
              "key": "string",
              "values": [
                "string",
                "string"
              ]
            },
            {
              "key": "string",
              "values": [
                "string",
                "string",
                "string",
                "string",
                "string",
                "string",
                "string",
                "string",
                "string",
                "string"
              ]
            },
            {
              "key": "string",
              "values": [
                "string",
                "string",
                "string",
                "string",
                "string"
              ]
            },
            {
              "key": "string",
              "values": [
                "string",
                "string",
                "string"
              ]
            }
          ],
          "ruleName": "string"
        },
        {
          "actions": [
            "string",
            "string"
          ],
          "criterias": [
            {
              "key": "string",
              "values": [
                "string",
                "string",
                "string"
              ]
            }
          ],
          "ruleName": "string"
        }
      ],
      "name": "string"
    },
    {
      "actions": [
        "string"
      ],
      "contextActions": [
        {
          "action": "string",
          "contextList": [
            "APPLIANCE_OWNER",
            "TEMPLATE_OWNER",
            "APPLIANCE_OWNER",
            "TEMPLATE_OWNER",
            "TEMPLATE_OWNER",
            "TEMPLATE_OWNER",
            "APPLIANCE_OWNER",
            "TEMPLATE_OWNER"
          ]
        },
        {
          "action": "string",
          "contextList": [
            "TEMPLATE_OWNER",
            "TEMPLATE_OWNER",
            "APPLIANCE_OWNER"
          ]
        },
        {
          "action": "string",
          "contextList": [
            "APPLIANCE_OWNER",
            "TEMPLATE_OWNER",
            "APPLIANCE_OWNER",
            "APPLIANCE_OWNER",
            "APPLIANCE_OWNER",
            "TEMPLATE_OWNER",
            "TEMPLATE_OWNER",
            "APPLIANCE_OWNER",
            "TEMPLATE_OWNER",
            "APPLIANCE_OWNER"
          ]
        },
        {
          "action": "string",
          "contextList": [
            "APPLIANCE_OWNER",
            "TEMPLATE_OWNER",
            "APPLIANCE_OWNER",
            "TEMPLATE_OWNER",
            "APPLIANCE_OWNER",
            "APPLIANCE_OWNER",
            "APPLIANCE_OWNER"
          ]
        }
      ],
      "customRules": [
        {
          "actions": [
            "string"
          ],
          "criterias": [
            {
              "key": "string",
              "values": [
                "string",
                "string",
                "string",
                "string",
                "string",
                "string"
              ]
            },
            {
              "key": "string",
              "values": [
                "string",
                "string",
                "string",
                "string"
              ]
            },
            {
              "key": "string",
              "values": [
                "string"
              ]
            },
            {
              "key": "string",
              "values": [
                "string",
                "string",
                "string",
                "string",
                "string",
                "string"
              ]
            },
            {
              "key": "string",
              "values": [
                "string",
                "string",
                "string",
                "string",
                "string",
                "string",
                "string",
                "string"
              ]
            },
            {
              "key": "string",
              "values": [
                "string",
                "string",
                "string",
                "string",
                "string",
                "string",
                "string",
                "string"
              ]
            }
          ],
          "ruleName": "string"
        },
        {
          "actions": [
            "string",
            "string",
            "string"
          ],
          "criterias": [
            {
              "key": "string",
              "values": [
                "string",
                "string"
              ]
            },
            {
              "key": "string",
              "values": [
                "string",
                "string",
                "string",
                "string",
                "string",
                "string",
                "string"
              ]
            },
            {
              "key": "string",
              "values": [
                "string",
                "string",
                "string",
                "string",
                "string",
                "string"
              ]
            },
            {
              "key": "string",
              "values": [
                "string",
                "string",
                "string",
                "string",
                "string"
              ]
            }
          ],
          "ruleName": "string"
        },
        {
          "actions": [
            "string",
            "string",
            "string",
            "string",
            "string",
            "string",
            "string",
            "string"
          ],
          "criterias": [
            {
              "key": "string",
              "values": [
                "string",
                "string",
                "string",
                "string"
              ]
            },
            {
              "key": "string",
              "values": [
                "string",
                "string",
                "string",
                "string"
              ]
            },
            {
              "key": "string",
              "values": [
                "string",
                "string",
                "string",
                "string",
                "string",
                "string",
                "string"
              ]
            },
            {
              "key": "string",
              "values": [
                "string",
                "string",
                "string",
                "string",
                "string",
                "string",
                "string"
              ]
            },
            {
              "key": "string",
              "values": [
                "string",
                "string"
              ]
            },
            {
              "key": "string",
              "values": [
                "string"
              ]
            },
            {
              "key": "string",
              "values": [
                "string"
              ]
            }
          ],
          "ruleName": "string"
        }
      ],
      "name": "string"
    },
    {
      "actions": [
        "string",
        "string",
        "string",
        "string"
      ],
      "contextActions": [
        {
          "action": "string",
          "contextList": [
            "APPLIANCE_OWNER",
            "APPLIANCE_OWNER",
            "APPLIANCE_OWNER",
            "APPLIANCE_OWNER",
            "TEMPLATE_OWNER",
            "APPLIANCE_OWNER",
            "APPLIANCE_OWNER",
            "APPLIANCE_OWNER"
          ]
        },
        {
          "action": "string",
          "contextList": [
            "APPLIANCE_OWNER",
            "APPLIANCE_OWNER",
            "TEMPLATE_OWNER",
            "APPLIANCE_OWNER",
            "TEMPLATE_OWNER"
          ]
        },
        {
          "action": "string",
          "contextList": [
            "TEMPLATE_OWNER",
            "APPLIANCE_OWNER",
            "TEMPLATE_OWNER",
            "APPLIANCE_OWNER",
            "TEMPLATE_OWNER",
            "TEMPLATE_OWNER",
            "TEMPLATE_OWNER",
            "APPLIANCE_OWNER"
          ]
        },
        {
          "action": "string",
          "contextList": [
            "APPLIANCE_OWNER"
          ]
        },
        {
          "action": "string",
          "contextList": [
            "APPLIANCE_OWNER",
            "TEMPLATE_OWNER",
            "TEMPLATE_OWNER",
            "TEMPLATE_OWNER",
            "TEMPLATE_OWNER",
            "TEMPLATE_OWNER"
          ]
        }
      ],
      "customRules": [
        {
          "actions": [
            "string",
            "string",
            "string",
            "string",
            "string",
            "string",
            "string",
            "string",
            "string"
          ],
          "criterias": [
            {
              "key": "string",
              "values": [
                "string"
              ]
            },
            {
              "key": "string",
              "values": [
                "string",
                "string"
              ]
            },
            {
              "key": "string",
              "values": [
                "string",
                "string",
                "string",
                "string",
                "string",
                "string",
                "string",
                "string"
              ]
            },
            {
              "key": "string",
              "values": [
                "string",
                "string",
                "string",
                "string",
                "string",
                "string",
                "string",
                "string"
              ]
            },
            {
              "key": "string",
              "values": [
                "string",
                "string",
                "string",
                "string",
                "string",
                "string",
                "string",
                "string"
              ]
            },
            {
              "key": "string",
              "values": [
                "string",
                "string"
              ]
            },
            {
              "key": "string",
              "values": [
                "string",
                "string",
                "string",
                "string",
                "string",
                "string",
                "string",
                "string",
                "string"
              ]
            }
          ],
          "ruleName": "string"
        },
        {
          "actions": [
            "string",
            "string",
            "string",
            "string",
            "string",
            "string",
            "string",
            "string"
          ],
          "criterias": [
            {
              "key": "string",
              "values": [
                "string",
                "string",
                "string",
                "string",
                "string",
                "string",
                "string",
                "string"
              ]
            },
            {
              "key": "string",
              "values": [
                "string",
                "string"
              ]
            },
            {
              "key": "string",
              "values": [
                "string",
                "string",
                "string",
                "string",
                "string",
                "string",
                "string",
                "string"
              ]
            },
            {
              "key": "string",
              "values": [
                "string",
                "string",
                "string",
                "string",
                "string",
                "string",
                "string",
                "string"
              ]
            },
            {
              "key": "string",
              "values": [
                "string"
              ]
            },
            {
              "key": "string",
              "values": [
                "string",
                "string"
              ]
            },
            {
              "key": "string",
              "values": [
                "string",
                "string",
                "string",
                "string",
                "string",
                "string",
                "string"
              ]
            }
          ],
          "ruleName": "string"
        },
        {
          "actions": [
            "string"
          ],
          "criterias": [
            {
              "key": "string",
              "values": [
                "string",
                "string"
              ]
            },
            {
              "key": "string",
              "values": [
                "string",
                "string",
                "string",
                "string",
                "string",
                "string",
                "string",
                "string"
              ]
            },
            {
              "key": "string",
              "values": [
                "string",
                "string"
              ]
            },
            {
              "key": "string",
              "values": [
                "string",
                "string",
                "string",
                "string",
                "string"
              ]
            },
            {
              "key": "string",
              "values": [
                "string",
                "string",
                "string",
                "string",
                "string"
              ]
            },
            {
              "key": "string",
              "values": [
                "string",
                "string",
                "string",
                "string",
                "string"
              ]
            },
            {
              "key": "string",
              "values": [
                "string",
                "string",
                "string",
                "string",
                "string",
                "string"
              ]
            }
          ],
          "ruleName": "string"
        },
        {
          "actions": [
            "string",
            "string",
            "string",
            "string",
            "string",
            "string"
          ],
          "criterias": [
            {
              "key": "string",
              "values": [
                "string",
                "string",
                "string",
                "string",
                "string",
                "string",
                "string",
                "string",
                "string",
                "string"
              ]
            }
          ],
          "ruleName": "string"
        },
        {
          "actions": [
            "string",
            "string",
            "string",
            "string"
          ],
          "criterias": [
            {
              "key": "string",
              "values": [
                "string"
              ]
            },
            {
              "key": "string",
              "values": [
                "string",
                "string",
                "string",
                "string",
                "string",
                "string",
                "string"
              ]
            },
            {
              "key": "string",
              "values": [
                "string",
                "string",
                "string",
                "string",
                "string",
                "string"
              ]
            },
            {
              "key": "string",
              "values": [
                "string",
                "string"
              ]
            },
            {
              "key": "string",
              "values": [
                "string",
                "string",
                "string",
                "string",
                "string",
                "string"
              ]
            }
          ],
          "ruleName": "string"
        },
        {
          "actions": [
            "string",
            "string"
          ],
          "criterias": [
            {
              "key": "string",
              "values": [
                "string",
                "string",
                "string",
                "string",
                "string",
                "string",
                "string"
              ]
            }
          ],
          "ruleName": "string"
        },
        {
          "actions": [
            "string",
            "string",
            "string",
            "string",
            "string",
            "string",
            "string",
            "string",
            "string"
          ],
          "criterias": [
            {
              "key": "string",
              "values": [
                "string",
                "string",
                "string",
                "string",
                "string",
                "string",
                "string",
                "string"
              ]
            },
            {
              "key": "string",
              "values": [
                "string",
                "string",
                "string",
                "string",
                "string",
                "string"
              ]
            },
            {
              "key": "string",
              "values": [
                "string",
                "string",
                "string",
                "string",
                "string",
                "string",
                "string",
                "string",
                "string"
              ]
            },
            {
              "key": "string",
              "values": [
                "string"
              ]
            },
            {
              "key": "string",
              "values": [
                "string",
                "string",
                "string",
                "string",
                "string",
                "string",
                "string"
              ]
            },
            {
              "key": "string",
              "values": [
                "string",
                "string",
                "string",
                "string",
                "string",
                "string",
                "string",
                "string"
              ]
            },
            {
              "key": "string",
              "values": [
                "string",
                "string",
                "string",
                "string",
                "string",
                "string",
                "string",
                "string",
                "string",
                "string"
              ]
            }
          ],
          "ruleName": "string"
        },
        {
          "actions": [
            "string",
            "string",
            "string",
            "string",
            "string",
            "string",
            "string"
          ],
          "criterias": [
            {
              "key": "string",
              "values": [
                "string",
                "string"
              ]
            },
            {
              "key": "string",
              "values": [
                "string",
                "string",
                "string",
                "string",
                "string",
                "string"
              ]
            },
            {
              "key": "string",
              "values": [
                "string",
                "string",
                "string",
                "string",
                "string"
              ]
            },
            {
              "key": "string",
              "values": [
                "string",
                "string",
                "string",
                "string",
                "string",
                "string",
                "string"
              ]
            },
            {
              "key": "string",
              "values": [
                "string",
                "string",
                "string",
                "string",
                "string",
                "string",
                "string",
                "string",
                "string",
                "string"
              ]
            },
            {
              "key": "string",
              "values": [
                "string",
                "string",
                "string",
                "string",
                "string",
                "string"
              ]
            },
            {
              "key": "string",
              "values": [
                "string",
                "string",
                "string",
                "string",
                "string",
                "string",
                "string",
                "string",
                "string",
                "string"
              ]
            },
            {
              "key": "string",
              "values": [
                "string",
                "string",
                "string",
                "string",
                "string",
                "string",
                "string",
                "string",
                "string"
              ]
            }
          ],
          "ruleName": "string"
        },
        {
          "actions": [
            "string",
            "string",
            "string",
            "string",
            "string"
          ],
          "criterias": [
            {
              "key": "string",
              "values": [
                "string",
                "string",
                "string"
              ]
            },
            {
              "key": "string",
              "values": [
                "string",
                "string",
                "string"
              ]
            },
            {
              "key": "string",
              "values": [
                "string"
              ]
            },
            {
              "key": "string",
              "values": [
                "string",
                "string"
              ]
            },
            {
              "key": "string",
              "values": [
                "string",
                "string",
                "string",
                "string",
                "string",
                "string"
              ]
            },
            {
              "key": "string",
              "values": [
                "string",
                "string",
                "string",
                "string",
                "string",
                "string",
                "string",
                "string"
              ]
            },
            {
              "key": "string",
              "values": [
                "string",
                "string",
                "string",
                "string"
              ]
            },
            {
              "key": "string",
              "values": [
                "string",
                "string"
              ]
            }
          ],
          "ruleName": "string"
        }
      ],
      "name": "string"
    },
    {
      "actions": [
        "string",
        "string",
        "string"
      ],
      "contextActions": [
        {
          "action": "string",
          "contextList": [
            "APPLIANCE_OWNER",
            "APPLIANCE_OWNER",
            "APPLIANCE_OWNER",
            "APPLIANCE_OWNER",
            "APPLIANCE_OWNER"
          ]
        }
      ],
      "customRules": [
        {
          "actions": [
            "string",
            "string"
          ],
          "criterias": [
            {
              "key": "string",
              "values": [
                "string",
                "string",
                "string",
                "string",
                "string"
              ]
            },
            {
              "key": "string",
              "values": [
                "string",
                "string",
                "string",
                "string"
              ]
            },
            {
              "key": "string",
              "values": [
                "string"
              ]
            },
            {
              "key": "string",
              "values": [
                "string",
                "string",
                "string",
                "string",
                "string",
                "string"
              ]
            },
            {
              "key": "string",
              "values": [
                "string",
                "string",
                "string",
                "string",
                "string",
                "string"
              ]
            },
            {
              "key": "string",
              "values": [
                "string",
                "string",
                "string",
                "string",
                "string",
                "string",
                "string"
              ]
            },
            {
              "key": "string",
              "values": [
                "string",
                "string",
                "string",
                "string",
                "string",
                "string",
                "string",
                "string",
                "string",
                "string"
              ]
            },
            {
              "key": "string",
              "values": [
                "string",
                "string",
                "string",
                "string",
                "string",
                "string",
                "string",
                "string",
                "string"
              ]
            }
          ],
          "ruleName": "string"
        }
      ],
      "name": "string"
    },
    {
      "actions": [
        "string",
        "string",
        "string",
        "string",
        "string",
        "string",
        "string",
        "string"
      ],
      "contextActions": [
        {
          "action": "string",
          "contextList": [
            "APPLIANCE_OWNER",
            "TEMPLATE_OWNER",
            "TEMPLATE_OWNER",
            "APPLIANCE_OWNER",
            "TEMPLATE_OWNER"
          ]
        },
        {
          "action": "string",
          "contextList": [
            "TEMPLATE_OWNER",
            "APPLIANCE_OWNER",
            "APPLIANCE_OWNER",
            "TEMPLATE_OWNER",
            "APPLIANCE_OWNER",
            "TEMPLATE_OWNER",
            "TEMPLATE_OWNER",
            "TEMPLATE_OWNER",
            "APPLIANCE_OWNER"
          ]
        },
        {
          "action": "string",
          "contextList": [
            "APPLIANCE_OWNER"
          ]
        },
        {
          "action": "string",
          "contextList": [
            "TEMPLATE_OWNER",
            "TEMPLATE_OWNER",
            "APPLIANCE_OWNER",
            "APPLIANCE_OWNER",
            "APPLIANCE_OWNER",
            "TEMPLATE_OWNER",
            "APPLIANCE_OWNER"
          ]
        },
        {
          "action": "string",
          "contextList": [
            "APPLIANCE_OWNER"
          ]
        },
        {
          "action": "string",
          "contextList": [
            "TEMPLATE_OWNER",
            "APPLIANCE_OWNER",
            "APPLIANCE_OWNER",
            "APPLIANCE_OWNER",
            "TEMPLATE_OWNER",
            "TEMPLATE_OWNER",
            "TEMPLATE_OWNER",
            "TEMPLATE_OWNER"
          ]
        },
        {
          "action": "string",
          "contextList": [
            "TEMPLATE_OWNER",
            "APPLIANCE_OWNER",
            "TEMPLATE_OWNER",
            "APPLIANCE_OWNER",
            "TEMPLATE_OWNER",
            "APPLIANCE_OWNER",
            "APPLIANCE_OWNER"
          ]
        }
      ],
      "customRules": [
        {
          "actions": [
            "string",
            "string",
            "string",
            "string",
            "string",
            "string",
            "string"
          ],
          "criterias": [
            {
              "key": "string",
              "values": [
                "string",
                "string",
                "string",
                "string"
              ]
            },
            {
              "key": "string",
              "values": [
                "string",
                "string",
                "string",
                "string",
                "string",
                "string",
                "string"
              ]
            },
            {
              "key": "string",
              "values": [
                "string",
                "string",
                "string",
                "string",
                "string",
                "string",
                "string",
                "string",
                "string"
              ]
            },
            {
              "key": "string",
              "values": [
                "string",
                "string",
                "string"
              ]
            },
            {
              "key": "string",
              "values": [
                "string",
                "string",
                "string",
                "string",
                "string",
                "string",
                "string",
                "string",
                "string"
              ]
            },
            {
              "key": "string",
              "values": [
                "string",
                "string",
                "string",
                "string",
                "string",
                "string",
                "string",
                "string"
              ]
            }
          ],
          "ruleName": "string"
        },
        {
          "actions": [
            "string",
            "string"
          ],
          "criterias": [
            {
              "key": "string",
              "values": [
                "string",
                "string",
                "string",
                "string",
                "string",
                "string",
                "string",
                "string"
              ]
            },
            {
              "key": "string",
              "values": [
                "string",
                "string",
                "string",
                "string",
                "string",
                "string",
                "string",
                "string",
                "string"
              ]
            },
            {
              "key": "string",
              "values": [
                "string",
                "string"
              ]
            },
            {
              "key": "string",
              "values": [
                "string",
                "string",
                "string",
                "string",
                "string",
                "string",
                "string",
                "string",
                "string",
                "string"
              ]
            },
            {
              "key": "string",
              "values": [
                "string"
              ]
            },
            {
              "key": "string",
              "values": [
                "string",
                "string",
                "string",
                "string",
                "string",
                "string",
                "string"
              ]
            },
            {
              "key": "string",
              "values": [
                "string"
              ]
            }
          ],
          "ruleName": "string"
        }
      ],
      "name": "string"
    },
    {
      "actions": [
        "string",
        "string",
        "string"
      ],
      "contextActions": [
        {
          "action": "string",
          "contextList": [
            "APPLIANCE_OWNER"
          ]
        },
        {
          "action": "string",
          "contextList": [
            "TEMPLATE_OWNER",
            "TEMPLATE_OWNER",
            "TEMPLATE_OWNER",
            "APPLIANCE_OWNER",
            "TEMPLATE_OWNER"
          ]
        },
        {
          "action": "string",
          "contextList": [
            "APPLIANCE_OWNER",
            "APPLIANCE_OWNER",
            "APPLIANCE_OWNER",
            "APPLIANCE_OWNER"
          ]
        },
        {
          "action": "string",
          "contextList": [
            "APPLIANCE_OWNER",
            "TEMPLATE_OWNER",
            "TEMPLATE_OWNER",
            "APPLIANCE_OWNER",
            "TEMPLATE_OWNER",
            "TEMPLATE_OWNER",
            "TEMPLATE_OWNER",
            "APPLIANCE_OWNER",
            "TEMPLATE_OWNER",
            "APPLIANCE_OWNER"
          ]
        },
        {
          "action": "string",
          "contextList": [
            "APPLIANCE_OWNER",
            "TEMPLATE_OWNER",
            "TEMPLATE_OWNER",
            "TEMPLATE_OWNER",
            "APPLIANCE_OWNER",
            "TEMPLATE_OWNER",
            "APPLIANCE_OWNER"
          ]
        },
        {
          "action": "string",
          "contextList": [
            "TEMPLATE_OWNER",
            "TEMPLATE_OWNER",
            "APPLIANCE_OWNER",
            "APPLIANCE_OWNER",
            "TEMPLATE_OWNER",
            "TEMPLATE_OWNER",
            "TEMPLATE_OWNER",
            "TEMPLATE_OWNER",
            "TEMPLATE_OWNER"
          ]
        },
        {
          "action": "string",
          "contextList": [
            "APPLIANCE_OWNER",
            "APPLIANCE_OWNER",
            "APPLIANCE_OWNER",
            "APPLIANCE_OWNER",
            "APPLIANCE_OWNER",
            "APPLIANCE_OWNER"
          ]
        },
        {
          "action": "string",
          "contextList": [
            "APPLIANCE_OWNER"
          ]
        },
        {
          "action": "string",
          "contextList": [
            "TEMPLATE_OWNER",
            "APPLIANCE_OWNER",
            "APPLIANCE_OWNER"
          ]
        },
        {
          "action": "string",
          "contextList": [
            "APPLIANCE_OWNER",
            "TEMPLATE_OWNER",
            "TEMPLATE_OWNER",
            "APPLIANCE_OWNER",
            "APPLIANCE_OWNER",
            "TEMPLATE_OWNER"
          ]
        }
      ],
      "customRules": [
        {
          "actions": [
            "string",
            "string",
            "string",
            "string",
            "string",
            "string",
            "string",
            "string",
            "string",
            "string"
          ],
          "criterias": [
            {
              "key": "string",
              "values": [
                "string",
                "string",
                "string",
                "string",
                "string",
                "string",
                "string",
                "string"
              ]
            },
            {
              "key": "string",
              "values": [
                "string",
                "string",
                "string"
              ]
            },
            {
              "key": "string",
              "values": [
                "string"
              ]
            },
            {
              "key": "string",
              "values": [
                "string"
              ]
            },
            {
              "key": "string",
              "values": [
                "string",
                "string",
                "string",
                "string",
                "string",
                "string",
                "string",
                "string",
                "string"
              ]
            },
            {
              "key": "string",
              "values": [
                "string",
                "string",
                "string",
                "string",
                "string",
                "string",
                "string",
                "string"
              ]
            }
          ],
          "ruleName": "string"
        },
        {
          "actions": [
            "string"
          ],
          "criterias": [
            {
              "key": "string",
              "values": [
                "string",
                "string",
                "string",
                "string",
                "string"
              ]
            },
            {
              "key": "string",
              "values": [
                "string",
                "string",
                "string",
                "string",
                "string",
                "string",
                "string",
                "string"
              ]
            },
            {
              "key": "string",
              "values": [
                "string",
                "string",
                "string",
                "string",
                "string",
                "string"
              ]
            },
            {
              "key": "string",
              "values": [
                "string",
                "string",
                "string"
              ]
            },
            {
              "key": "string",
              "values": [
                "string"
              ]
            }
          ],
          "ruleName": "string"
        },
        {
          "actions": [
            "string",
            "string",
            "string",
            "string"
          ],
          "criterias": [
            {
              "key": "string",
              "values": [
                "string",
                "string",
                "string",
                "string",
                "string",
                "string",
                "string"
              ]
            },
            {
              "key": "string",
              "values": [
                "string",
                "string",
                "string",
                "string",
                "string",
                "string",
                "string",
                "string",
                "string",
                "string"
              ]
            },
            {
              "key": "string",
              "values": [
                "string"
              ]
            },
            {
              "key": "string",
              "values": [
                "string",
                "string",
                "string",
                "string",
                "string",
                "string",
                "string"
              ]
            }
          ],
          "ruleName": "string"
        },
        {
          "actions": [
            "string",
            "string",
            "string",
            "string",
            "string",
            "string"
          ],
          "criterias": [
            {
              "key": "string",
              "values": [
                "string",
                "string",
                "string"
              ]
            },
            {
              "key": "string",
              "values": [
                "string",
                "string",
                "string",
                "string",
                "string"
              ]
            }
          ],
          "ruleName": "string"
        },
        {
          "actions": [
            "string",
            "string",
            "string",
            "string",
            "string",
            "string",
            "string",
            "string"
          ],
          "criterias": [
            {
              "key": "string",
              "values": [
                "string",
                "string",
                "string",
                "string",
                "string",
                "string"
              ]
            },
            {
              "key": "string",
              "values": [
                "string",
                "string",
                "string"
              ]
            },
            {
              "key": "string",
              "values": [
                "string",
                "string"
              ]
            },
            {
              "key": "string",
              "values": [
                "string",
                "string",
                "string",
                "string",
                "string",
                "string",
                "string",
                "string",
                "string"
              ]
            },
            {
              "key": "string",
              "values": [
                "string",
                "string"
              ]
            },
            {
              "key": "string",
              "values": [
                "string",
                "string",
                "string",
                "string",
                "string",
                "string",
                "string",
                "string",
                "string",
                "string"
              ]
            },
            {
              "key": "string",
              "values": [
                "string",
                "string",
                "string",
                "string",
                "string",
                "string",
                "string"
              ]
            },
            {
              "key": "string",
              "values": [
                "string",
                "string",
                "string",
                "string",
                "string",
                "string",
                "string",
                "string",
                "string",
                "string"
              ]
            }
          ],
          "ruleName": "string"
        },
        {
          "actions": [
            "string",
            "string",
            "string",
            "string",
            "string"
          ],
          "criterias": [
            {
              "key": "string",
              "values": [
                "string",
                "string",
                "string",
                "string",
                "string",
                "string",
                "string"
              ]
            },
            {
              "key": "string",
              "values": [
                "string",
                "string",
                "string",
                "string",
                "string",
                "string",
                "string"
              ]
            },
            {
              "key": "string",
              "values": [
                "string",
                "string",
                "string",
                "string",
                "string"
              ]
            },
            {
              "key": "string",
              "values": [
                "string",
                "string",
                "string",
                "string",
                "string",
                "string",
                "string",
                "string",
                "string"
              ]
            },
            {
              "key": "string",
              "values": [
                "string",
                "string",
                "string"
              ]
            },
            {
              "key": "string",
              "values": [
                "string",
                "string",
                "string",
                "string",
                "string",
                "string",
                "string"
              ]
            },
            {
              "key": "string",
              "values": [
                "string",
                "string",
                "string",
                "string",
                "string",
                "string",
                "string"
              ]
            },
            {
              "key": "string",
              "values": [
                "string",
                "string",
                "string",
                "string"
              ]
            },
            {
              "key": "string",
              "values": [
                "string",
                "string",
                "string",
                "string",
                "string",
                "string",
                "string",
                "string"
              ]
            }
          ],
          "ruleName": "string"
        }
      ],
      "name": "string"
    },
    {
      "actions": [
        "string",
        "string",
        "string",
        "string",
        "string",
        "string",
        "string",
        "string",
        "string"
      ],
      "contextActions": [
        {
          "action": "string",
          "contextList": [
            "APPLIANCE_OWNER"
          ]
        },
        {
          "action": "string",
          "contextList": [
            "APPLIANCE_OWNER",
            "TEMPLATE_OWNER",
            "APPLIANCE_OWNER"
          ]
        }
      ],
      "customRules": [
        {
          "actions": [
            "string",
            "string",
            "string",
            "string",
            "string"
          ],
          "criterias": [
            {
              "key": "string",
              "values": [
                "string",
                "string",
                "string",
                "string",
                "string",
                "string",
                "string",
                "string",
                "string",
                "string"
              ]
            },
            {
              "key": "string",
              "values": [
                "string",
                "string",
                "string",
                "string",
                "string"
              ]
            },
            {
              "key": "string",
              "values": [
                "string",
                "string",
                "string",
                "string",
                "string",
                "string",
                "string",
                "string"
              ]
            },
            {
              "key": "string",
              "values": [
                "string"
              ]
            },
            {
              "key": "string",
              "values": [
                "string",
                "string",
                "string"
              ]
            },
            {
              "key": "string",
              "values": [
                "string",
                "string",
                "string",
                "string",
                "string"
              ]
            },
            {
              "key": "string",
              "values": [
                "string",
                "string",
                "string",
                "string",
                "string"
              ]
            },
            {
              "key": "string",
              "values": [
                "string",
                "string",
                "string"
              ]
            },
            {
              "key": "string",
              "values": [
                "string",
                "string",
                "string"
              ]
            },
            {
              "key": "string",
              "values": [
                "string",
                "string",
                "string"
              ]
            }
          ],
          "ruleName": "string"
        },
        {
          "actions": [
            "string",
            "string"
          ],
          "criterias": [
            {
              "key": "string",
              "values": [
                "string",
                "string"
              ]
            }
          ],
          "ruleName": "string"
        },
        {
          "actions": [
            "string",
            "string",
            "string",
            "string",
            "string",
            "string",
            "string",
            "string",
            "string"
          ],
          "criterias": [
            {
              "key": "string",
              "values": [
                "string",
                "string",
                "string",
                "string",
                "string"
              ]
            },
            {
              "key": "string",
              "values": [
                "string",
                "string",
                "string",
                "string",
                "string",
                "string",
                "string"
              ]
            },
            {
              "key": "string",
              "values": [
                "string",
                "string"
              ]
            },
            {
              "key": "string",
              "values": [
                "string",
                "string",
                "string",
                "string",
                "string",
                "string",
                "string",
                "string",
                "string"
              ]
            },
            {
              "key": "string",
              "values": [
                "string",
                "string",
                "string",
                "string",
                "string"
              ]
            }
          ],
          "ruleName": "string"
        },
        {
          "actions": [
            "string",
            "string",
            "string",
            "string",
            "string",
            "string"
          ],
          "criterias": [
            {
              "key": "string",
              "values": [
                "string",
                "string",
                "string"
              ]
            },
            {
              "key": "string",
              "values": [
                "string",
                "string",
                "string",
                "string",
                "string",
                "string",
                "string"
              ]
            },
            {
              "key": "string",
              "values": [
                "string",
                "string"
              ]
            },
            {
              "key": "string",
              "values": [
                "string",
                "string",
                "string"
              ]
            },
            {
              "key": "string",
              "values": [
                "string",
                "string",
                "string"
              ]
            },
            {
              "key": "string",
              "values": [
                "string"
              ]
            },
            {
              "key": "string",
              "values": [
                "string",
                "string",
                "string",
                "string",
                "string",
                "string",
                "string",
                "string",
                "string",
                "string"
              ]
            }
          ],
          "ruleName": "string"
        },
        {
          "actions": [
            "string"
          ],
          "criterias": [
            {
              "key": "string",
              "values": [
                "string",
                "string"
              ]
            },
            {
              "key": "string",
              "values": [
                "string",
                "string",
                "string"
              ]
            },
            {
              "key": "string",
              "values": [
                "string",
                "string",
                "string",
                "string",
                "string",
                "string"
              ]
            },
            {
              "key": "string",
              "values": [
                "string",
                "string",
                "string"
              ]
            },
            {
              "key": "string",
              "values": [
                "string",
                "string",
                "string",
                "string"
              ]
            }
          ],
          "ruleName": "string"
        },
        {
          "actions": [
            "string",
            "string",
            "string",
            "string",
            "string",
            "string"
          ],
          "criterias": [
            {
              "key": "string",
              "values": [
                "string",
                "string",
                "string",
                "string",
                "string",
                "string",
                "string",
                "string",
                "string",
                "string"
              ]
            },
            {
              "key": "string",
              "values": [
                "string",
                "string"
              ]
            },
            {
              "key": "string",
              "values": [
                "string",
                "string",
                "string",
                "string",
                "string",
                "string",
                "string",
                "string",
                "string",
                "string"
              ]
            },
            {
              "key": "string",
              "values": [
                "string",
                "string",
                "string",
                "string",
                "string",
                "string"
              ]
            }
          ],
          "ruleName": "string"
        },
        {
          "actions": [
            "string",
            "string"
          ],
          "criterias": [
            {
              "key": "string",
              "values": [
                "string",
                "string",
                "string",
                "string",
                "string"
              ]
            },
            {
              "key": "string",
              "values": [
                "string",
                "string",
                "string",
                "string"
              ]
            },
            {
              "key": "string",
              "values": [
                "string",
                "string",
                "string",
                "string",
                "string"
              ]
            },
            {
              "key": "string",
              "values": [
                "string"
              ]
            }
          ],
          "ruleName": "string"
        },
        {
          "actions": [
            "string",
            "string",
            "string",
            "string",
            "string"
          ],
          "criterias": [
            {
              "key": "string",
              "values": [
                "string",
                "string",
                "string",
                "string",
                "string"
              ]
            },
            {
              "key": "string",
              "values": [
                "string",
                "string",
                "string"
              ]
            },
            {
              "key": "string",
              "values": [
                "string",
                "string",
                "string",
                "string",
                "string",
                "string",
                "string",
                "string",
                "string",
                "string"
              ]
            },
            {
              "key": "string",
              "values": [
                "string"
              ]
            },
            {
              "key": "string",
              "values": [
                "string",
                "string"
              ]
            },
            {
              "key": "string",
              "values": [
                "string",
                "string",
                "string",
                "string",
                "string",
                "string",
                "string",
                "string",
                "string"
              ]
            }
          ],
          "ruleName": "string"
        },
        {
          "actions": [
            "string",
            "string",
            "string",
            "string"
          ],
          "criterias": [
            {
              "key": "string",
              "values": [
                "string",
                "string"
              ]
            },
            {
              "key": "string",
              "values": [
                "string",
                "string",
                "string",
                "string"
              ]
            },
            {
              "key": "string",
              "values": [
                "string",
                "string",
                "string",
                "string",
                "string",
                "string",
                "string",
                "string",
                "string",
                "string"
              ]
            },
            {
              "key": "string",
              "values": [
                "string",
                "string",
                "string",
                "string"
              ]
            },
            {
              "key": "string",
              "values": [
                "string",
                "string",
                "string"
              ]
            },
            {
              "key": "string",
              "values": [
                "string",
                "string",
                "string",
                "string",
                "string",
                "string",
                "string"
              ]
            },
            {
              "key": "string",
              "values": [
                "string"
              ]
            },
            {
              "key": "string",
              "values": [
                "string",
                "string",
                "string",
                "string",
                "string",
                "string",
                "string",
                "string",
                "string"
              ]
            },
            {
              "key": "string",
              "values": [
                "string",
                "string",
                "string",
                "string",
                "string",
                "string",
                "string",
                "string",
                "string"
              ]
            }
          ],
          "ruleName": "string"
        },
        {
          "actions": [
            "string",
            "string",
            "string",
            "string",
            "string",
            "string",
            "string"
          ],
          "criterias": [
            {
              "key": "string",
              "values": [
                "string"
              ]
            },
            {
              "key": "string",
              "values": [
                "string",
                "string",
                "string",
                "string",
                "string",
                "string",
                "string",
                "string",
                "string",
                "string"
              ]
            },
            {
              "key": "string",
              "values": [
                "string",
                "string",
                "string",
                "string",
                "string",
                "string",
                "string",
                "string",
                "string",
                "string"
              ]
            },
            {
              "key": "string",
              "values": [
                "string",
                "string",
                "string",
                "string",
                "string",
                "string",
                "string",
                "string",
                "string",
                "string"
              ]
            },
            {
              "key": "string",
              "values": [
                "string",
                "string",
                "string",
                "string",
                "string"
              ]
            },
            {
              "key": "string",
              "values": [
                "string",
                "string",
                "string",
                "string",
                "string",
                "string",
                "string"
              ]
            },
            {
              "key": "string",
              "values": [
                "string",
                "string"
              ]
            },
            {
              "key": "string",
              "values": [
                "string",
                "string",
                "string",
                "string",
                "string"
              ]
            },
            {
              "key": "string",
              "values": [
                "string",
                "string",
                "string",
                "string",
                "string",
                "string",
                "string",
                "string"
              ]
            },
            {
              "key": "string",
              "values": [
                "string",
                "string",
                "string",
                "string"
              ]
            }
          ],
          "ruleName": "string"
        }
      ],
      "name": "string"
    }
  ],
  "roleName": "string",
  "type": "TENANT",
  "versaRole": true
}