{
  "List": {
    "value": [
      {
        "actionAttributes": [
          {
            "name": "Result",
            "value": "Success"
          },
          {
            "name": "Result",
            "value": "Success"
          },
          {
            "name": "Result",
            "value": "Success"
          },
          {
            "name": "Result",
            "value": "Success"
          }
        ],
        "alertOnClear": false,
        "conditions": [
          {
            "value": [
              {
                "attribute": "type",
                "key": "My-Notification-Rule_1",
                "operator": "NOTEQUALS",
                "value": "connection-failure"
              },
              {
                "attribute": "type",
                "key": "My-Notification-Rule_1",
                "operator": "NOTEQUALS",
                "value": "connection-failure"
              }
            ]
          }
        ],
        "groupKeys": "[ \"provider-org\", \"Tenant\" ]",
        "key": "My-Notification-Rule"
      },
      {
        "actionAttributes": [
          {
            "name": "Result",
            "value": "Success"
          }
        ],
        "alertOnClear": false,
        "conditions": [
          {
            "value": [
              {
                "attribute": "type",
                "key": "My-Notification-Rule_1",
                "operator": "NOTEQUALS",
                "value": "connection-failure"
              },
              {
                "attribute": "type",
                "key": "My-Notification-Rule_1",
                "operator": "NOTEQUALS",
                "value": "connection-failure"
              },
              {
                "attribute": "type",
                "key": "My-Notification-Rule_1",
                "operator": "NOTEQUALS",
                "value": "connection-failure"
              },
              {
                "attribute": "type",
                "key": "My-Notification-Rule_1",
                "operator": "NOTEQUALS",
                "value": "connection-failure"
              },
              {
                "attribute": "type",
                "key": "My-Notification-Rule_1",
                "operator": "NOTEQUALS",
                "value": "connection-failure"
              }
            ]
          },
          {
            "value": [
              {
                "attribute": "type",
                "key": "My-Notification-Rule_1",
                "operator": "NOTEQUALS",
                "value": "connection-failure"
              },
              {
                "attribute": "type",
                "key": "My-Notification-Rule_1",
                "operator": "NOTEQUALS",
                "value": "connection-failure"
              },
              {
                "attribute": "type",
                "key": "My-Notification-Rule_1",
                "operator": "NOTEQUALS",
                "value": "connection-failure"
              },
              {
                "attribute": "type",
                "key": "My-Notification-Rule_1",
                "operator": "NOTEQUALS",
                "value": "connection-failure"
              },
              {
                "attribute": "type",
                "key": "My-Notification-Rule_1",
                "operator": "NOTEQUALS",
                "value": "connection-failure"
              },
              {
                "attribute": "type",
                "key": "My-Notification-Rule_1",
                "operator": "NOTEQUALS",
                "value": "connection-failure"
              },
              {
                "attribute": "type",
                "key": "My-Notification-Rule_1",
                "operator": "NOTEQUALS",
                "value": "connection-failure"
              },
              {
                "attribute": "type",
                "key": "My-Notification-Rule_1",
                "operator": "NOTEQUALS",
                "value": "connection-failure"
              },
              {
                "attribute": "type",
                "key": "My-Notification-Rule_1",
                "operator": "NOTEQUALS",
                "value": "connection-failure"
              }
            ]
          },
          {
            "value": [
              {
                "attribute": "type",
                "key": "My-Notification-Rule_1",
                "operator": "NOTEQUALS",
                "value": "connection-failure"
              },
              {
                "attribute": "type",
                "key": "My-Notification-Rule_1",
                "operator": "NOTEQUALS",
                "value": "connection-failure"
              },
              {
                "attribute": "type",
                "key": "My-Notification-Rule_1",
                "operator": "NOTEQUALS",
                "value": "connection-failure"
              },
              {
                "attribute": "type",
                "key": "My-Notification-Rule_1",
                "operator": "NOTEQUALS",
                "value": "connection-failure"
              },
              {
                "attribute": "type",
                "key": "My-Notification-Rule_1",
                "operator": "NOTEQUALS",
                "value": "connection-failure"
              },
              {
                "attribute": "type",
                "key": "My-Notification-Rule_1",
                "operator": "NOTEQUALS",
                "value": "connection-failure"
              },
              {
                "attribute": "type",
                "key": "My-Notification-Rule_1",
                "operator": "NOTEQUALS",
                "value": "connection-failure"
              },
              {
                "attribute": "type",
                "key": "My-Notification-Rule_1",
                "operator": "NOTEQUALS",
                "value": "connection-failure"
              },
              {
                "attribute": "type",
                "key": "My-Notification-Rule_1",
                "operator": "NOTEQUALS",
                "value": "connection-failure"
              }
            ]
          },
          {
            "value": [
              {
                "attribute": "type",
                "key": "My-Notification-Rule_1",
                "operator": "NOTEQUALS",
                "value": "connection-failure"
              },
              {
                "attribute": "type",
                "key": "My-Notification-Rule_1",
                "operator": "NOTEQUALS",
                "value": "connection-failure"
              },
              {
                "attribute": "type",
                "key": "My-Notification-Rule_1",
                "operator": "NOTEQUALS",
                "value": "connection-failure"
              },
              {
                "attribute": "type",
                "key": "My-Notification-Rule_1",
                "operator": "NOTEQUALS",
                "value": "connection-failure"
              },
              {
                "attribute": "type",
                "key": "My-Notification-Rule_1",
                "operator": "NOTEQUALS",
                "value": "connection-failure"
              },
              {
                "attribute": "type",
                "key": "My-Notification-Rule_1",
                "operator": "NOTEQUALS",
                "value": "connection-failure"
              },
              {
                "attribute": "type",
                "key": "My-Notification-Rule_1",
                "operator": "NOTEQUALS",
                "value": "connection-failure"
              },
              {
                "attribute": "type",
                "key": "My-Notification-Rule_1",
                "operator": "NOTEQUALS",
                "value": "connection-failure"
              },
              {
                "attribute": "type",
                "key": "My-Notification-Rule_1",
                "operator": "NOTEQUALS",
                "value": "connection-failure"
              },
              {
                "attribute": "type",
                "key": "My-Notification-Rule_1",
                "operator": "NOTEQUALS",
                "value": "connection-failure"
              }
            ]
          },
          {
            "value": [
              {
                "attribute": "type",
                "key": "My-Notification-Rule_1",
                "operator": "NOTEQUALS",
                "value": "connection-failure"
              },
              {
                "attribute": "type",
                "key": "My-Notification-Rule_1",
                "operator": "NOTEQUALS",
                "value": "connection-failure"
              },
              {
                "attribute": "type",
                "key": "My-Notification-Rule_1",
                "operator": "NOTEQUALS",
                "value": "connection-failure"
              },
              {
                "attribute": "type",
                "key": "My-Notification-Rule_1",
                "operator": "NOTEQUALS",
                "value": "connection-failure"
              },
              {
                "attribute": "type",
                "key": "My-Notification-Rule_1",
                "operator": "NOTEQUALS",
                "value": "connection-failure"
              },
              {
                "attribute": "type",
                "key": "My-Notification-Rule_1",
                "operator": "NOTEQUALS",
                "value": "connection-failure"
              }
            ]
          },
          {
            "value": [
              {
                "attribute": "type",
                "key": "My-Notification-Rule_1",
                "operator": "NOTEQUALS",
                "value": "connection-failure"
              },
              {
                "attribute": "type",
                "key": "My-Notification-Rule_1",
                "operator": "NOTEQUALS",
                "value": "connection-failure"
              },
              {
                "attribute": "type",
                "key": "My-Notification-Rule_1",
                "operator": "NOTEQUALS",
                "value": "connection-failure"
              },
              {
                "attribute": "type",
                "key": "My-Notification-Rule_1",
                "operator": "NOTEQUALS",
                "value": "connection-failure"
              },
              {
                "attribute": "type",
                "key": "My-Notification-Rule_1",
                "operator": "NOTEQUALS",
                "value": "connection-failure"
              },
              {
                "attribute": "type",
                "key": "My-Notification-Rule_1",
                "operator": "NOTEQUALS",
                "value": "connection-failure"
              },
              {
                "attribute": "type",
                "key": "My-Notification-Rule_1",
                "operator": "NOTEQUALS",
                "value": "connection-failure"
              },
              {
                "attribute": "type",
                "key": "My-Notification-Rule_1",
                "operator": "NOTEQUALS",
                "value": "connection-failure"
              },
              {
                "attribute": "type",
                "key": "My-Notification-Rule_1",
                "operator": "NOTEQUALS",
                "value": "connection-failure"
              },
              {
                "attribute": "type",
                "key": "My-Notification-Rule_1",
                "operator": "NOTEQUALS",
                "value": "connection-failure"
              }
            ]
          }
        ],
        "groupKeys": "[ \"provider-org\", \"Tenant\" ]",
        "key": "My-Notification-Rule"
      },
      {
        "actionAttributes": [
          {
            "name": "Result",
            "value": "Success"
          },
          {
            "name": "Result",
            "value": "Success"
          },
          {
            "name": "Result",
            "value": "Success"
          }
        ],
        "alertOnClear": false,
        "conditions": [
          {
            "value": [
              {
                "attribute": "type",
                "key": "My-Notification-Rule_1",
                "operator": "NOTEQUALS",
                "value": "connection-failure"
              },
              {
                "attribute": "type",
                "key": "My-Notification-Rule_1",
                "operator": "NOTEQUALS",
                "value": "connection-failure"
              },
              {
                "attribute": "type",
                "key": "My-Notification-Rule_1",
                "operator": "NOTEQUALS",
                "value": "connection-failure"
              },
              {
                "attribute": "type",
                "key": "My-Notification-Rule_1",
                "operator": "NOTEQUALS",
                "value": "connection-failure"
              },
              {
                "attribute": "type",
                "key": "My-Notification-Rule_1",
                "operator": "NOTEQUALS",
                "value": "connection-failure"
              },
              {
                "attribute": "type",
                "key": "My-Notification-Rule_1",
                "operator": "NOTEQUALS",
                "value": "connection-failure"
              },
              {
                "attribute": "type",
                "key": "My-Notification-Rule_1",
                "operator": "NOTEQUALS",
                "value": "connection-failure"
              }
            ]
          }
        ],
        "groupKeys": "[ \"provider-org\", \"Tenant\" ]",
        "key": "My-Notification-Rule"
      },
      {
        "actionAttributes": [
          {
            "name": "Result",
            "value": "Success"
          },
          {
            "name": "Result",
            "value": "Success"
          },
          {
            "name": "Result",
            "value": "Success"
          },
          {
            "name": "Result",
            "value": "Success"
          },
          {
            "name": "Result",
            "value": "Success"
          }
        ],
        "alertOnClear": false,
        "conditions": [
          {
            "value": [
              {
                "attribute": "type",
                "key": "My-Notification-Rule_1",
                "operator": "NOTEQUALS",
                "value": "connection-failure"
              },
              {
                "attribute": "type",
                "key": "My-Notification-Rule_1",
                "operator": "NOTEQUALS",
                "value": "connection-failure"
              },
              {
                "attribute": "type",
                "key": "My-Notification-Rule_1",
                "operator": "NOTEQUALS",
                "value": "connection-failure"
              },
              {
                "attribute": "type",
                "key": "My-Notification-Rule_1",
                "operator": "NOTEQUALS",
                "value": "connection-failure"
              },
              {
                "attribute": "type",
                "key": "My-Notification-Rule_1",
                "operator": "NOTEQUALS",
                "value": "connection-failure"
              },
              {
                "attribute": "type",
                "key": "My-Notification-Rule_1",
                "operator": "NOTEQUALS",
                "value": "connection-failure"
              },
              {
                "attribute": "type",
                "key": "My-Notification-Rule_1",
                "operator": "NOTEQUALS",
                "value": "connection-failure"
              }
            ]
          },
          {
            "value": [
              {
                "attribute": "type",
                "key": "My-Notification-Rule_1",
                "operator": "NOTEQUALS",
                "value": "connection-failure"
              },
              {
                "attribute": "type",
                "key": "My-Notification-Rule_1",
                "operator": "NOTEQUALS",
                "value": "connection-failure"
              },
              {
                "attribute": "type",
                "key": "My-Notification-Rule_1",
                "operator": "NOTEQUALS",
                "value": "connection-failure"
              },
              {
                "attribute": "type",
                "key": "My-Notification-Rule_1",
                "operator": "NOTEQUALS",
                "value": "connection-failure"
              },
              {
                "attribute": "type",
                "key": "My-Notification-Rule_1",
                "operator": "NOTEQUALS",
                "value": "connection-failure"
              },
              {
                "attribute": "type",
                "key": "My-Notification-Rule_1",
                "operator": "NOTEQUALS",
                "value": "connection-failure"
              },
              {
                "attribute": "type",
                "key": "My-Notification-Rule_1",
                "operator": "NOTEQUALS",
                "value": "connection-failure"
              }
            ]
          },
          {
            "value": [
              {
                "attribute": "type",
                "key": "My-Notification-Rule_1",
                "operator": "NOTEQUALS",
                "value": "connection-failure"
              },
              {
                "attribute": "type",
                "key": "My-Notification-Rule_1",
                "operator": "NOTEQUALS",
                "value": "connection-failure"
              },
              {
                "attribute": "type",
                "key": "My-Notification-Rule_1",
                "operator": "NOTEQUALS",
                "value": "connection-failure"
              },
              {
                "attribute": "type",
                "key": "My-Notification-Rule_1",
                "operator": "NOTEQUALS",
                "value": "connection-failure"
              }
            ]
          },
          {
            "value": [
              {
                "attribute": "type",
                "key": "My-Notification-Rule_1",
                "operator": "NOTEQUALS",
                "value": "connection-failure"
              },
              {
                "attribute": "type",
                "key": "My-Notification-Rule_1",
                "operator": "NOTEQUALS",
                "value": "connection-failure"
              },
              {
                "attribute": "type",
                "key": "My-Notification-Rule_1",
                "operator": "NOTEQUALS",
                "value": "connection-failure"
              },
              {
                "attribute": "type",
                "key": "My-Notification-Rule_1",
                "operator": "NOTEQUALS",
                "value": "connection-failure"
              },
              {
                "attribute": "type",
                "key": "My-Notification-Rule_1",
                "operator": "NOTEQUALS",
                "value": "connection-failure"
              }
            ]
          }
        ],
        "groupKeys": "[ \"provider-org\", \"Tenant\" ]",
        "key": "My-Notification-Rule"
      },
      {
        "actionAttributes": [
          {
            "name": "Result",
            "value": "Success"
          },
          {
            "name": "Result",
            "value": "Success"
          },
          {
            "name": "Result",
            "value": "Success"
          }
        ],
        "alertOnClear": true,
        "conditions": [
          {
            "value": [
              {
                "attribute": "type",
                "key": "My-Notification-Rule_1",
                "operator": "NOTEQUALS",
                "value": "connection-failure"
              },
              {
                "attribute": "type",
                "key": "My-Notification-Rule_1",
                "operator": "NOTEQUALS",
                "value": "connection-failure"
              },
              {
                "attribute": "type",
                "key": "My-Notification-Rule_1",
                "operator": "NOTEQUALS",
                "value": "connection-failure"
              }
            ]
          },
          {
            "value": [
              {
                "attribute": "type",
                "key": "My-Notification-Rule_1",
                "operator": "NOTEQUALS",
                "value": "connection-failure"
              },
              {
                "attribute": "type",
                "key": "My-Notification-Rule_1",
                "operator": "NOTEQUALS",
                "value": "connection-failure"
              },
              {
                "attribute": "type",
                "key": "My-Notification-Rule_1",
                "operator": "NOTEQUALS",
                "value": "connection-failure"
              },
              {
                "attribute": "type",
                "key": "My-Notification-Rule_1",
                "operator": "NOTEQUALS",
                "value": "connection-failure"
              },
              {
                "attribute": "type",
                "key": "My-Notification-Rule_1",
                "operator": "NOTEQUALS",
                "value": "connection-failure"
              },
              {
                "attribute": "type",
                "key": "My-Notification-Rule_1",
                "operator": "NOTEQUALS",
                "value": "connection-failure"
              },
              {
                "attribute": "type",
                "key": "My-Notification-Rule_1",
                "operator": "NOTEQUALS",
                "value": "connection-failure"
              },
              {
                "attribute": "type",
                "key": "My-Notification-Rule_1",
                "operator": "NOTEQUALS",
                "value": "connection-failure"
              },
              {
                "attribute": "type",
                "key": "My-Notification-Rule_1",
                "operator": "NOTEQUALS",
                "value": "connection-failure"
              },
              {
                "attribute": "type",
                "key": "My-Notification-Rule_1",
                "operator": "NOTEQUALS",
                "value": "connection-failure"
              }
            ]
          },
          {
            "value": [
              {
                "attribute": "type",
                "key": "My-Notification-Rule_1",
                "operator": "NOTEQUALS",
                "value": "connection-failure"
              },
              {
                "attribute": "type",
                "key": "My-Notification-Rule_1",
                "operator": "NOTEQUALS",
                "value": "connection-failure"
              },
              {
                "attribute": "type",
                "key": "My-Notification-Rule_1",
                "operator": "NOTEQUALS",
                "value": "connection-failure"
              },
              {
                "attribute": "type",
                "key": "My-Notification-Rule_1",
                "operator": "NOTEQUALS",
                "value": "connection-failure"
              },
              {
                "attribute": "type",
                "key": "My-Notification-Rule_1",
                "operator": "NOTEQUALS",
                "value": "connection-failure"
              },
              {
                "attribute": "type",
                "key": "My-Notification-Rule_1",
                "operator": "NOTEQUALS",
                "value": "connection-failure"
              },
              {
                "attribute": "type",
                "key": "My-Notification-Rule_1",
                "operator": "NOTEQUALS",
                "value": "connection-failure"
              },
              {
                "attribute": "type",
                "key": "My-Notification-Rule_1",
                "operator": "NOTEQUALS",
                "value": "connection-failure"
              },
              {
                "attribute": "type",
                "key": "My-Notification-Rule_1",
                "operator": "NOTEQUALS",
                "value": "connection-failure"
              }
            ]
          },
          {
            "value": [
              {
                "attribute": "type",
                "key": "My-Notification-Rule_1",
                "operator": "NOTEQUALS",
                "value": "connection-failure"
              },
              {
                "attribute": "type",
                "key": "My-Notification-Rule_1",
                "operator": "NOTEQUALS",
                "value": "connection-failure"
              }
            ]
          },
          {
            "value": [
              {
                "attribute": "type",
                "key": "My-Notification-Rule_1",
                "operator": "NOTEQUALS",
                "value": "connection-failure"
              },
              {
                "attribute": "type",
                "key": "My-Notification-Rule_1",
                "operator": "NOTEQUALS",
                "value": "connection-failure"
              },
              {
                "attribute": "type",
                "key": "My-Notification-Rule_1",
                "operator": "NOTEQUALS",
                "value": "connection-failure"
              }
            ]
          },
          {
            "value": [
              {
                "attribute": "type",
                "key": "My-Notification-Rule_1",
                "operator": "NOTEQUALS",
                "value": "connection-failure"
              },
              {
                "attribute": "type",
                "key": "My-Notification-Rule_1",
                "operator": "NOTEQUALS",
                "value": "connection-failure"
              },
              {
                "attribute": "type",
                "key": "My-Notification-Rule_1",
                "operator": "NOTEQUALS",
                "value": "connection-failure"
              },
              {
                "attribute": "type",
                "key": "My-Notification-Rule_1",
                "operator": "NOTEQUALS",
                "value": "connection-failure"
              },
              {
                "attribute": "type",
                "key": "My-Notification-Rule_1",
                "operator": "NOTEQUALS",
                "value": "connection-failure"
              },
              {
                "attribute": "type",
                "key": "My-Notification-Rule_1",
                "operator": "NOTEQUALS",
                "value": "connection-failure"
              },
              {
                "attribute": "type",
                "key": "My-Notification-Rule_1",
                "operator": "NOTEQUALS",
                "value": "connection-failure"
              }
            ]
          },
          {
            "value": [
              {
                "attribute": "type",
                "key": "My-Notification-Rule_1",
                "operator": "NOTEQUALS",
                "value": "connection-failure"
              },
              {
                "attribute": "type",
                "key": "My-Notification-Rule_1",
                "operator": "NOTEQUALS",
                "value": "connection-failure"
              },
              {
                "attribute": "type",
                "key": "My-Notification-Rule_1",
                "operator": "NOTEQUALS",
                "value": "connection-failure"
              }
            ]
          }
        ],
        "groupKeys": "[ \"provider-org\", \"Tenant\" ]",
        "key": "My-Notification-Rule"
      },
      {
        "actionAttributes": [
          {
            "name": "Result",
            "value": "Success"
          },
          {
            "name": "Result",
            "value": "Success"
          },
          {
            "name": "Result",
            "value": "Success"
          },
          {
            "name": "Result",
            "value": "Success"
          },
          {
            "name": "Result",
            "value": "Success"
          },
          {
            "name": "Result",
            "value": "Success"
          },
          {
            "name": "Result",
            "value": "Success"
          },
          {
            "name": "Result",
            "value": "Success"
          },
          {
            "name": "Result",
            "value": "Success"
          },
          {
            "name": "Result",
            "value": "Success"
          }
        ],
        "alertOnClear": false,
        "conditions": [
          {
            "value": [
              {
                "attribute": "type",
                "key": "My-Notification-Rule_1",
                "operator": "NOTEQUALS",
                "value": "connection-failure"
              },
              {
                "attribute": "type",
                "key": "My-Notification-Rule_1",
                "operator": "NOTEQUALS",
                "value": "connection-failure"
              },
              {
                "attribute": "type",
                "key": "My-Notification-Rule_1",
                "operator": "NOTEQUALS",
                "value": "connection-failure"
              },
              {
                "attribute": "type",
                "key": "My-Notification-Rule_1",
                "operator": "NOTEQUALS",
                "value": "connection-failure"
              },
              {
                "attribute": "type",
                "key": "My-Notification-Rule_1",
                "operator": "NOTEQUALS",
                "value": "connection-failure"
              },
              {
                "attribute": "type",
                "key": "My-Notification-Rule_1",
                "operator": "NOTEQUALS",
                "value": "connection-failure"
              },
              {
                "attribute": "type",
                "key": "My-Notification-Rule_1",
                "operator": "NOTEQUALS",
                "value": "connection-failure"
              },
              {
                "attribute": "type",
                "key": "My-Notification-Rule_1",
                "operator": "NOTEQUALS",
                "value": "connection-failure"
              },
              {
                "attribute": "type",
                "key": "My-Notification-Rule_1",
                "operator": "NOTEQUALS",
                "value": "connection-failure"
              },
              {
                "attribute": "type",
                "key": "My-Notification-Rule_1",
                "operator": "NOTEQUALS",
                "value": "connection-failure"
              }
            ]
          },
          {
            "value": [
              {
                "attribute": "type",
                "key": "My-Notification-Rule_1",
                "operator": "NOTEQUALS",
                "value": "connection-failure"
              },
              {
                "attribute": "type",
                "key": "My-Notification-Rule_1",
                "operator": "NOTEQUALS",
                "value": "connection-failure"
              },
              {
                "attribute": "type",
                "key": "My-Notification-Rule_1",
                "operator": "NOTEQUALS",
                "value": "connection-failure"
              },
              {
                "attribute": "type",
                "key": "My-Notification-Rule_1",
                "operator": "NOTEQUALS",
                "value": "connection-failure"
              },
              {
                "attribute": "type",
                "key": "My-Notification-Rule_1",
                "operator": "NOTEQUALS",
                "value": "connection-failure"
              },
              {
                "attribute": "type",
                "key": "My-Notification-Rule_1",
                "operator": "NOTEQUALS",
                "value": "connection-failure"
              }
            ]
          },
          {
            "value": [
              {
                "attribute": "type",
                "key": "My-Notification-Rule_1",
                "operator": "NOTEQUALS",
                "value": "connection-failure"
              },
              {
                "attribute": "type",
                "key": "My-Notification-Rule_1",
                "operator": "NOTEQUALS",
                "value": "connection-failure"
              },
              {
                "attribute": "type",
                "key": "My-Notification-Rule_1",
                "operator": "NOTEQUALS",
                "value": "connection-failure"
              },
              {
                "attribute": "type",
                "key": "My-Notification-Rule_1",
                "operator": "NOTEQUALS",
                "value": "connection-failure"
              },
              {
                "attribute": "type",
                "key": "My-Notification-Rule_1",
                "operator": "NOTEQUALS",
                "value": "connection-failure"
              },
              {
                "attribute": "type",
                "key": "My-Notification-Rule_1",
                "operator": "NOTEQUALS",
                "value": "connection-failure"
              },
              {
                "attribute": "type",
                "key": "My-Notification-Rule_1",
                "operator": "NOTEQUALS",
                "value": "connection-failure"
              },
              {
                "attribute": "type",
                "key": "My-Notification-Rule_1",
                "operator": "NOTEQUALS",
                "value": "connection-failure"
              }
            ]
          },
          {
            "value": [
              {
                "attribute": "type",
                "key": "My-Notification-Rule_1",
                "operator": "NOTEQUALS",
                "value": "connection-failure"
              },
              {
                "attribute": "type",
                "key": "My-Notification-Rule_1",
                "operator": "NOTEQUALS",
                "value": "connection-failure"
              },
              {
                "attribute": "type",
                "key": "My-Notification-Rule_1",
                "operator": "NOTEQUALS",
                "value": "connection-failure"
              },
              {
                "attribute": "type",
                "key": "My-Notification-Rule_1",
                "operator": "NOTEQUALS",
                "value": "connection-failure"
              },
              {
                "attribute": "type",
                "key": "My-Notification-Rule_1",
                "operator": "NOTEQUALS",
                "value": "connection-failure"
              },
              {
                "attribute": "type",
                "key": "My-Notification-Rule_1",
                "operator": "NOTEQUALS",
                "value": "connection-failure"
              },
              {
                "attribute": "type",
                "key": "My-Notification-Rule_1",
                "operator": "NOTEQUALS",
                "value": "connection-failure"
              }
            ]
          },
          {
            "value": [
              {
                "attribute": "type",
                "key": "My-Notification-Rule_1",
                "operator": "NOTEQUALS",
                "value": "connection-failure"
              },
              {
                "attribute": "type",
                "key": "My-Notification-Rule_1",
                "operator": "NOTEQUALS",
                "value": "connection-failure"
              },
              {
                "attribute": "type",
                "key": "My-Notification-Rule_1",
                "operator": "NOTEQUALS",
                "value": "connection-failure"
              },
              {
                "attribute": "type",
                "key": "My-Notification-Rule_1",
                "operator": "NOTEQUALS",
                "value": "connection-failure"
              }
            ]
          },
          {
            "value": [
              {
                "attribute": "type",
                "key": "My-Notification-Rule_1",
                "operator": "NOTEQUALS",
                "value": "connection-failure"
              },
              {
                "attribute": "type",
                "key": "My-Notification-Rule_1",
                "operator": "NOTEQUALS",
                "value": "connection-failure"
              },
              {
                "attribute": "type",
                "key": "My-Notification-Rule_1",
                "operator": "NOTEQUALS",
                "value": "connection-failure"
              },
              {
                "attribute": "type",
                "key": "My-Notification-Rule_1",
                "operator": "NOTEQUALS",
                "value": "connection-failure"
              },
              {
                "attribute": "type",
                "key": "My-Notification-Rule_1",
                "operator": "NOTEQUALS",
                "value": "connection-failure"
              },
              {
                "attribute": "type",
                "key": "My-Notification-Rule_1",
                "operator": "NOTEQUALS",
                "value": "connection-failure"
              },
              {
                "attribute": "type",
                "key": "My-Notification-Rule_1",
                "operator": "NOTEQUALS",
                "value": "connection-failure"
              },
              {
                "attribute": "type",
                "key": "My-Notification-Rule_1",
                "operator": "NOTEQUALS",
                "value": "connection-failure"
              },
              {
                "attribute": "type",
                "key": "My-Notification-Rule_1",
                "operator": "NOTEQUALS",
                "value": "connection-failure"
              },
              {
                "attribute": "type",
                "key": "My-Notification-Rule_1",
                "operator": "NOTEQUALS",
                "value": "connection-failure"
              }
            ]
          },
          {
            "value": [
              {
                "attribute": "type",
                "key": "My-Notification-Rule_1",
                "operator": "NOTEQUALS",
                "value": "connection-failure"
              },
              {
                "attribute": "type",
                "key": "My-Notification-Rule_1",
                "operator": "NOTEQUALS",
                "value": "connection-failure"
              },
              {
                "attribute": "type",
                "key": "My-Notification-Rule_1",
                "operator": "NOTEQUALS",
                "value": "connection-failure"
              },
              {
                "attribute": "type",
                "key": "My-Notification-Rule_1",
                "operator": "NOTEQUALS",
                "value": "connection-failure"
              }
            ]
          },
          {
            "value": [
              {
                "attribute": "type",
                "key": "My-Notification-Rule_1",
                "operator": "NOTEQUALS",
                "value": "connection-failure"
              },
              {
                "attribute": "type",
                "key": "My-Notification-Rule_1",
                "operator": "NOTEQUALS",
                "value": "connection-failure"
              },
              {
                "attribute": "type",
                "key": "My-Notification-Rule_1",
                "operator": "NOTEQUALS",
                "value": "connection-failure"
              },
              {
                "attribute": "type",
                "key": "My-Notification-Rule_1",
                "operator": "NOTEQUALS",
                "value": "connection-failure"
              },
              {
                "attribute": "type",
                "key": "My-Notification-Rule_1",
                "operator": "NOTEQUALS",
                "value": "connection-failure"
              },
              {
                "attribute": "type",
                "key": "My-Notification-Rule_1",
                "operator": "NOTEQUALS",
                "value": "connection-failure"
              },
              {
                "attribute": "type",
                "key": "My-Notification-Rule_1",
                "operator": "NOTEQUALS",
                "value": "connection-failure"
              },
              {
                "attribute": "type",
                "key": "My-Notification-Rule_1",
                "operator": "NOTEQUALS",
                "value": "connection-failure"
              },
              {
                "attribute": "type",
                "key": "My-Notification-Rule_1",
                "operator": "NOTEQUALS",
                "value": "connection-failure"
              },
              {
                "attribute": "type",
                "key": "My-Notification-Rule_1",
                "operator": "NOTEQUALS",
                "value": "connection-failure"
              }
            ]
          }
        ],
        "groupKeys": "[ \"provider-org\", \"Tenant\" ]",
        "key": "My-Notification-Rule"
      },
      {
        "actionAttributes": [
          {
            "name": "Result",
            "value": "Success"
          },
          {
            "name": "Result",
            "value": "Success"
          },
          {
            "name": "Result",
            "value": "Success"
          },
          {
            "name": "Result",
            "value": "Success"
          },
          {
            "name": "Result",
            "value": "Success"
          }
        ],
        "alertOnClear": true,
        "conditions": [
          {
            "value": [
              {
                "attribute": "type",
                "key": "My-Notification-Rule_1",
                "operator": "NOTEQUALS",
                "value": "connection-failure"
              },
              {
                "attribute": "type",
                "key": "My-Notification-Rule_1",
                "operator": "NOTEQUALS",
                "value": "connection-failure"
              },
              {
                "attribute": "type",
                "key": "My-Notification-Rule_1",
                "operator": "NOTEQUALS",
                "value": "connection-failure"
              },
              {
                "attribute": "type",
                "key": "My-Notification-Rule_1",
                "operator": "NOTEQUALS",
                "value": "connection-failure"
              }
            ]
          },
          {
            "value": [
              {
                "attribute": "type",
                "key": "My-Notification-Rule_1",
                "operator": "NOTEQUALS",
                "value": "connection-failure"
              },
              {
                "attribute": "type",
                "key": "My-Notification-Rule_1",
                "operator": "NOTEQUALS",
                "value": "connection-failure"
              },
              {
                "attribute": "type",
                "key": "My-Notification-Rule_1",
                "operator": "NOTEQUALS",
                "value": "connection-failure"
              },
              {
                "attribute": "type",
                "key": "My-Notification-Rule_1",
                "operator": "NOTEQUALS",
                "value": "connection-failure"
              },
              {
                "attribute": "type",
                "key": "My-Notification-Rule_1",
                "operator": "NOTEQUALS",
                "value": "connection-failure"
              },
              {
                "attribute": "type",
                "key": "My-Notification-Rule_1",
                "operator": "NOTEQUALS",
                "value": "connection-failure"
              },
              {
                "attribute": "type",
                "key": "My-Notification-Rule_1",
                "operator": "NOTEQUALS",
                "value": "connection-failure"
              },
              {
                "attribute": "type",
                "key": "My-Notification-Rule_1",
                "operator": "NOTEQUALS",
                "value": "connection-failure"
              },
              {
                "attribute": "type",
                "key": "My-Notification-Rule_1",
                "operator": "NOTEQUALS",
                "value": "connection-failure"
              },
              {
                "attribute": "type",
                "key": "My-Notification-Rule_1",
                "operator": "NOTEQUALS",
                "value": "connection-failure"
              }
            ]
          },
          {
            "value": [
              {
                "attribute": "type",
                "key": "My-Notification-Rule_1",
                "operator": "NOTEQUALS",
                "value": "connection-failure"
              },
              {
                "attribute": "type",
                "key": "My-Notification-Rule_1",
                "operator": "NOTEQUALS",
                "value": "connection-failure"
              },
              {
                "attribute": "type",
                "key": "My-Notification-Rule_1",
                "operator": "NOTEQUALS",
                "value": "connection-failure"
              },
              {
                "attribute": "type",
                "key": "My-Notification-Rule_1",
                "operator": "NOTEQUALS",
                "value": "connection-failure"
              },
              {
                "attribute": "type",
                "key": "My-Notification-Rule_1",
                "operator": "NOTEQUALS",
                "value": "connection-failure"
              },
              {
                "attribute": "type",
                "key": "My-Notification-Rule_1",
                "operator": "NOTEQUALS",
                "value": "connection-failure"
              },
              {
                "attribute": "type",
                "key": "My-Notification-Rule_1",
                "operator": "NOTEQUALS",
                "value": "connection-failure"
              }
            ]
          },
          {
            "value": [
              {
                "attribute": "type",
                "key": "My-Notification-Rule_1",
                "operator": "NOTEQUALS",
                "value": "connection-failure"
              }
            ]
          },
          {
            "value": [
              {
                "attribute": "type",
                "key": "My-Notification-Rule_1",
                "operator": "NOTEQUALS",
                "value": "connection-failure"
              }
            ]
          },
          {
            "value": [
              {
                "attribute": "type",
                "key": "My-Notification-Rule_1",
                "operator": "NOTEQUALS",
                "value": "connection-failure"
              },
              {
                "attribute": "type",
                "key": "My-Notification-Rule_1",
                "operator": "NOTEQUALS",
                "value": "connection-failure"
              },
              {
                "attribute": "type",
                "key": "My-Notification-Rule_1",
                "operator": "NOTEQUALS",
                "value": "connection-failure"
              }
            ]
          },
          {
            "value": [
              {
                "attribute": "type",
                "key": "My-Notification-Rule_1",
                "operator": "NOTEQUALS",
                "value": "connection-failure"
              },
              {
                "attribute": "type",
                "key": "My-Notification-Rule_1",
                "operator": "NOTEQUALS",
                "value": "connection-failure"
              },
              {
                "attribute": "type",
                "key": "My-Notification-Rule_1",
                "operator": "NOTEQUALS",
                "value": "connection-failure"
              },
              {
                "attribute": "type",
                "key": "My-Notification-Rule_1",
                "operator": "NOTEQUALS",
                "value": "connection-failure"
              },
              {
                "attribute": "type",
                "key": "My-Notification-Rule_1",
                "operator": "NOTEQUALS",
                "value": "connection-failure"
              }
            ]
          },
          {
            "value": [
              {
                "attribute": "type",
                "key": "My-Notification-Rule_1",
                "operator": "NOTEQUALS",
                "value": "connection-failure"
              },
              {
                "attribute": "type",
                "key": "My-Notification-Rule_1",
                "operator": "NOTEQUALS",
                "value": "connection-failure"
              },
              {
                "attribute": "type",
                "key": "My-Notification-Rule_1",
                "operator": "NOTEQUALS",
                "value": "connection-failure"
              }
            ]
          }
        ],
        "groupKeys": "[ \"provider-org\", \"Tenant\" ]",
        "key": "My-Notification-Rule"
      },
      {
        "actionAttributes": [
          {
            "name": "Result",
            "value": "Success"
          },
          {
            "name": "Result",
            "value": "Success"
          },
          {
            "name": "Result",
            "value": "Success"
          },
          {
            "name": "Result",
            "value": "Success"
          },
          {
            "name": "Result",
            "value": "Success"
          },
          {
            "name": "Result",
            "value": "Success"
          },
          {
            "name": "Result",
            "value": "Success"
          },
          {
            "name": "Result",
            "value": "Success"
          },
          {
            "name": "Result",
            "value": "Success"
          }
        ],
        "alertOnClear": false,
        "conditions": [
          {
            "value": [
              {
                "attribute": "type",
                "key": "My-Notification-Rule_1",
                "operator": "NOTEQUALS",
                "value": "connection-failure"
              },
              {
                "attribute": "type",
                "key": "My-Notification-Rule_1",
                "operator": "NOTEQUALS",
                "value": "connection-failure"
              },
              {
                "attribute": "type",
                "key": "My-Notification-Rule_1",
                "operator": "NOTEQUALS",
                "value": "connection-failure"
              },
              {
                "attribute": "type",
                "key": "My-Notification-Rule_1",
                "operator": "NOTEQUALS",
                "value": "connection-failure"
              }
            ]
          }
        ],
        "groupKeys": "[ \"provider-org\", \"Tenant\" ]",
        "key": "My-Notification-Rule"
      }
    ]
  }
}