{
  "actions": [
    {
      "name": "getOrgWorkflowList",
      "protocol": "REST",
      "method": "GET",
      "entitypath": "{base_path}/{version}/vnms/sdwan/workflow/orgs?{query}",
      "requestSchema": "schema.json",
      "responseSchema": "schema.json",
      "timeout": 0,
      "sendEmpty": false,
      "sendGetBody": false,
      "requestDatatype": "JSON",
      "responseDatatype": "JSON",
      "headers": {},
      "responseObjects": [
        {
          "type": "default",
          "key": "",
          "mockFile": "mockdatafiles/getOrgWorkflowList-default.json"
        }
      ]
    },
    {
      "name": "createOrgWorkflowFromJson",
      "protocol": "REST",
      "method": "POST",
      "entitypath": "{base_path}/{version}/vnms/sdwan/workflow/orgs/org?{query}",
      "requestSchema": "schema.json",
      "responseSchema": "schema.json",
      "timeout": 0,
      "sendEmpty": false,
      "requestDatatype": "JSON",
      "responseDatatype": "JSON",
      "headers": {},
      "responseObjects": [
        {
          "type": "default",
          "key": "",
          "mockFile": "mockdatafiles/createOrgWorkflowFromJson-default.json"
        }
      ]
    },
    {
      "name": "deployOrgWorkflow",
      "protocol": "REST",
      "method": "POST",
      "entitypath": "{base_path}/{version}/vnms/sdwan/workflow/orgs/org/deploy/{pathv1}?{query}",
      "requestSchema": "schema.json",
      "responseSchema": "schema.json",
      "timeout": 0,
      "sendEmpty": false,
      "requestDatatype": "JSON",
      "responseDatatype": "JSON",
      "headers": {},
      "responseObjects": [
        {
          "type": "default",
          "key": "",
          "mockFile": "mockdatafiles/deployOrgWorkflow-default.json"
        }
      ]
    },
    {
      "name": "getOrgWorkflowFromJson",
      "protocol": "REST",
      "method": "GET",
      "entitypath": "{base_path}/{version}/vnms/sdwan/workflow/orgs/org/{pathv1}?{query}",
      "requestSchema": "schema.json",
      "responseSchema": "schema.json",
      "timeout": 0,
      "sendEmpty": false,
      "sendGetBody": false,
      "requestDatatype": "JSON",
      "responseDatatype": "JSON",
      "headers": {},
      "responseObjects": [
        {
          "type": "default",
          "key": "",
          "mockFile": "mockdatafiles/getOrgWorkflowFromJson-default.json"
        }
      ]
    },
    {
      "name": "updateOrgWorkflowFromJson",
      "protocol": "REST",
      "method": "PUT",
      "entitypath": "{base_path}/{version}/vnms/sdwan/workflow/orgs/org/{pathv1}?{query}",
      "requestSchema": "schema.json",
      "responseSchema": "schema.json",
      "timeout": 0,
      "sendEmpty": false,
      "requestDatatype": "JSON",
      "responseDatatype": "JSON",
      "headers": {},
      "responseObjects": [
        {
          "type": "default",
          "key": "",
          "mockFile": ""
        }
      ]
    },
    {
      "name": "decommissionOrgWorkflow",
      "protocol": "REST",
      "method": "DELETE",
      "entitypath": "{base_path}/{version}/vnms/sdwan/workflow/orgs/org/{pathv1}?{query}",
      "requestSchema": "schema.json",
      "responseSchema": "schema.json",
      "timeout": 0,
      "sendEmpty": false,
      "requestDatatype": "JSON",
      "responseDatatype": "JSON",
      "headers": {},
      "responseObjects": [
        {
          "type": "default",
          "key": "",
          "mockFile": ""
        }
      ]
    },
    {
      "name": "deleteOrgWorkflows",
      "protocol": "REST",
      "method": "DELETE",
      "entitypath": "{base_path}/{version}/vnms/sdwan/workflow/orgs/{pathv1}?{query}",
      "requestSchema": "schema.json",
      "responseSchema": "schema.json",
      "timeout": 0,
      "sendEmpty": false,
      "requestDatatype": "JSON",
      "responseDatatype": "JSON",
      "headers": {},
      "responseObjects": [
        {
          "type": "default",
          "key": "",
          "mockFile": ""
        }
      ]
    }
  ]
}