{
  "List": {
    "value": "[\n      {\n        \"severity\": \"cleared\",\n        \"count\": 26\n      },\n      {\n        \"severity\": \"indeterminate\",\n        \"count\": 4\n      },\n      {\n        \"severity\": \"minor\",\n        \"count\": 0\n      },\n      {\n        \"severity\": \"major\",\n        \"count\": 10\n      },\n      {\n        \"severity\": \"critical\",\n        \"count\": 1\n      },\n      {\n        \"severity\": \"warning\",\n        \"count\": 0\n      }\n    ]"
  }
}