{
  "count": 4,
  "deviceTemplateVariable": [
    {},
    {},
    {},
    {},
    {},
    {},
    {},
    {},
    {}
  ],
  "id": "string",
  "variableMetadata": [
    {
      "group": "string",
      "overlay": true,
      "type": "string",
      "variable": "string"
    },
    {
      "group": "string",
      "overlay": true,
      "type": "string",
      "variable": "string"
    },
    {
      "group": "string",
      "overlay": true,
      "type": "string",
      "variable": "string"
    },
    {
      "group": "string",
      "overlay": true,
      "type": "string",
      "variable": "string"
    },
    {
      "group": "string",
      "overlay": true,
      "type": "string",
      "variable": "string"
    }
  ]
}