{
  "assets": [
    {
      "additional-data": [
        {
          "name": "string",
          "value": "string"
        },
        {
          "name": "string",
          "value": "string"
        },
        {
          "name": "string",
          "value": "string"
        },
        {
          "name": "string",
          "value": "string"
        },
        {
          "name": "string",
          "value": "string"
        },
        {
          "name": "string",
          "value": "string"
        }
      ],
      "authType": "psk",
      "bandwidth": 50,
      "branchId": "SDWAN-Branch1@provider-org.com",
      "branchKey": "7CDjtDTvOmrGQEtC",
      "caEmail": "string",
      "caPassword": "string",
      "caUserName": "string",
      "description": "Multi Tenant Branch in South Asia",
      "deviceGroupName": "Multi_Tenant_DeviceGroup1",
      "deviceType": "full-mesh",
      "dnsServer": "string",
      "email": "tenantoperator@yourcompany.com",
      "enableIPv4": true,
      "enableIPv4Dhcp": false,
      "enableIPv6": true,
      "enableIPv6Dhcp": false,
      "enablePPPoE": true,
      "haPairedAssetName": "string",
      "haPairedSiteLocationID": "string",
      "hw-serial-no": "br103.4568-09876",
      "id": "string",
      "isStaging": true,
      "latitude": "37.242286",
      "location": "123 Main Street CA USA 95138",
      "longitude": "-121.730945",
      "model-no": "string",
      "name": "br103",
      "old-hw-serial-no": "br103.-876-765",
      "old-serial-no": "702ebf22-br103.older",
      "organization": "Tenant1",
      "phone-number": "800-800-8000",
      "pppoeAccessConcentrator": "string",
      "pppoePassword": "sdfs987sdf",
      "pppoeServiceName": "string",
      "pppoeUsername": "User1",
      "region": "string",
      "replaced-serial-no": "br103.replace.3486",
      "replacement-status": "IN-PROGRESS",
      "serial-no": "702ebf22-a682-44c8-9abd-00bba7a3728a",
      "site-id": "187",
      "site-name": "br103-2",
      "staging": false,
      "status": "shipped",
      "tag": "abc,def,123",
      "wanMTU": "string",
      "wanVlan": "string",
      "wanv4IpAddress": "string",
      "wanv4gateway": "string",
      "wanv6IpAddress": "string",
      "wanv6gateway": "string"
    },
    {
      "additional-data": [
        {
          "name": "string",
          "value": "string"
        },
        {
          "name": "string",
          "value": "string"
        },
        {
          "name": "string",
          "value": "string"
        },
        {
          "name": "string",
          "value": "string"
        },
        {
          "name": "string",
          "value": "string"
        },
        {
          "name": "string",
          "value": "string"
        },
        {
          "name": "string",
          "value": "string"
        },
        {
          "name": "string",
          "value": "string"
        },
        {
          "name": "string",
          "value": "string"
        }
      ],
      "authType": "psk",
      "bandwidth": 50,
      "branchId": "SDWAN-Branch1@provider-org.com",
      "branchKey": "7CDjtDTvOmrGQEtC",
      "caEmail": "string",
      "caPassword": "string",
      "caUserName": "string",
      "description": "Multi Tenant Branch in South Asia",
      "deviceGroupName": "Multi_Tenant_DeviceGroup1",
      "deviceType": "full-mesh",
      "dnsServer": "string",
      "email": "tenantoperator@yourcompany.com",
      "enableIPv4": true,
      "enableIPv4Dhcp": false,
      "enableIPv6": true,
      "enableIPv6Dhcp": true,
      "enablePPPoE": true,
      "haPairedAssetName": "string",
      "haPairedSiteLocationID": "string",
      "hw-serial-no": "br103.4568-09876",
      "id": "string",
      "isStaging": true,
      "latitude": "37.242286",
      "location": "123 Main Street CA USA 95138",
      "longitude": "-121.730945",
      "model-no": "string",
      "name": "br103",
      "old-hw-serial-no": "br103.-876-765",
      "old-serial-no": "702ebf22-br103.older",
      "organization": "Tenant1",
      "phone-number": "800-800-8000",
      "pppoeAccessConcentrator": "string",
      "pppoePassword": "sdfs987sdf",
      "pppoeServiceName": "string",
      "pppoeUsername": "User1",
      "region": "string",
      "replaced-serial-no": "br103.replace.3486",
      "replacement-status": "IN-PROGRESS",
      "serial-no": "702ebf22-a682-44c8-9abd-00bba7a3728a",
      "site-id": "187",
      "site-name": "br103-2",
      "staging": true,
      "status": "shipped",
      "tag": "abc,def,123",
      "wanMTU": "string",
      "wanVlan": "string",
      "wanv4IpAddress": "string",
      "wanv4gateway": "string",
      "wanv6IpAddress": "string",
      "wanv6gateway": "string"
    },
    {
      "additional-data": [
        {
          "name": "string",
          "value": "string"
        },
        {
          "name": "string",
          "value": "string"
        },
        {
          "name": "string",
          "value": "string"
        },
        {
          "name": "string",
          "value": "string"
        },
        {
          "name": "string",
          "value": "string"
        },
        {
          "name": "string",
          "value": "string"
        }
      ],
      "authType": "psk",
      "bandwidth": 50,
      "branchId": "SDWAN-Branch1@provider-org.com",
      "branchKey": "7CDjtDTvOmrGQEtC",
      "caEmail": "string",
      "caPassword": "string",
      "caUserName": "string",
      "description": "Multi Tenant Branch in South Asia",
      "deviceGroupName": "Multi_Tenant_DeviceGroup1",
      "deviceType": "full-mesh",
      "dnsServer": "string",
      "email": "tenantoperator@yourcompany.com",
      "enableIPv4": true,
      "enableIPv4Dhcp": true,
      "enableIPv6": true,
      "enableIPv6Dhcp": false,
      "enablePPPoE": true,
      "haPairedAssetName": "string",
      "haPairedSiteLocationID": "string",
      "hw-serial-no": "br103.4568-09876",
      "id": "string",
      "isStaging": true,
      "latitude": "37.242286",
      "location": "123 Main Street CA USA 95138",
      "longitude": "-121.730945",
      "model-no": "string",
      "name": "br103",
      "old-hw-serial-no": "br103.-876-765",
      "old-serial-no": "702ebf22-br103.older",
      "organization": "Tenant1",
      "phone-number": "800-800-8000",
      "pppoeAccessConcentrator": "string",
      "pppoePassword": "sdfs987sdf",
      "pppoeServiceName": "string",
      "pppoeUsername": "User1",
      "region": "string",
      "replaced-serial-no": "br103.replace.3486",
      "replacement-status": "IN-PROGRESS",
      "serial-no": "702ebf22-a682-44c8-9abd-00bba7a3728a",
      "site-id": "187",
      "site-name": "br103-2",
      "staging": true,
      "status": "shipped",
      "tag": "abc,def,123",
      "wanMTU": "string",
      "wanVlan": "string",
      "wanv4IpAddress": "string",
      "wanv4gateway": "string",
      "wanv6IpAddress": "string",
      "wanv6gateway": "string"
    },
    {
      "additional-data": [
        {
          "name": "string",
          "value": "string"
        },
        {
          "name": "string",
          "value": "string"
        },
        {
          "name": "string",
          "value": "string"
        },
        {
          "name": "string",
          "value": "string"
        },
        {
          "name": "string",
          "value": "string"
        },
        {
          "name": "string",
          "value": "string"
        },
        {
          "name": "string",
          "value": "string"
        },
        {
          "name": "string",
          "value": "string"
        },
        {
          "name": "string",
          "value": "string"
        },
        {
          "name": "string",
          "value": "string"
        }
      ],
      "authType": "psk",
      "bandwidth": 50,
      "branchId": "SDWAN-Branch1@provider-org.com",
      "branchKey": "7CDjtDTvOmrGQEtC",
      "caEmail": "string",
      "caPassword": "string",
      "caUserName": "string",
      "description": "Multi Tenant Branch in South Asia",
      "deviceGroupName": "Multi_Tenant_DeviceGroup1",
      "deviceType": "full-mesh",
      "dnsServer": "string",
      "email": "tenantoperator@yourcompany.com",
      "enableIPv4": true,
      "enableIPv4Dhcp": false,
      "enableIPv6": true,
      "enableIPv6Dhcp": false,
      "enablePPPoE": true,
      "haPairedAssetName": "string",
      "haPairedSiteLocationID": "string",
      "hw-serial-no": "br103.4568-09876",
      "id": "string",
      "isStaging": true,
      "latitude": "37.242286",
      "location": "123 Main Street CA USA 95138",
      "longitude": "-121.730945",
      "model-no": "string",
      "name": "br103",
      "old-hw-serial-no": "br103.-876-765",
      "old-serial-no": "702ebf22-br103.older",
      "organization": "Tenant1",
      "phone-number": "800-800-8000",
      "pppoeAccessConcentrator": "string",
      "pppoePassword": "sdfs987sdf",
      "pppoeServiceName": "string",
      "pppoeUsername": "User1",
      "region": "string",
      "replaced-serial-no": "br103.replace.3486",
      "replacement-status": "IN-PROGRESS",
      "serial-no": "702ebf22-a682-44c8-9abd-00bba7a3728a",
      "site-id": "187",
      "site-name": "br103-2",
      "staging": true,
      "status": "shipped",
      "tag": "abc,def,123",
      "wanMTU": "string",
      "wanVlan": "string",
      "wanv4IpAddress": "string",
      "wanv4gateway": "string",
      "wanv6IpAddress": "string",
      "wanv6gateway": "string"
    },
    {
      "additional-data": [
        {
          "name": "string",
          "value": "string"
        },
        {
          "name": "string",
          "value": "string"
        },
        {
          "name": "string",
          "value": "string"
        },
        {
          "name": "string",
          "value": "string"
        },
        {
          "name": "string",
          "value": "string"
        },
        {
          "name": "string",
          "value": "string"
        },
        {
          "name": "string",
          "value": "string"
        },
        {
          "name": "string",
          "value": "string"
        }
      ],
      "authType": "psk",
      "bandwidth": 50,
      "branchId": "SDWAN-Branch1@provider-org.com",
      "branchKey": "7CDjtDTvOmrGQEtC",
      "caEmail": "string",
      "caPassword": "string",
      "caUserName": "string",
      "description": "Multi Tenant Branch in South Asia",
      "deviceGroupName": "Multi_Tenant_DeviceGroup1",
      "deviceType": "full-mesh",
      "dnsServer": "string",
      "email": "tenantoperator@yourcompany.com",
      "enableIPv4": false,
      "enableIPv4Dhcp": true,
      "enableIPv6": true,
      "enableIPv6Dhcp": true,
      "enablePPPoE": true,
      "haPairedAssetName": "string",
      "haPairedSiteLocationID": "string",
      "hw-serial-no": "br103.4568-09876",
      "id": "string",
      "isStaging": true,
      "latitude": "37.242286",
      "location": "123 Main Street CA USA 95138",
      "longitude": "-121.730945",
      "model-no": "string",
      "name": "br103",
      "old-hw-serial-no": "br103.-876-765",
      "old-serial-no": "702ebf22-br103.older",
      "organization": "Tenant1",
      "phone-number": "800-800-8000",
      "pppoeAccessConcentrator": "string",
      "pppoePassword": "sdfs987sdf",
      "pppoeServiceName": "string",
      "pppoeUsername": "User1",
      "region": "string",
      "replaced-serial-no": "br103.replace.3486",
      "replacement-status": "IN-PROGRESS",
      "serial-no": "702ebf22-a682-44c8-9abd-00bba7a3728a",
      "site-id": "187",
      "site-name": "br103-2",
      "staging": false,
      "status": "shipped",
      "tag": "abc,def,123",
      "wanMTU": "string",
      "wanVlan": "string",
      "wanv4IpAddress": "string",
      "wanv4gateway": "string",
      "wanv6IpAddress": "string",
      "wanv6gateway": "string"
    },
    {
      "additional-data": [
        {
          "name": "string",
          "value": "string"
        },
        {
          "name": "string",
          "value": "string"
        },
        {
          "name": "string",
          "value": "string"
        },
        {
          "name": "string",
          "value": "string"
        },
        {
          "name": "string",
          "value": "string"
        },
        {
          "name": "string",
          "value": "string"
        }
      ],
      "authType": "psk",
      "bandwidth": 50,
      "branchId": "SDWAN-Branch1@provider-org.com",
      "branchKey": "7CDjtDTvOmrGQEtC",
      "caEmail": "string",
      "caPassword": "string",
      "caUserName": "string",
      "description": "Multi Tenant Branch in South Asia",
      "deviceGroupName": "Multi_Tenant_DeviceGroup1",
      "deviceType": "full-mesh",
      "dnsServer": "string",
      "email": "tenantoperator@yourcompany.com",
      "enableIPv4": true,
      "enableIPv4Dhcp": false,
      "enableIPv6": true,
      "enableIPv6Dhcp": false,
      "enablePPPoE": true,
      "haPairedAssetName": "string",
      "haPairedSiteLocationID": "string",
      "hw-serial-no": "br103.4568-09876",
      "id": "string",
      "isStaging": true,
      "latitude": "37.242286",
      "location": "123 Main Street CA USA 95138",
      "longitude": "-121.730945",
      "model-no": "string",
      "name": "br103",
      "old-hw-serial-no": "br103.-876-765",
      "old-serial-no": "702ebf22-br103.older",
      "organization": "Tenant1",
      "phone-number": "800-800-8000",
      "pppoeAccessConcentrator": "string",
      "pppoePassword": "sdfs987sdf",
      "pppoeServiceName": "string",
      "pppoeUsername": "User1",
      "region": "string",
      "replaced-serial-no": "br103.replace.3486",
      "replacement-status": "IN-PROGRESS",
      "serial-no": "702ebf22-a682-44c8-9abd-00bba7a3728a",
      "site-id": "187",
      "site-name": "br103-2",
      "staging": true,
      "status": "shipped",
      "tag": "abc,def,123",
      "wanMTU": "string",
      "wanVlan": "string",
      "wanv4IpAddress": "string",
      "wanv4gateway": "string",
      "wanv6IpAddress": "string",
      "wanv6gateway": "string"
    },
    {
      "additional-data": [
        {
          "name": "string",
          "value": "string"
        },
        {
          "name": "string",
          "value": "string"
        },
        {
          "name": "string",
          "value": "string"
        },
        {
          "name": "string",
          "value": "string"
        },
        {
          "name": "string",
          "value": "string"
        },
        {
          "name": "string",
          "value": "string"
        },
        {
          "name": "string",
          "value": "string"
        },
        {
          "name": "string",
          "value": "string"
        },
        {
          "name": "string",
          "value": "string"
        },
        {
          "name": "string",
          "value": "string"
        }
      ],
      "authType": "psk",
      "bandwidth": 50,
      "branchId": "SDWAN-Branch1@provider-org.com",
      "branchKey": "7CDjtDTvOmrGQEtC",
      "caEmail": "string",
      "caPassword": "string",
      "caUserName": "string",
      "description": "Multi Tenant Branch in South Asia",
      "deviceGroupName": "Multi_Tenant_DeviceGroup1",
      "deviceType": "full-mesh",
      "dnsServer": "string",
      "email": "tenantoperator@yourcompany.com",
      "enableIPv4": true,
      "enableIPv4Dhcp": false,
      "enableIPv6": true,
      "enableIPv6Dhcp": true,
      "enablePPPoE": true,
      "haPairedAssetName": "string",
      "haPairedSiteLocationID": "string",
      "hw-serial-no": "br103.4568-09876",
      "id": "string",
      "isStaging": true,
      "latitude": "37.242286",
      "location": "123 Main Street CA USA 95138",
      "longitude": "-121.730945",
      "model-no": "string",
      "name": "br103",
      "old-hw-serial-no": "br103.-876-765",
      "old-serial-no": "702ebf22-br103.older",
      "organization": "Tenant1",
      "phone-number": "800-800-8000",
      "pppoeAccessConcentrator": "string",
      "pppoePassword": "sdfs987sdf",
      "pppoeServiceName": "string",
      "pppoeUsername": "User1",
      "region": "string",
      "replaced-serial-no": "br103.replace.3486",
      "replacement-status": "IN-PROGRESS",
      "serial-no": "702ebf22-a682-44c8-9abd-00bba7a3728a",
      "site-id": "187",
      "site-name": "br103-2",
      "staging": true,
      "status": "shipped",
      "tag": "abc,def,123",
      "wanMTU": "string",
      "wanVlan": "string",
      "wanv4IpAddress": "string",
      "wanv4gateway": "string",
      "wanv6IpAddress": "string",
      "wanv6gateway": "string"
    },
    {
      "additional-data": [
        {
          "name": "string",
          "value": "string"
        },
        {
          "name": "string",
          "value": "string"
        },
        {
          "name": "string",
          "value": "string"
        },
        {
          "name": "string",
          "value": "string"
        }
      ],
      "authType": "psk",
      "bandwidth": 50,
      "branchId": "SDWAN-Branch1@provider-org.com",
      "branchKey": "7CDjtDTvOmrGQEtC",
      "caEmail": "string",
      "caPassword": "string",
      "caUserName": "string",
      "description": "Multi Tenant Branch in South Asia",
      "deviceGroupName": "Multi_Tenant_DeviceGroup1",
      "deviceType": "full-mesh",
      "dnsServer": "string",
      "email": "tenantoperator@yourcompany.com",
      "enableIPv4": true,
      "enableIPv4Dhcp": false,
      "enableIPv6": true,
      "enableIPv6Dhcp": true,
      "enablePPPoE": true,
      "haPairedAssetName": "string",
      "haPairedSiteLocationID": "string",
      "hw-serial-no": "br103.4568-09876",
      "id": "string",
      "isStaging": true,
      "latitude": "37.242286",
      "location": "123 Main Street CA USA 95138",
      "longitude": "-121.730945",
      "model-no": "string",
      "name": "br103",
      "old-hw-serial-no": "br103.-876-765",
      "old-serial-no": "702ebf22-br103.older",
      "organization": "Tenant1",
      "phone-number": "800-800-8000",
      "pppoeAccessConcentrator": "string",
      "pppoePassword": "sdfs987sdf",
      "pppoeServiceName": "string",
      "pppoeUsername": "User1",
      "region": "string",
      "replaced-serial-no": "br103.replace.3486",
      "replacement-status": "IN-PROGRESS",
      "serial-no": "702ebf22-a682-44c8-9abd-00bba7a3728a",
      "site-id": "187",
      "site-name": "br103-2",
      "staging": true,
      "status": "shipped",
      "tag": "abc,def,123",
      "wanMTU": "string",
      "wanVlan": "string",
      "wanv4IpAddress": "string",
      "wanv4gateway": "string",
      "wanv6IpAddress": "string",
      "wanv6gateway": "string"
    },
    {
      "additional-data": [
        {
          "name": "string",
          "value": "string"
        },
        {
          "name": "string",
          "value": "string"
        },
        {
          "name": "string",
          "value": "string"
        },
        {
          "name": "string",
          "value": "string"
        },
        {
          "name": "string",
          "value": "string"
        },
        {
          "name": "string",
          "value": "string"
        },
        {
          "name": "string",
          "value": "string"
        },
        {
          "name": "string",
          "value": "string"
        },
        {
          "name": "string",
          "value": "string"
        }
      ],
      "authType": "psk",
      "bandwidth": 50,
      "branchId": "SDWAN-Branch1@provider-org.com",
      "branchKey": "7CDjtDTvOmrGQEtC",
      "caEmail": "string",
      "caPassword": "string",
      "caUserName": "string",
      "description": "Multi Tenant Branch in South Asia",
      "deviceGroupName": "Multi_Tenant_DeviceGroup1",
      "deviceType": "full-mesh",
      "dnsServer": "string",
      "email": "tenantoperator@yourcompany.com",
      "enableIPv4": true,
      "enableIPv4Dhcp": true,
      "enableIPv6": true,
      "enableIPv6Dhcp": false,
      "enablePPPoE": true,
      "haPairedAssetName": "string",
      "haPairedSiteLocationID": "string",
      "hw-serial-no": "br103.4568-09876",
      "id": "string",
      "isStaging": true,
      "latitude": "37.242286",
      "location": "123 Main Street CA USA 95138",
      "longitude": "-121.730945",
      "model-no": "string",
      "name": "br103",
      "old-hw-serial-no": "br103.-876-765",
      "old-serial-no": "702ebf22-br103.older",
      "organization": "Tenant1",
      "phone-number": "800-800-8000",
      "pppoeAccessConcentrator": "string",
      "pppoePassword": "sdfs987sdf",
      "pppoeServiceName": "string",
      "pppoeUsername": "User1",
      "region": "string",
      "replaced-serial-no": "br103.replace.3486",
      "replacement-status": "IN-PROGRESS",
      "serial-no": "702ebf22-a682-44c8-9abd-00bba7a3728a",
      "site-id": "187",
      "site-name": "br103-2",
      "staging": false,
      "status": "shipped",
      "tag": "abc,def,123",
      "wanMTU": "string",
      "wanVlan": "string",
      "wanv4IpAddress": "string",
      "wanv4gateway": "string",
      "wanv6IpAddress": "string",
      "wanv6gateway": "string"
    },
    {
      "additional-data": [
        {
          "name": "string",
          "value": "string"
        },
        {
          "name": "string",
          "value": "string"
        },
        {
          "name": "string",
          "value": "string"
        },
        {
          "name": "string",
          "value": "string"
        }
      ],
      "authType": "psk",
      "bandwidth": 50,
      "branchId": "SDWAN-Branch1@provider-org.com",
      "branchKey": "7CDjtDTvOmrGQEtC",
      "caEmail": "string",
      "caPassword": "string",
      "caUserName": "string",
      "description": "Multi Tenant Branch in South Asia",
      "deviceGroupName": "Multi_Tenant_DeviceGroup1",
      "deviceType": "full-mesh",
      "dnsServer": "string",
      "email": "tenantoperator@yourcompany.com",
      "enableIPv4": true,
      "enableIPv4Dhcp": true,
      "enableIPv6": true,
      "enableIPv6Dhcp": false,
      "enablePPPoE": true,
      "haPairedAssetName": "string",
      "haPairedSiteLocationID": "string",
      "hw-serial-no": "br103.4568-09876",
      "id": "string",
      "isStaging": true,
      "latitude": "37.242286",
      "location": "123 Main Street CA USA 95138",
      "longitude": "-121.730945",
      "model-no": "string",
      "name": "br103",
      "old-hw-serial-no": "br103.-876-765",
      "old-serial-no": "702ebf22-br103.older",
      "organization": "Tenant1",
      "phone-number": "800-800-8000",
      "pppoeAccessConcentrator": "string",
      "pppoePassword": "sdfs987sdf",
      "pppoeServiceName": "string",
      "pppoeUsername": "User1",
      "region": "string",
      "replaced-serial-no": "br103.replace.3486",
      "replacement-status": "IN-PROGRESS",
      "serial-no": "702ebf22-a682-44c8-9abd-00bba7a3728a",
      "site-id": "187",
      "site-name": "br103-2",
      "staging": false,
      "status": "shipped",
      "tag": "abc,def,123",
      "wanMTU": "string",
      "wanVlan": "string",
      "wanv4IpAddress": "string",
      "wanv4gateway": "string",
      "wanv6IpAddress": "string",
      "wanv6gateway": "string"
    }
  ],
  "totalCount": 4
}